[INFO] Scanning for projects...
[INFO]                                                                         
[INFO] ------------------------------------------------------------------------
[INFO] Building Joda-Time 2.8.1
[INFO] ------------------------------------------------------------------------
[INFO] 
[INFO] --- maven-resources-plugin:2.7:resources (default-resources) @ joda-time ---
[INFO] Using 'UTF-8' encoding to copy filtered resources.
[INFO] Copying 2 resources to META-INF
[INFO] Copying 10 resources
[INFO] 
[INFO] --- maven-compiler-plugin:3.3:compile (default-compile) @ joda-time ---
[INFO] Changes detected - recompiling the module!
[INFO] Compiling 166 source files to /home/perham/Study/LittleDarwin/Cases/joda-time-2.8.1/target/classes
[INFO] 
[INFO] --- exec-maven-plugin:1.4.0:java (compile-tzdb) @ joda-time ---
Writing zoneinfo files
Writing ZoneInfoMap
[INFO] 
[INFO] --- maven-resources-plugin:2.7:testResources (default-testResources) @ joda-time ---
[INFO] Using 'UTF-8' encoding to copy filtered resources.
[INFO] Copying 34 resources
[INFO] 
[INFO] --- maven-compiler-plugin:3.3:testCompile (default-testCompile) @ joda-time ---
[INFO] Nothing to compile - all classes are up to date
[INFO] 
[INFO] --- maven-surefire-plugin:2.18.1:test (default-test) @ joda-time ---
[INFO] Surefire report directory: /home/perham/Study/LittleDarwin/Cases/joda-time-2.8.1/target/surefire-reports

-------------------------------------------------------
 T E S T S
-------------------------------------------------------
Running org.joda.time.TestAllPackages

TestBuddhistChronology.testCalendar

TestCopticChronology.testCalendar

TestEthiopicChronology.testCalendar

TestIslamicChronology.testCalendar

Testing Gregorian chronology over 1000 iterations
100% complete (i=1000)

Testing Julian chronology over 1000 iterations
100% complete (i=1000)
Writing zoneinfo files
Writing ZoneInfoMap
Tests run: 4157, Failures: 11, Errors: 46, Skipped: 0, Time elapsed: 5.506 sec <<< FAILURE! - in org.joda.time.TestAllPackages
testParse_formatter(org.joda.time.TestInstant_Constructors)  Time elapsed: 0.007 sec  <<< FAILURE!
junit.framework.AssertionFailedError: expected:<2010-06-30T11:00:00.000Z> but was:<2010-01-29T23:00:00.000Z>
	at junit.framework.Assert.fail(Assert.java:47)
	at junit.framework.Assert.failNotEquals(Assert.java:280)
	at junit.framework.Assert.assertEquals(Assert.java:64)
	at junit.framework.Assert.assertEquals(Assert.java:71)
	at org.joda.time.TestInstant_Constructors.testParse_formatter(TestInstant_Constructors.java:106)

testParse_formatter(org.joda.time.TestDateTime_Constructors)  Time elapsed: 0 sec  <<< FAILURE!
junit.framework.AssertionFailedError: expected:<2010-06-30T13:00:00.000+02:00> but was:<2010-01-30T00:00:00.000+01:00>
	at junit.framework.Assert.fail(Assert.java:47)
	at junit.framework.Assert.failNotEquals(Assert.java:280)
	at junit.framework.Assert.assertEquals(Assert.java:64)
	at junit.framework.Assert.assertEquals(Assert.java:71)
	at org.joda.time.TestDateTime_Constructors.testParse_formatter(TestDateTime_Constructors.java:178)

testParse_formatter(org.joda.time.TestMutableDateTime_Constructors)  Time elapsed: 0 sec  <<< FAILURE!
junit.framework.AssertionFailedError: expected:<2010-06-30T13:00:00.000+02:00> but was:<2010-01-30T00:00:00.000+01:00>
	at junit.framework.Assert.fail(Assert.java:47)
	at junit.framework.Assert.failNotEquals(Assert.java:280)
	at junit.framework.Assert.assertEquals(Assert.java:64)
	at junit.framework.Assert.assertEquals(Assert.java:71)
	at org.joda.time.TestMutableDateTime_Constructors.testParse_formatter(TestMutableDateTime_Constructors.java:163)

testParse_formatter(org.joda.time.TestDateMidnight_Constructors)  Time elapsed: 0.001 sec  <<< FAILURE!
junit.framework.AssertionFailedError: expected:<2010-06-30T00:00:00.000+01:00> but was:<2010-01-30T00:00:00.000Z>
	at junit.framework.Assert.fail(Assert.java:47)
	at junit.framework.Assert.failNotEquals(Assert.java:280)
	at junit.framework.Assert.assertEquals(Assert.java:64)
	at junit.framework.Assert.assertEquals(Assert.java:71)
	at org.joda.time.TestDateMidnight_Constructors.testParse_formatter(TestDateMidnight_Constructors.java:179)

testParse_formatter(org.joda.time.TestLocalDateTime_Constructors)  Time elapsed: 0.001 sec  <<< FAILURE!
junit.framework.AssertionFailedError: expected:<2010-06-30T13:00:00.000> but was:<2010-01-30T00:00:00.000>
	at junit.framework.Assert.fail(Assert.java:47)
	at junit.framework.Assert.failNotEquals(Assert.java:280)
	at junit.framework.Assert.assertEquals(Assert.java:64)
	at junit.framework.Assert.assertEquals(Assert.java:71)
	at org.joda.time.TestLocalDateTime_Constructors.testParse_formatter(TestLocalDateTime_Constructors.java:101)

testParse_formatter(org.joda.time.TestLocalDate_Constructors)  Time elapsed: 0.001 sec  <<< FAILURE!
junit.framework.AssertionFailedError: expected:<2010-06-30> but was:<2010-01-30>
	at junit.framework.Assert.fail(Assert.java:47)
	at junit.framework.Assert.failNotEquals(Assert.java:280)
	at junit.framework.Assert.assertEquals(Assert.java:64)
	at junit.framework.Assert.assertEquals(Assert.java:71)
	at org.joda.time.TestLocalDate_Constructors.testParse_formatter(TestLocalDate_Constructors.java:93)

testParse_noFormatter(org.joda.time.TestMonthDay_Constructors)  Time elapsed: 0.002 sec  <<< ERROR!
java.lang.ArrayIndexOutOfBoundsException: 8
	at org.joda.time.format.DateTimeParserBucket.sort(DateTimeParserBucket.java:126)
	at org.joda.time.format.DateTimeParserBucket.computeMillis(DateTimeParserBucket.java:97)
	at org.joda.time.format.DateTimeParserBucket.computeMillis(DateTimeParserBucket.java:102)
	at org.joda.time.format.DateTimeParserBucket.computeMillis(DateTimeParserBucket.java:102)
	at org.joda.time.format.DateTimeParserBucket.computeMillis(DateTimeParserBucket.java:102)
	at org.joda.time.format.DateTimeParserBucket.computeMillis(DateTimeParserBucket.java:102)
	at org.joda.time.format.DateTimeParserBucket.computeMillis(DateTimeParserBucket.java:102)
	at org.joda.time.format.DateTimeParserBucket.computeMillis(DateTimeParserBucket.java:102)
	at org.joda.time.format.DateTimeParserBucket.computeMillis(DateTimeParserBucket.java:92)
	at org.joda.time.format.DateTimeFormatter.parseLocalDateTime(DateTimeFormatter.java:841)
	at org.joda.time.format.DateTimeFormatter.parseLocalDate(DateTimeFormatter.java:798)
	at org.joda.time.MonthDay.parse(MonthDay.java:160)
	at org.joda.time.MonthDay.parse(MonthDay.java:149)
	at org.joda.time.TestMonthDay_Constructors.testParse_noFormatter(TestMonthDay_Constructors.java:82)

testParse_formatter(org.joda.time.TestMonthDay_Constructors)  Time elapsed: 0.001 sec  <<< FAILURE!
junit.framework.AssertionFailedError: expected:<--06-30> but was:<--01-30>
	at junit.framework.Assert.fail(Assert.java:47)
	at junit.framework.Assert.failNotEquals(Assert.java:280)
	at junit.framework.Assert.assertEquals(Assert.java:64)
	at junit.framework.Assert.assertEquals(Assert.java:71)
	at org.joda.time.TestMonthDay_Constructors.testParse_formatter(TestMonthDay_Constructors.java:90)

testMonthDay(org.joda.time.TestStringConvert)  Time elapsed: 0.001 sec  <<< ERROR!
java.lang.ArrayIndexOutOfBoundsException: 8
	at org.joda.time.format.DateTimeParserBucket.sort(DateTimeParserBucket.java:126)
	at org.joda.time.format.DateTimeParserBucket.computeMillis(DateTimeParserBucket.java:97)
	at org.joda.time.format.DateTimeParserBucket.computeMillis(DateTimeParserBucket.java:102)
	at org.joda.time.format.DateTimeParserBucket.computeMillis(DateTimeParserBucket.java:102)
	at org.joda.time.format.DateTimeParserBucket.computeMillis(DateTimeParserBucket.java:102)
	at org.joda.time.format.DateTimeParserBucket.computeMillis(DateTimeParserBucket.java:102)
	at org.joda.time.format.DateTimeParserBucket.computeMillis(DateTimeParserBucket.java:102)
	at org.joda.time.format.DateTimeParserBucket.computeMillis(DateTimeParserBucket.java:102)
	at org.joda.time.format.DateTimeParserBucket.computeMillis(DateTimeParserBucket.java:92)
	at org.joda.time.format.DateTimeFormatter.parseLocalDateTime(DateTimeFormatter.java:841)
	at org.joda.time.format.DateTimeFormatter.parseLocalDate(DateTimeFormatter.java:798)
	at org.joda.time.MonthDay.parse(MonthDay.java:160)
	at org.joda.time.MonthDay.parse(MonthDay.java:149)
	at sun.reflect.NativeMethodAccessorImpl.invoke0(Native Method)
	at sun.reflect.NativeMethodAccessorImpl.invoke(NativeMethodAccessorImpl.java:57)
	at sun.reflect.DelegatingMethodAccessorImpl.invoke(DelegatingMethodAccessorImpl.java:43)
	at java.lang.reflect.Method.invoke(Method.java:606)
	at org.joda.convert.MethodsStringConverter.convertFromString(MethodsStringConverter.java:70)
	at org.joda.convert.StringConvert.convertFromString(StringConvert.java:163)
	at org.joda.time.TestStringConvert.testMonthDay(TestStringConvert.java:106)

testMonthDay_leapDay(org.joda.time.TestStringConvert)  Time elapsed: 0.001 sec  <<< ERROR!
java.lang.ArrayIndexOutOfBoundsException: 8
	at org.joda.time.format.DateTimeParserBucket.sort(DateTimeParserBucket.java:126)
	at org.joda.time.format.DateTimeParserBucket.computeMillis(DateTimeParserBucket.java:97)
	at org.joda.time.format.DateTimeParserBucket.computeMillis(DateTimeParserBucket.java:102)
	at org.joda.time.format.DateTimeParserBucket.computeMillis(DateTimeParserBucket.java:102)
	at org.joda.time.format.DateTimeParserBucket.computeMillis(DateTimeParserBucket.java:102)
	at org.joda.time.format.DateTimeParserBucket.computeMillis(DateTimeParserBucket.java:102)
	at org.joda.time.format.DateTimeParserBucket.computeMillis(DateTimeParserBucket.java:102)
	at org.joda.time.format.DateTimeParserBucket.computeMillis(DateTimeParserBucket.java:102)
	at org.joda.time.format.DateTimeParserBucket.computeMillis(DateTimeParserBucket.java:92)
	at org.joda.time.format.DateTimeFormatter.parseLocalDateTime(DateTimeFormatter.java:841)
	at org.joda.time.format.DateTimeFormatter.parseLocalDate(DateTimeFormatter.java:798)
	at org.joda.time.MonthDay.parse(MonthDay.java:160)
	at org.joda.time.MonthDay.parse(MonthDay.java:149)
	at sun.reflect.NativeMethodAccessorImpl.invoke0(Native Method)
	at sun.reflect.NativeMethodAccessorImpl.invoke(NativeMethodAccessorImpl.java:57)
	at sun.reflect.DelegatingMethodAccessorImpl.invoke(DelegatingMethodAccessorImpl.java:43)
	at java.lang.reflect.Method.invoke(Method.java:606)
	at org.joda.convert.MethodsStringConverter.convertFromString(MethodsStringConverter.java:70)
	at org.joda.convert.StringConvert.convertFromString(StringConvert.java:163)
	at org.joda.time.TestStringConvert.testMonthDay_leapDay(TestStringConvert.java:113)

testPrinterParserMethods(org.joda.time.format.TestDateTimeFormatter)  Time elapsed: 0.003 sec  <<< ERROR!
java.lang.ArrayIndexOutOfBoundsException: 8
	at org.joda.time.format.DateTimeParserBucket.sort(DateTimeParserBucket.java:126)
	at org.joda.time.format.DateTimeParserBucket.computeMillis(DateTimeParserBucket.java:97)
	at org.joda.time.format.DateTimeParserBucket.computeMillis(DateTimeParserBucket.java:102)
	at org.joda.time.format.DateTimeParserBucket.computeMillis(DateTimeParserBucket.java:92)
	at org.joda.time.format.DateTimeFormatter.parseDateTime(DateTimeFormatter.java:882)
	at org.joda.time.format.TestDateTimeFormatter.testPrinterParserMethods(TestDateTimeFormatter.java:338)

testParseLocalDate_yearOfEra(org.joda.time.format.TestDateTimeFormatter)  Time elapsed: 0.001 sec  <<< FAILURE!
junit.framework.AssertionFailedError: expected:<-2005-10-01> but was:<2005-10-01>
	at junit.framework.Assert.fail(Assert.java:47)
	at junit.framework.Assert.failNotEquals(Assert.java:280)
	at junit.framework.Assert.assertEquals(Assert.java:64)
	at junit.framework.Assert.assertEquals(Assert.java:71)
	at org.joda.time.format.TestDateTimeFormatter.testParseLocalDate_yearOfEra(TestDateTimeFormatter.java:388)

testParseLocalDate_monthDay_feb29(org.joda.time.format.TestDateTimeFormatter)  Time elapsed: 0.001 sec  <<< ERROR!
java.lang.ArrayIndexOutOfBoundsException: 8
	at org.joda.time.format.DateTimeParserBucket.sort(DateTimeParserBucket.java:126)
	at org.joda.time.format.DateTimeParserBucket.computeMillis(DateTimeParserBucket.java:97)
	at org.joda.time.format.DateTimeParserBucket.computeMillis(DateTimeParserBucket.java:102)
	at org.joda.time.format.DateTimeParserBucket.computeMillis(DateTimeParserBucket.java:102)
	at org.joda.time.format.DateTimeParserBucket.computeMillis(DateTimeParserBucket.java:102)
	at org.joda.time.format.DateTimeParserBucket.computeMillis(DateTimeParserBucket.java:102)
	at org.joda.time.format.DateTimeParserBucket.computeMillis(DateTimeParserBucket.java:102)
	at org.joda.time.format.DateTimeParserBucket.computeMillis(DateTimeParserBucket.java:102)
	at org.joda.time.format.DateTimeParserBucket.computeMillis(DateTimeParserBucket.java:92)
	at org.joda.time.format.DateTimeFormatter.parseLocalDateTime(DateTimeFormatter.java:841)
	at org.joda.time.format.DateTimeFormatter.parseLocalDate(DateTimeFormatter.java:798)
	at org.joda.time.format.TestDateTimeFormatter.testParseLocalDate_monthDay_feb29(TestDateTimeFormatter.java:411)

testParseInto_simple_precedence(org.joda.time.format.TestDateTimeFormatter)  Time elapsed: 0.001 sec  <<< ERROR!
java.lang.ArrayIndexOutOfBoundsException: 8
	at org.joda.time.format.DateTimeParserBucket.sort(DateTimeParserBucket.java:126)
	at org.joda.time.format.DateTimeParserBucket.computeMillis(DateTimeParserBucket.java:97)
	at org.joda.time.format.DateTimeParserBucket.computeMillis(DateTimeParserBucket.java:102)
	at org.joda.time.format.DateTimeParserBucket.computeMillis(DateTimeParserBucket.java:92)
	at org.joda.time.format.DateTimeFormatter.parseInto(DateTimeFormatter.java:749)
	at org.joda.time.format.TestDateTimeFormatter.testParseInto_simple_precedence(TestDateTimeFormatter.java:815)

testParseInto_monthOnly(org.joda.time.format.TestDateTimeFormatter)  Time elapsed: 0.001 sec  <<< ERROR!
java.lang.ArrayIndexOutOfBoundsException: 8
	at org.joda.time.format.DateTimeParserBucket.sort(DateTimeParserBucket.java:126)
	at org.joda.time.format.DateTimeParserBucket.computeMillis(DateTimeParserBucket.java:97)
	at org.joda.time.format.DateTimeParserBucket.computeMillis(DateTimeParserBucket.java:102)
	at org.joda.time.format.DateTimeParserBucket.computeMillis(DateTimeParserBucket.java:102)
	at org.joda.time.format.DateTimeParserBucket.computeMillis(DateTimeParserBucket.java:102)
	at org.joda.time.format.DateTimeParserBucket.computeMillis(DateTimeParserBucket.java:102)
	at org.joda.time.format.DateTimeParserBucket.computeMillis(DateTimeParserBucket.java:102)
	at org.joda.time.format.DateTimeParserBucket.computeMillis(DateTimeParserBucket.java:102)
	at org.joda.time.format.DateTimeParserBucket.computeMillis(DateTimeParserBucket.java:102)
	at org.joda.time.format.DateTimeParserBucket.computeMillis(DateTimeParserBucket.java:92)
	at org.joda.time.format.DateTimeFormatter.parseInto(DateTimeFormatter.java:749)
	at org.joda.time.format.TestDateTimeFormatter.testParseInto_monthOnly(TestDateTimeFormatter.java:869)

testParseInto_monthOnly_baseStartYear(org.joda.time.format.TestDateTimeFormatter)  Time elapsed: 0.001 sec  <<< ERROR!
java.lang.ArrayIndexOutOfBoundsException: 8
	at org.joda.time.format.DateTimeParserBucket.sort(DateTimeParserBucket.java:126)
	at org.joda.time.format.DateTimeParserBucket.computeMillis(DateTimeParserBucket.java:97)
	at org.joda.time.format.DateTimeParserBucket.computeMillis(DateTimeParserBucket.java:102)
	at org.joda.time.format.DateTimeParserBucket.computeMillis(DateTimeParserBucket.java:102)
	at org.joda.time.format.DateTimeParserBucket.computeMillis(DateTimeParserBucket.java:102)
	at org.joda.time.format.DateTimeParserBucket.computeMillis(DateTimeParserBucket.java:102)
	at org.joda.time.format.DateTimeParserBucket.computeMillis(DateTimeParserBucket.java:102)
	at org.joda.time.format.DateTimeParserBucket.computeMillis(DateTimeParserBucket.java:102)
	at org.joda.time.format.DateTimeParserBucket.computeMillis(DateTimeParserBucket.java:102)
	at org.joda.time.format.DateTimeParserBucket.computeMillis(DateTimeParserBucket.java:92)
	at org.joda.time.format.DateTimeFormatter.parseInto(DateTimeFormatter.java:749)
	at org.joda.time.format.TestDateTimeFormatter.testParseInto_monthOnly_baseStartYear(TestDateTimeFormatter.java:876)

testParseInto_monthOnly_parseStartYear(org.joda.time.format.TestDateTimeFormatter)  Time elapsed: 0.001 sec  <<< ERROR!
java.lang.ArrayIndexOutOfBoundsException: 8
	at org.joda.time.format.DateTimeParserBucket.sort(DateTimeParserBucket.java:126)
	at org.joda.time.format.DateTimeParserBucket.computeMillis(DateTimeParserBucket.java:97)
	at org.joda.time.format.DateTimeParserBucket.computeMillis(DateTimeParserBucket.java:102)
	at org.joda.time.format.DateTimeParserBucket.computeMillis(DateTimeParserBucket.java:102)
	at org.joda.time.format.DateTimeParserBucket.computeMillis(DateTimeParserBucket.java:102)
	at org.joda.time.format.DateTimeParserBucket.computeMillis(DateTimeParserBucket.java:102)
	at org.joda.time.format.DateTimeParserBucket.computeMillis(DateTimeParserBucket.java:102)
	at org.joda.time.format.DateTimeParserBucket.computeMillis(DateTimeParserBucket.java:102)
	at org.joda.time.format.DateTimeParserBucket.computeMillis(DateTimeParserBucket.java:102)
	at org.joda.time.format.DateTimeParserBucket.computeMillis(DateTimeParserBucket.java:92)
	at org.joda.time.format.DateTimeFormatter.parseInto(DateTimeFormatter.java:749)
	at org.joda.time.format.TestDateTimeFormatter.testParseInto_monthOnly_parseStartYear(TestDateTimeFormatter.java:883)

testParseInto_monthOnly_baseEndYear(org.joda.time.format.TestDateTimeFormatter)  Time elapsed: 0.002 sec  <<< ERROR!
java.lang.ArrayIndexOutOfBoundsException: 8
	at org.joda.time.format.DateTimeParserBucket.sort(DateTimeParserBucket.java:126)
	at org.joda.time.format.DateTimeParserBucket.computeMillis(DateTimeParserBucket.java:97)
	at org.joda.time.format.DateTimeParserBucket.computeMillis(DateTimeParserBucket.java:102)
	at org.joda.time.format.DateTimeParserBucket.computeMillis(DateTimeParserBucket.java:102)
	at org.joda.time.format.DateTimeParserBucket.computeMillis(DateTimeParserBucket.java:102)
	at org.joda.time.format.DateTimeParserBucket.computeMillis(DateTimeParserBucket.java:102)
	at org.joda.time.format.DateTimeParserBucket.computeMillis(DateTimeParserBucket.java:102)
	at org.joda.time.format.DateTimeParserBucket.computeMillis(DateTimeParserBucket.java:102)
	at org.joda.time.format.DateTimeParserBucket.computeMillis(DateTimeParserBucket.java:102)
	at org.joda.time.format.DateTimeParserBucket.computeMillis(DateTimeParserBucket.java:92)
	at org.joda.time.format.DateTimeFormatter.parseInto(DateTimeFormatter.java:749)
	at org.joda.time.format.TestDateTimeFormatter.testParseInto_monthOnly_baseEndYear(TestDateTimeFormatter.java:890)

testParseInto_monthOnly_parseEndYear(org.joda.time.format.TestDateTimeFormatter)  Time elapsed: 0 sec  <<< ERROR!
java.lang.ArrayIndexOutOfBoundsException: 8
	at org.joda.time.format.DateTimeParserBucket.sort(DateTimeParserBucket.java:126)
	at org.joda.time.format.DateTimeParserBucket.computeMillis(DateTimeParserBucket.java:97)
	at org.joda.time.format.DateTimeParserBucket.computeMillis(DateTimeParserBucket.java:102)
	at org.joda.time.format.DateTimeParserBucket.computeMillis(DateTimeParserBucket.java:102)
	at org.joda.time.format.DateTimeParserBucket.computeMillis(DateTimeParserBucket.java:102)
	at org.joda.time.format.DateTimeParserBucket.computeMillis(DateTimeParserBucket.java:102)
	at org.joda.time.format.DateTimeParserBucket.computeMillis(DateTimeParserBucket.java:102)
	at org.joda.time.format.DateTimeParserBucket.computeMillis(DateTimeParserBucket.java:102)
	at org.joda.time.format.DateTimeParserBucket.computeMillis(DateTimeParserBucket.java:102)
	at org.joda.time.format.DateTimeParserBucket.computeMillis(DateTimeParserBucket.java:92)
	at org.joda.time.format.DateTimeFormatter.parseInto(DateTimeFormatter.java:749)
	at org.joda.time.format.TestDateTimeFormatter.testParseInto_monthOnly_parseEndYear(TestDateTimeFormatter.java:897)

testParseInto_monthDay_feb29(org.joda.time.format.TestDateTimeFormatter)  Time elapsed: 0 sec  <<< ERROR!
java.lang.ArrayIndexOutOfBoundsException: 8
	at org.joda.time.format.DateTimeParserBucket.sort(DateTimeParserBucket.java:126)
	at org.joda.time.format.DateTimeParserBucket.computeMillis(DateTimeParserBucket.java:97)
	at org.joda.time.format.DateTimeParserBucket.computeMillis(DateTimeParserBucket.java:102)
	at org.joda.time.format.DateTimeParserBucket.computeMillis(DateTimeParserBucket.java:102)
	at org.joda.time.format.DateTimeParserBucket.computeMillis(DateTimeParserBucket.java:102)
	at org.joda.time.format.DateTimeParserBucket.computeMillis(DateTimeParserBucket.java:102)
	at org.joda.time.format.DateTimeParserBucket.computeMillis(DateTimeParserBucket.java:102)
	at org.joda.time.format.DateTimeParserBucket.computeMillis(DateTimeParserBucket.java:102)
	at org.joda.time.format.DateTimeParserBucket.computeMillis(DateTimeParserBucket.java:92)
	at org.joda.time.format.DateTimeFormatter.parseInto(DateTimeFormatter.java:749)
	at org.joda.time.format.TestDateTimeFormatter.testParseInto_monthDay_feb29(TestDateTimeFormatter.java:904)

testParseInto_monthDay_feb29_startOfYear(org.joda.time.format.TestDateTimeFormatter)  Time elapsed: 0.001 sec  <<< ERROR!
java.lang.ArrayIndexOutOfBoundsException: 8
	at org.joda.time.format.DateTimeParserBucket.sort(DateTimeParserBucket.java:126)
	at org.joda.time.format.DateTimeParserBucket.computeMillis(DateTimeParserBucket.java:97)
	at org.joda.time.format.DateTimeParserBucket.computeMillis(DateTimeParserBucket.java:102)
	at org.joda.time.format.DateTimeParserBucket.computeMillis(DateTimeParserBucket.java:102)
	at org.joda.time.format.DateTimeParserBucket.computeMillis(DateTimeParserBucket.java:102)
	at org.joda.time.format.DateTimeParserBucket.computeMillis(DateTimeParserBucket.java:102)
	at org.joda.time.format.DateTimeParserBucket.computeMillis(DateTimeParserBucket.java:102)
	at org.joda.time.format.DateTimeParserBucket.computeMillis(DateTimeParserBucket.java:102)
	at org.joda.time.format.DateTimeParserBucket.computeMillis(DateTimeParserBucket.java:92)
	at org.joda.time.format.DateTimeFormatter.parseInto(DateTimeFormatter.java:749)
	at org.joda.time.format.TestDateTimeFormatter.testParseInto_monthDay_feb29_startOfYear(TestDateTimeFormatter.java:911)

testParseInto_monthDay_feb29_OfYear(org.joda.time.format.TestDateTimeFormatter)  Time elapsed: 0 sec  <<< ERROR!
java.lang.ArrayIndexOutOfBoundsException: 8
	at org.joda.time.format.DateTimeParserBucket.sort(DateTimeParserBucket.java:126)
	at org.joda.time.format.DateTimeParserBucket.computeMillis(DateTimeParserBucket.java:97)
	at org.joda.time.format.DateTimeParserBucket.computeMillis(DateTimeParserBucket.java:102)
	at org.joda.time.format.DateTimeParserBucket.computeMillis(DateTimeParserBucket.java:102)
	at org.joda.time.format.DateTimeParserBucket.computeMillis(DateTimeParserBucket.java:102)
	at org.joda.time.format.DateTimeParserBucket.computeMillis(DateTimeParserBucket.java:102)
	at org.joda.time.format.DateTimeParserBucket.computeMillis(DateTimeParserBucket.java:102)
	at org.joda.time.format.DateTimeParserBucket.computeMillis(DateTimeParserBucket.java:102)
	at org.joda.time.format.DateTimeParserBucket.computeMillis(DateTimeParserBucket.java:92)
	at org.joda.time.format.DateTimeFormatter.parseInto(DateTimeFormatter.java:749)
	at org.joda.time.format.TestDateTimeFormatter.testParseInto_monthDay_feb29_OfYear(TestDateTimeFormatter.java:918)

testParseInto_monthDay_feb29_newYork(org.joda.time.format.TestDateTimeFormatter)  Time elapsed: 0.001 sec  <<< ERROR!
java.lang.ArrayIndexOutOfBoundsException: 8
	at org.joda.time.format.DateTimeParserBucket.sort(DateTimeParserBucket.java:126)
	at org.joda.time.format.DateTimeParserBucket.computeMillis(DateTimeParserBucket.java:97)
	at org.joda.time.format.DateTimeParserBucket.computeMillis(DateTimeParserBucket.java:102)
	at org.joda.time.format.DateTimeParserBucket.computeMillis(DateTimeParserBucket.java:102)
	at org.joda.time.format.DateTimeParserBucket.computeMillis(DateTimeParserBucket.java:102)
	at org.joda.time.format.DateTimeParserBucket.computeMillis(DateTimeParserBucket.java:102)
	at org.joda.time.format.DateTimeParserBucket.computeMillis(DateTimeParserBucket.java:102)
	at org.joda.time.format.DateTimeParserBucket.computeMillis(DateTimeParserBucket.java:102)
	at org.joda.time.format.DateTimeParserBucket.computeMillis(DateTimeParserBucket.java:92)
	at org.joda.time.format.DateTimeFormatter.parseInto(DateTimeFormatter.java:749)
	at org.joda.time.format.TestDateTimeFormatter.testParseInto_monthDay_feb29_newYork(TestDateTimeFormatter.java:925)

testParseInto_monthDay_feb29_newYork_startOfYear(org.joda.time.format.TestDateTimeFormatter)  Time elapsed: 0.001 sec  <<< ERROR!
java.lang.ArrayIndexOutOfBoundsException: 8
	at org.joda.time.format.DateTimeParserBucket.sort(DateTimeParserBucket.java:126)
	at org.joda.time.format.DateTimeParserBucket.computeMillis(DateTimeParserBucket.java:97)
	at org.joda.time.format.DateTimeParserBucket.computeMillis(DateTimeParserBucket.java:102)
	at org.joda.time.format.DateTimeParserBucket.computeMillis(DateTimeParserBucket.java:102)
	at org.joda.time.format.DateTimeParserBucket.computeMillis(DateTimeParserBucket.java:102)
	at org.joda.time.format.DateTimeParserBucket.computeMillis(DateTimeParserBucket.java:102)
	at org.joda.time.format.DateTimeParserBucket.computeMillis(DateTimeParserBucket.java:102)
	at org.joda.time.format.DateTimeParserBucket.computeMillis(DateTimeParserBucket.java:102)
	at org.joda.time.format.DateTimeParserBucket.computeMillis(DateTimeParserBucket.java:92)
	at org.joda.time.format.DateTimeFormatter.parseInto(DateTimeFormatter.java:749)
	at org.joda.time.format.TestDateTimeFormatter.testParseInto_monthDay_feb29_newYork_startOfYear(TestDateTimeFormatter.java:932)

testParseInto_monthDay_feb29_newYork_endOfYear(org.joda.time.format.TestDateTimeFormatter)  Time elapsed: 0 sec  <<< ERROR!
java.lang.ArrayIndexOutOfBoundsException: 8
	at org.joda.time.format.DateTimeParserBucket.sort(DateTimeParserBucket.java:126)
	at org.joda.time.format.DateTimeParserBucket.computeMillis(DateTimeParserBucket.java:97)
	at org.joda.time.format.DateTimeParserBucket.computeMillis(DateTimeParserBucket.java:102)
	at org.joda.time.format.DateTimeParserBucket.computeMillis(DateTimeParserBucket.java:102)
	at org.joda.time.format.DateTimeParserBucket.computeMillis(DateTimeParserBucket.java:102)
	at org.joda.time.format.DateTimeParserBucket.computeMillis(DateTimeParserBucket.java:102)
	at org.joda.time.format.DateTimeParserBucket.computeMillis(DateTimeParserBucket.java:102)
	at org.joda.time.format.DateTimeParserBucket.computeMillis(DateTimeParserBucket.java:102)
	at org.joda.time.format.DateTimeParserBucket.computeMillis(DateTimeParserBucket.java:92)
	at org.joda.time.format.DateTimeFormatter.parseInto(DateTimeFormatter.java:749)
	at org.joda.time.format.TestDateTimeFormatter.testParseInto_monthDay_feb29_newYork_endOfYear(TestDateTimeFormatter.java:939)

testParseInto_monthDay_feb29_tokyo(org.joda.time.format.TestDateTimeFormatter)  Time elapsed: 0.001 sec  <<< ERROR!
java.lang.ArrayIndexOutOfBoundsException: 8
	at org.joda.time.format.DateTimeParserBucket.sort(DateTimeParserBucket.java:126)
	at org.joda.time.format.DateTimeParserBucket.computeMillis(DateTimeParserBucket.java:97)
	at org.joda.time.format.DateTimeParserBucket.computeMillis(DateTimeParserBucket.java:102)
	at org.joda.time.format.DateTimeParserBucket.computeMillis(DateTimeParserBucket.java:102)
	at org.joda.time.format.DateTimeParserBucket.computeMillis(DateTimeParserBucket.java:102)
	at org.joda.time.format.DateTimeParserBucket.computeMillis(DateTimeParserBucket.java:102)
	at org.joda.time.format.DateTimeParserBucket.computeMillis(DateTimeParserBucket.java:102)
	at org.joda.time.format.DateTimeParserBucket.computeMillis(DateTimeParserBucket.java:102)
	at org.joda.time.format.DateTimeParserBucket.computeMillis(DateTimeParserBucket.java:92)
	at org.joda.time.format.DateTimeFormatter.parseInto(DateTimeFormatter.java:749)
	at org.joda.time.format.TestDateTimeFormatter.testParseInto_monthDay_feb29_tokyo(TestDateTimeFormatter.java:946)

testParseInto_monthDay_feb29_tokyo_startOfYear(org.joda.time.format.TestDateTimeFormatter)  Time elapsed: 0.001 sec  <<< ERROR!
java.lang.ArrayIndexOutOfBoundsException: 8
	at org.joda.time.format.DateTimeParserBucket.sort(DateTimeParserBucket.java:126)
	at org.joda.time.format.DateTimeParserBucket.computeMillis(DateTimeParserBucket.java:97)
	at org.joda.time.format.DateTimeParserBucket.computeMillis(DateTimeParserBucket.java:102)
	at org.joda.time.format.DateTimeParserBucket.computeMillis(DateTimeParserBucket.java:102)
	at org.joda.time.format.DateTimeParserBucket.computeMillis(DateTimeParserBucket.java:102)
	at org.joda.time.format.DateTimeParserBucket.computeMillis(DateTimeParserBucket.java:102)
	at org.joda.time.format.DateTimeParserBucket.computeMillis(DateTimeParserBucket.java:102)
	at org.joda.time.format.DateTimeParserBucket.computeMillis(DateTimeParserBucket.java:102)
	at org.joda.time.format.DateTimeParserBucket.computeMillis(DateTimeParserBucket.java:92)
	at org.joda.time.format.DateTimeFormatter.parseInto(DateTimeFormatter.java:749)
	at org.joda.time.format.TestDateTimeFormatter.testParseInto_monthDay_feb29_tokyo_startOfYear(TestDateTimeFormatter.java:953)

testParseInto_monthDay_feb29_tokyo_endOfYear(org.joda.time.format.TestDateTimeFormatter)  Time elapsed: 0.001 sec  <<< ERROR!
java.lang.ArrayIndexOutOfBoundsException: 8
	at org.joda.time.format.DateTimeParserBucket.sort(DateTimeParserBucket.java:126)
	at org.joda.time.format.DateTimeParserBucket.computeMillis(DateTimeParserBucket.java:97)
	at org.joda.time.format.DateTimeParserBucket.computeMillis(DateTimeParserBucket.java:102)
	at org.joda.time.format.DateTimeParserBucket.computeMillis(DateTimeParserBucket.java:102)
	at org.joda.time.format.DateTimeParserBucket.computeMillis(DateTimeParserBucket.java:102)
	at org.joda.time.format.DateTimeParserBucket.computeMillis(DateTimeParserBucket.java:102)
	at org.joda.time.format.DateTimeParserBucket.computeMillis(DateTimeParserBucket.java:102)
	at org.joda.time.format.DateTimeParserBucket.computeMillis(DateTimeParserBucket.java:102)
	at org.joda.time.format.DateTimeParserBucket.computeMillis(DateTimeParserBucket.java:92)
	at org.joda.time.format.DateTimeFormatter.parseInto(DateTimeFormatter.java:749)
	at org.joda.time.format.TestDateTimeFormatter.testParseInto_monthDay_feb29_tokyo_endOfYear(TestDateTimeFormatter.java:960)

testParseInto_monthDay_withDefaultYear_feb29(org.joda.time.format.TestDateTimeFormatter)  Time elapsed: 0.001 sec  <<< ERROR!
java.lang.ArrayIndexOutOfBoundsException: 8
	at org.joda.time.format.DateTimeParserBucket.sort(DateTimeParserBucket.java:126)
	at org.joda.time.format.DateTimeParserBucket.computeMillis(DateTimeParserBucket.java:97)
	at org.joda.time.format.DateTimeParserBucket.computeMillis(DateTimeParserBucket.java:102)
	at org.joda.time.format.DateTimeParserBucket.computeMillis(DateTimeParserBucket.java:102)
	at org.joda.time.format.DateTimeParserBucket.computeMillis(DateTimeParserBucket.java:102)
	at org.joda.time.format.DateTimeParserBucket.computeMillis(DateTimeParserBucket.java:102)
	at org.joda.time.format.DateTimeParserBucket.computeMillis(DateTimeParserBucket.java:102)
	at org.joda.time.format.DateTimeParserBucket.computeMillis(DateTimeParserBucket.java:102)
	at org.joda.time.format.DateTimeParserBucket.computeMillis(DateTimeParserBucket.java:92)
	at org.joda.time.format.DateTimeFormatter.parseInto(DateTimeFormatter.java:749)
	at org.joda.time.format.TestDateTimeFormatter.testParseInto_monthDay_withDefaultYear_feb29(TestDateTimeFormatter.java:967)

testParseInto_monthDay_withDefaultYear_feb29_newYork(org.joda.time.format.TestDateTimeFormatter)  Time elapsed: 0.001 sec  <<< ERROR!
java.lang.ArrayIndexOutOfBoundsException: 8
	at org.joda.time.format.DateTimeParserBucket.sort(DateTimeParserBucket.java:126)
	at org.joda.time.format.DateTimeParserBucket.computeMillis(DateTimeParserBucket.java:97)
	at org.joda.time.format.DateTimeParserBucket.computeMillis(DateTimeParserBucket.java:102)
	at org.joda.time.format.DateTimeParserBucket.computeMillis(DateTimeParserBucket.java:102)
	at org.joda.time.format.DateTimeParserBucket.computeMillis(DateTimeParserBucket.java:102)
	at org.joda.time.format.DateTimeParserBucket.computeMillis(DateTimeParserBucket.java:102)
	at org.joda.time.format.DateTimeParserBucket.computeMillis(DateTimeParserBucket.java:102)
	at org.joda.time.format.DateTimeParserBucket.computeMillis(DateTimeParserBucket.java:102)
	at org.joda.time.format.DateTimeParserBucket.computeMillis(DateTimeParserBucket.java:92)
	at org.joda.time.format.DateTimeFormatter.parseInto(DateTimeFormatter.java:749)
	at org.joda.time.format.TestDateTimeFormatter.testParseInto_monthDay_withDefaultYear_feb29_newYork(TestDateTimeFormatter.java:974)

testParseInto_monthDay_withDefaultYear_feb29_newYork_endOfYear(org.joda.time.format.TestDateTimeFormatter)  Time elapsed: 0.001 sec  <<< ERROR!
java.lang.ArrayIndexOutOfBoundsException: 8
	at org.joda.time.format.DateTimeParserBucket.sort(DateTimeParserBucket.java:126)
	at org.joda.time.format.DateTimeParserBucket.computeMillis(DateTimeParserBucket.java:97)
	at org.joda.time.format.DateTimeParserBucket.computeMillis(DateTimeParserBucket.java:102)
	at org.joda.time.format.DateTimeParserBucket.computeMillis(DateTimeParserBucket.java:102)
	at org.joda.time.format.DateTimeParserBucket.computeMillis(DateTimeParserBucket.java:102)
	at org.joda.time.format.DateTimeParserBucket.computeMillis(DateTimeParserBucket.java:102)
	at org.joda.time.format.DateTimeParserBucket.computeMillis(DateTimeParserBucket.java:102)
	at org.joda.time.format.DateTimeParserBucket.computeMillis(DateTimeParserBucket.java:102)
	at org.joda.time.format.DateTimeParserBucket.computeMillis(DateTimeParserBucket.java:92)
	at org.joda.time.format.DateTimeFormatter.parseInto(DateTimeFormatter.java:749)
	at org.joda.time.format.TestDateTimeFormatter.testParseInto_monthDay_withDefaultYear_feb29_newYork_endOfYear(TestDateTimeFormatter.java:981)

testParseLocalDate_monthDay_withDefaultYear_feb29(org.joda.time.format.TestDateTimeFormatter)  Time elapsed: 0.001 sec  <<< ERROR!
java.lang.ArrayIndexOutOfBoundsException: 8
	at org.joda.time.format.DateTimeParserBucket.sort(DateTimeParserBucket.java:126)
	at org.joda.time.format.DateTimeParserBucket.computeMillis(DateTimeParserBucket.java:97)
	at org.joda.time.format.DateTimeParserBucket.computeMillis(DateTimeParserBucket.java:102)
	at org.joda.time.format.DateTimeParserBucket.computeMillis(DateTimeParserBucket.java:102)
	at org.joda.time.format.DateTimeParserBucket.computeMillis(DateTimeParserBucket.java:102)
	at org.joda.time.format.DateTimeParserBucket.computeMillis(DateTimeParserBucket.java:102)
	at org.joda.time.format.DateTimeParserBucket.computeMillis(DateTimeParserBucket.java:102)
	at org.joda.time.format.DateTimeParserBucket.computeMillis(DateTimeParserBucket.java:102)
	at org.joda.time.format.DateTimeParserBucket.computeMillis(DateTimeParserBucket.java:92)
	at org.joda.time.format.DateTimeFormatter.parseLocalDateTime(DateTimeFormatter.java:841)
	at org.joda.time.format.DateTimeFormatter.parseLocalDate(DateTimeFormatter.java:798)
	at org.joda.time.format.TestDateTimeFormatter.testParseLocalDate_monthDay_withDefaultYear_feb29(TestDateTimeFormatter.java:422)

testParseLocalDateTime_monthDay_feb29(org.joda.time.format.TestDateTimeFormatter)  Time elapsed: 0.001 sec  <<< ERROR!
java.lang.ArrayIndexOutOfBoundsException: 8
	at org.joda.time.format.DateTimeParserBucket.sort(DateTimeParserBucket.java:126)
	at org.joda.time.format.DateTimeParserBucket.computeMillis(DateTimeParserBucket.java:97)
	at org.joda.time.format.DateTimeParserBucket.computeMillis(DateTimeParserBucket.java:102)
	at org.joda.time.format.DateTimeParserBucket.computeMillis(DateTimeParserBucket.java:102)
	at org.joda.time.format.DateTimeParserBucket.computeMillis(DateTimeParserBucket.java:102)
	at org.joda.time.format.DateTimeParserBucket.computeMillis(DateTimeParserBucket.java:102)
	at org.joda.time.format.DateTimeParserBucket.computeMillis(DateTimeParserBucket.java:92)
	at org.joda.time.format.DateTimeFormatter.parseLocalDateTime(DateTimeFormatter.java:841)
	at org.joda.time.format.TestDateTimeFormatter.testParseLocalDateTime_monthDay_feb29(TestDateTimeFormatter.java:526)

testParseLocalDateTime_monthDay_withDefaultYear_feb29(org.joda.time.format.TestDateTimeFormatter)  Time elapsed: 0.001 sec  <<< ERROR!
java.lang.ArrayIndexOutOfBoundsException: 8
	at org.joda.time.format.DateTimeParserBucket.sort(DateTimeParserBucket.java:126)
	at org.joda.time.format.DateTimeParserBucket.computeMillis(DateTimeParserBucket.java:97)
	at org.joda.time.format.DateTimeParserBucket.computeMillis(DateTimeParserBucket.java:102)
	at org.joda.time.format.DateTimeParserBucket.computeMillis(DateTimeParserBucket.java:102)
	at org.joda.time.format.DateTimeParserBucket.computeMillis(DateTimeParserBucket.java:102)
	at org.joda.time.format.DateTimeParserBucket.computeMillis(DateTimeParserBucket.java:102)
	at org.joda.time.format.DateTimeParserBucket.computeMillis(DateTimeParserBucket.java:92)
	at org.joda.time.format.DateTimeFormatter.parseLocalDateTime(DateTimeFormatter.java:841)
	at org.joda.time.format.TestDateTimeFormatter.testParseLocalDateTime_monthDay_withDefaultYear_feb29(TestDateTimeFormatter.java:537)

testParseDateTime_simple_precedence(org.joda.time.format.TestDateTimeFormatter)  Time elapsed: 0.001 sec  <<< ERROR!
java.lang.ArrayIndexOutOfBoundsException: 8
	at org.joda.time.format.DateTimeParserBucket.sort(DateTimeParserBucket.java:126)
	at org.joda.time.format.DateTimeParserBucket.computeMillis(DateTimeParserBucket.java:97)
	at org.joda.time.format.DateTimeParserBucket.computeMillis(DateTimeParserBucket.java:102)
	at org.joda.time.format.DateTimeParserBucket.computeMillis(DateTimeParserBucket.java:92)
	at org.joda.time.format.DateTimeFormatter.parseDateTime(DateTimeFormatter.java:882)
	at org.joda.time.format.TestDateTimeFormatter.testParseDateTime_simple_precedence(TestDateTimeFormatter.java:598)

testParseMutableDateTime_simple_precedence(org.joda.time.format.TestDateTimeFormatter)  Time elapsed: 0 sec  <<< ERROR!
java.lang.ArrayIndexOutOfBoundsException: 8
	at org.joda.time.format.DateTimeParserBucket.sort(DateTimeParserBucket.java:126)
	at org.joda.time.format.DateTimeParserBucket.computeMillis(DateTimeParserBucket.java:97)
	at org.joda.time.format.DateTimeParserBucket.computeMillis(DateTimeParserBucket.java:102)
	at org.joda.time.format.DateTimeParserBucket.computeMillis(DateTimeParserBucket.java:92)
	at org.joda.time.format.DateTimeFormatter.parseDateTime(DateTimeFormatter.java:882)
	at org.joda.time.format.TestDateTimeFormatter.testParseMutableDateTime_simple_precedence(TestDateTimeFormatter.java:693)

testParse_pivotYear(org.joda.time.format.TestDateTimeFormat)  Time elapsed: 0.001 sec  <<< ERROR!
java.lang.ArrayIndexOutOfBoundsException: 8
	at org.joda.time.format.DateTimeParserBucket.sort(DateTimeParserBucket.java:126)
	at org.joda.time.format.DateTimeParserBucket.computeMillis(DateTimeParserBucket.java:97)
	at org.joda.time.format.DateTimeParserBucket.computeMillis(DateTimeParserBucket.java:102)
	at org.joda.time.format.DateTimeParserBucket.computeMillis(DateTimeParserBucket.java:102)
	at org.joda.time.format.DateTimeParserBucket.computeMillis(DateTimeParserBucket.java:102)
	at org.joda.time.format.DateTimeParserBucket.computeMillis(DateTimeParserBucket.java:102)
	at org.joda.time.format.DateTimeParserBucket.computeMillis(DateTimeParserBucket.java:102)
	at org.joda.time.format.DateTimeParserBucket.computeMillis(DateTimeParserBucket.java:92)
	at org.joda.time.format.DateTimeFormatter.parseDateTime(DateTimeFormatter.java:882)
	at org.joda.time.format.TestDateTimeFormat.testParse_pivotYear(TestDateTimeFormat.java:869)

testParse_pivotYear_ignored4DigitYear(org.joda.time.format.TestDateTimeFormat)  Time elapsed: 0.001 sec  <<< ERROR!
java.lang.ArrayIndexOutOfBoundsException: 8
	at org.joda.time.format.DateTimeParserBucket.sort(DateTimeParserBucket.java:126)
	at org.joda.time.format.DateTimeParserBucket.computeMillis(DateTimeParserBucket.java:97)
	at org.joda.time.format.DateTimeParserBucket.computeMillis(DateTimeParserBucket.java:102)
	at org.joda.time.format.DateTimeParserBucket.computeMillis(DateTimeParserBucket.java:102)
	at org.joda.time.format.DateTimeParserBucket.computeMillis(DateTimeParserBucket.java:102)
	at org.joda.time.format.DateTimeParserBucket.computeMillis(DateTimeParserBucket.java:102)
	at org.joda.time.format.DateTimeParserBucket.computeMillis(DateTimeParserBucket.java:102)
	at org.joda.time.format.DateTimeParserBucket.computeMillis(DateTimeParserBucket.java:92)
	at org.joda.time.format.DateTimeFormatter.parseDateTime(DateTimeFormatter.java:882)
	at org.joda.time.format.TestDateTimeFormat.testParse_pivotYear_ignored4DigitYear(TestDateTimeFormat.java:882)

testFormatParse_textMonthJanShort_UK(org.joda.time.format.TestDateTimeFormat)  Time elapsed: 0.002 sec  <<< ERROR!
java.lang.ArrayIndexOutOfBoundsException: 8
	at org.joda.time.format.DateTimeParserBucket.sort(DateTimeParserBucket.java:126)
	at org.joda.time.format.DateTimeParserBucket.computeMillis(DateTimeParserBucket.java:97)
	at org.joda.time.format.DateTimeParserBucket.computeMillis(DateTimeParserBucket.java:102)
	at org.joda.time.format.DateTimeParserBucket.computeMillis(DateTimeParserBucket.java:102)
	at org.joda.time.format.DateTimeParserBucket.computeMillis(DateTimeParserBucket.java:102)
	at org.joda.time.format.DateTimeParserBucket.computeMillis(DateTimeParserBucket.java:102)
	at org.joda.time.format.DateTimeParserBucket.computeMillis(DateTimeParserBucket.java:102)
	at org.joda.time.format.DateTimeParserBucket.computeMillis(DateTimeParserBucket.java:92)
	at org.joda.time.format.DateTimeFormatter.parseDateTime(DateTimeFormatter.java:882)
	at org.joda.time.format.TestDateTimeFormat.testFormatParse_textMonthJanShort_UK(TestDateTimeFormat.java:899)

testFormatParse_textMonthJanShortLowerCase_UK(org.joda.time.format.TestDateTimeFormat)  Time elapsed: 0.001 sec  <<< ERROR!
java.lang.ArrayIndexOutOfBoundsException: 8
	at org.joda.time.format.DateTimeParserBucket.sort(DateTimeParserBucket.java:126)
	at org.joda.time.format.DateTimeParserBucket.computeMillis(DateTimeParserBucket.java:97)
	at org.joda.time.format.DateTimeParserBucket.computeMillis(DateTimeParserBucket.java:102)
	at org.joda.time.format.DateTimeParserBucket.computeMillis(DateTimeParserBucket.java:102)
	at org.joda.time.format.DateTimeParserBucket.computeMillis(DateTimeParserBucket.java:102)
	at org.joda.time.format.DateTimeParserBucket.computeMillis(DateTimeParserBucket.java:102)
	at org.joda.time.format.DateTimeParserBucket.computeMillis(DateTimeParserBucket.java:102)
	at org.joda.time.format.DateTimeParserBucket.computeMillis(DateTimeParserBucket.java:92)
	at org.joda.time.format.DateTimeFormatter.parseDateTime(DateTimeFormatter.java:882)
	at org.joda.time.format.TestDateTimeFormat.testFormatParse_textMonthJanShortLowerCase_UK(TestDateTimeFormat.java:906)

testFormatParse_textMonthJanShortUpperCase_UK(org.joda.time.format.TestDateTimeFormat)  Time elapsed: 0 sec  <<< ERROR!
java.lang.ArrayIndexOutOfBoundsException: 8
	at org.joda.time.format.DateTimeParserBucket.sort(DateTimeParserBucket.java:126)
	at org.joda.time.format.DateTimeParserBucket.computeMillis(DateTimeParserBucket.java:97)
	at org.joda.time.format.DateTimeParserBucket.computeMillis(DateTimeParserBucket.java:102)
	at org.joda.time.format.DateTimeParserBucket.computeMillis(DateTimeParserBucket.java:102)
	at org.joda.time.format.DateTimeParserBucket.computeMillis(DateTimeParserBucket.java:102)
	at org.joda.time.format.DateTimeParserBucket.computeMillis(DateTimeParserBucket.java:102)
	at org.joda.time.format.DateTimeParserBucket.computeMillis(DateTimeParserBucket.java:102)
	at org.joda.time.format.DateTimeParserBucket.computeMillis(DateTimeParserBucket.java:92)
	at org.joda.time.format.DateTimeFormatter.parseDateTime(DateTimeFormatter.java:882)
	at org.joda.time.format.TestDateTimeFormat.testFormatParse_textMonthJanShortUpperCase_UK(TestDateTimeFormat.java:913)

testParse_textMonthJanLong_UK(org.joda.time.format.TestDateTimeFormat)  Time elapsed: 0.001 sec  <<< ERROR!
java.lang.ArrayIndexOutOfBoundsException: 8
	at org.joda.time.format.DateTimeParserBucket.sort(DateTimeParserBucket.java:126)
	at org.joda.time.format.DateTimeParserBucket.computeMillis(DateTimeParserBucket.java:97)
	at org.joda.time.format.DateTimeParserBucket.computeMillis(DateTimeParserBucket.java:102)
	at org.joda.time.format.DateTimeParserBucket.computeMillis(DateTimeParserBucket.java:102)
	at org.joda.time.format.DateTimeParserBucket.computeMillis(DateTimeParserBucket.java:102)
	at org.joda.time.format.DateTimeParserBucket.computeMillis(DateTimeParserBucket.java:102)
	at org.joda.time.format.DateTimeParserBucket.computeMillis(DateTimeParserBucket.java:102)
	at org.joda.time.format.DateTimeParserBucket.computeMillis(DateTimeParserBucket.java:92)
	at org.joda.time.format.DateTimeFormatter.parseDateTime(DateTimeFormatter.java:882)
	at org.joda.time.format.TestDateTimeFormat.testParse_textMonthJanLong_UK(TestDateTimeFormat.java:921)

testFormatParse_textMonthJanLongLowerCase_UK(org.joda.time.format.TestDateTimeFormat)  Time elapsed: 0 sec  <<< ERROR!
java.lang.ArrayIndexOutOfBoundsException: 8
	at org.joda.time.format.DateTimeParserBucket.sort(DateTimeParserBucket.java:126)
	at org.joda.time.format.DateTimeParserBucket.computeMillis(DateTimeParserBucket.java:97)
	at org.joda.time.format.DateTimeParserBucket.computeMillis(DateTimeParserBucket.java:102)
	at org.joda.time.format.DateTimeParserBucket.computeMillis(DateTimeParserBucket.java:102)
	at org.joda.time.format.DateTimeParserBucket.computeMillis(DateTimeParserBucket.java:102)
	at org.joda.time.format.DateTimeParserBucket.computeMillis(DateTimeParserBucket.java:102)
	at org.joda.time.format.DateTimeParserBucket.computeMillis(DateTimeParserBucket.java:102)
	at org.joda.time.format.DateTimeParserBucket.computeMillis(DateTimeParserBucket.java:92)
	at org.joda.time.format.DateTimeFormatter.parseDateTime(DateTimeFormatter.java:882)
	at org.joda.time.format.TestDateTimeFormat.testFormatParse_textMonthJanLongLowerCase_UK(TestDateTimeFormat.java:928)

testFormatParse_textMonthJanLongUpperCase_UK(org.joda.time.format.TestDateTimeFormat)  Time elapsed: 0.001 sec  <<< ERROR!
java.lang.ArrayIndexOutOfBoundsException: 8
	at org.joda.time.format.DateTimeParserBucket.sort(DateTimeParserBucket.java:126)
	at org.joda.time.format.DateTimeParserBucket.computeMillis(DateTimeParserBucket.java:97)
	at org.joda.time.format.DateTimeParserBucket.computeMillis(DateTimeParserBucket.java:102)
	at org.joda.time.format.DateTimeParserBucket.computeMillis(DateTimeParserBucket.java:102)
	at org.joda.time.format.DateTimeParserBucket.computeMillis(DateTimeParserBucket.java:102)
	at org.joda.time.format.DateTimeParserBucket.computeMillis(DateTimeParserBucket.java:102)
	at org.joda.time.format.DateTimeParserBucket.computeMillis(DateTimeParserBucket.java:102)
	at org.joda.time.format.DateTimeParserBucket.computeMillis(DateTimeParserBucket.java:92)
	at org.joda.time.format.DateTimeFormatter.parseDateTime(DateTimeFormatter.java:882)
	at org.joda.time.format.TestDateTimeFormat.testFormatParse_textMonthJanLongUpperCase_UK(TestDateTimeFormat.java:935)

testFormatParse_textMonthJanShort_France(org.joda.time.format.TestDateTimeFormat)  Time elapsed: 0.002 sec  <<< ERROR!
java.lang.ArrayIndexOutOfBoundsException: 8
	at org.joda.time.format.DateTimeParserBucket.sort(DateTimeParserBucket.java:126)
	at org.joda.time.format.DateTimeParserBucket.computeMillis(DateTimeParserBucket.java:97)
	at org.joda.time.format.DateTimeParserBucket.computeMillis(DateTimeParserBucket.java:102)
	at org.joda.time.format.DateTimeParserBucket.computeMillis(DateTimeParserBucket.java:102)
	at org.joda.time.format.DateTimeParserBucket.computeMillis(DateTimeParserBucket.java:102)
	at org.joda.time.format.DateTimeParserBucket.computeMillis(DateTimeParserBucket.java:102)
	at org.joda.time.format.DateTimeParserBucket.computeMillis(DateTimeParserBucket.java:102)
	at org.joda.time.format.DateTimeParserBucket.computeMillis(DateTimeParserBucket.java:92)
	at org.joda.time.format.DateTimeFormatter.parseDateTime(DateTimeFormatter.java:882)
	at org.joda.time.format.TestDateTimeFormat.testFormatParse_textMonthJanShort_France(TestDateTimeFormat.java:945)

testFormatParse_textMonthJanLong_France(org.joda.time.format.TestDateTimeFormat)  Time elapsed: 0 sec  <<< ERROR!
java.lang.ArrayIndexOutOfBoundsException: 8
	at org.joda.time.format.DateTimeParserBucket.sort(DateTimeParserBucket.java:126)
	at org.joda.time.format.DateTimeParserBucket.computeMillis(DateTimeParserBucket.java:97)
	at org.joda.time.format.DateTimeParserBucket.computeMillis(DateTimeParserBucket.java:102)
	at org.joda.time.format.DateTimeParserBucket.computeMillis(DateTimeParserBucket.java:102)
	at org.joda.time.format.DateTimeParserBucket.computeMillis(DateTimeParserBucket.java:102)
	at org.joda.time.format.DateTimeParserBucket.computeMillis(DateTimeParserBucket.java:102)
	at org.joda.time.format.DateTimeParserBucket.computeMillis(DateTimeParserBucket.java:102)
	at org.joda.time.format.DateTimeParserBucket.computeMillis(DateTimeParserBucket.java:92)
	at org.joda.time.format.DateTimeFormatter.parseDateTime(DateTimeFormatter.java:882)
	at org.joda.time.format.TestDateTimeFormat.testFormatParse_textMonthJanLong_France(TestDateTimeFormat.java:953)

testFormatParse_textMonthApr_France(org.joda.time.format.TestDateTimeFormat)  Time elapsed: 0 sec  <<< ERROR!
java.lang.ArrayIndexOutOfBoundsException: 8
	at org.joda.time.format.DateTimeParserBucket.sort(DateTimeParserBucket.java:126)
	at org.joda.time.format.DateTimeParserBucket.computeMillis(DateTimeParserBucket.java:97)
	at org.joda.time.format.DateTimeParserBucket.computeMillis(DateTimeParserBucket.java:102)
	at org.joda.time.format.DateTimeParserBucket.computeMillis(DateTimeParserBucket.java:102)
	at org.joda.time.format.DateTimeParserBucket.computeMillis(DateTimeParserBucket.java:102)
	at org.joda.time.format.DateTimeParserBucket.computeMillis(DateTimeParserBucket.java:102)
	at org.joda.time.format.DateTimeParserBucket.computeMillis(DateTimeParserBucket.java:102)
	at org.joda.time.format.DateTimeParserBucket.computeMillis(DateTimeParserBucket.java:92)
	at org.joda.time.format.DateTimeFormatter.parseDateTime(DateTimeFormatter.java:882)
	at org.joda.time.format.TestDateTimeFormat.testFormatParse_textMonthApr_France(TestDateTimeFormat.java:963)

testFormatParse_textMonthAtEnd_France(org.joda.time.format.TestDateTimeFormat)  Time elapsed: 0.001 sec  <<< ERROR!
java.lang.ArrayIndexOutOfBoundsException: 8
	at org.joda.time.format.DateTimeParserBucket.sort(DateTimeParserBucket.java:126)
	at org.joda.time.format.DateTimeParserBucket.computeMillis(DateTimeParserBucket.java:97)
	at org.joda.time.format.DateTimeParserBucket.computeMillis(DateTimeParserBucket.java:102)
	at org.joda.time.format.DateTimeParserBucket.computeMillis(DateTimeParserBucket.java:102)
	at org.joda.time.format.DateTimeParserBucket.computeMillis(DateTimeParserBucket.java:102)
	at org.joda.time.format.DateTimeParserBucket.computeMillis(DateTimeParserBucket.java:102)
	at org.joda.time.format.DateTimeParserBucket.computeMillis(DateTimeParserBucket.java:102)
	at org.joda.time.format.DateTimeParserBucket.computeMillis(DateTimeParserBucket.java:102)
	at org.joda.time.format.DateTimeParserBucket.computeMillis(DateTimeParserBucket.java:92)
	at org.joda.time.format.DateTimeFormatter.parseDateTime(DateTimeFormatter.java:882)
	at org.joda.time.format.TestDateTimeFormat.testFormatParse_textMonthAtEnd_France(TestDateTimeFormat.java:973)

testFormatParse_textMonthAtEnd_France_withSpecifiedDefault(org.joda.time.format.TestDateTimeFormat)  Time elapsed: 0 sec  <<< ERROR!
java.lang.ArrayIndexOutOfBoundsException: 8
	at org.joda.time.format.DateTimeParserBucket.sort(DateTimeParserBucket.java:126)
	at org.joda.time.format.DateTimeParserBucket.computeMillis(DateTimeParserBucket.java:97)
	at org.joda.time.format.DateTimeParserBucket.computeMillis(DateTimeParserBucket.java:102)
	at org.joda.time.format.DateTimeParserBucket.computeMillis(DateTimeParserBucket.java:102)
	at org.joda.time.format.DateTimeParserBucket.computeMillis(DateTimeParserBucket.java:102)
	at org.joda.time.format.DateTimeParserBucket.computeMillis(DateTimeParserBucket.java:102)
	at org.joda.time.format.DateTimeParserBucket.computeMillis(DateTimeParserBucket.java:102)
	at org.joda.time.format.DateTimeParserBucket.computeMillis(DateTimeParserBucket.java:102)
	at org.joda.time.format.DateTimeParserBucket.computeMillis(DateTimeParserBucket.java:92)
	at org.joda.time.format.DateTimeFormatter.parseDateTime(DateTimeFormatter.java:882)
	at org.joda.time.format.TestDateTimeFormat.testFormatParse_textMonthAtEnd_France_withSpecifiedDefault(TestDateTimeFormat.java:983)

testFormatParse_textMonthApr_Korean(org.joda.time.format.TestDateTimeFormat)  Time elapsed: 0.01 sec  <<< ERROR!
java.lang.ArrayIndexOutOfBoundsException: 8
	at org.joda.time.format.DateTimeParserBucket.sort(DateTimeParserBucket.java:126)
	at org.joda.time.format.DateTimeParserBucket.computeMillis(DateTimeParserBucket.java:97)
	at org.joda.time.format.DateTimeParserBucket.computeMillis(DateTimeParserBucket.java:102)
	at org.joda.time.format.DateTimeParserBucket.computeMillis(DateTimeParserBucket.java:102)
	at org.joda.time.format.DateTimeParserBucket.computeMillis(DateTimeParserBucket.java:92)
	at org.joda.time.format.DateTimeFormatter.parseDateTime(DateTimeFormatter.java:882)
	at org.joda.time.format.TestDateTimeFormat.testFormatParse_textMonthApr_Korean(TestDateTimeFormat.java:992)

testFormatParse_textHalfdayAM_UK(org.joda.time.format.TestDateTimeFormat)  Time elapsed: 0.001 sec  <<< FAILURE!
junit.framework.AssertionFailedError: expected:<2007> but was:<1970>
	at junit.framework.Assert.fail(Assert.java:47)
	at junit.framework.Assert.failNotEquals(Assert.java:280)
	at junit.framework.Assert.assertEquals(Assert.java:64)
	at junit.framework.Assert.assertEquals(Assert.java:198)
	at junit.framework.Assert.assertEquals(Assert.java:204)
	at org.joda.time.format.TestDateTimeFormat.check(TestDateTimeFormat.java:1173)
	at org.joda.time.format.TestDateTimeFormat.testFormatParse_textHalfdayAM_UK(TestDateTimeFormat.java:1011)

testFormatParse_textHalfdayAM_France(org.joda.time.format.TestDateTimeFormat)  Time elapsed: 0.001 sec  <<< FAILURE!
junit.framework.AssertionFailedError: expected:<2007> but was:<1970>
	at junit.framework.Assert.fail(Assert.java:47)
	at junit.framework.Assert.failNotEquals(Assert.java:280)
	at junit.framework.Assert.assertEquals(Assert.java:64)
	at junit.framework.Assert.assertEquals(Assert.java:198)
	at junit.framework.Assert.assertEquals(Assert.java:204)
	at org.joda.time.format.TestDateTimeFormat.check(TestDateTimeFormat.java:1173)
	at org.joda.time.format.TestDateTimeFormat.testFormatParse_textHalfdayAM_France(TestDateTimeFormat.java:1028)

testFormatParse_textAdjoiningHelloWorld_UK(org.joda.time.format.TestDateTimeFormat)  Time elapsed: 0.001 sec  <<< ERROR!
java.lang.ArrayIndexOutOfBoundsException: 8
	at org.joda.time.format.DateTimeParserBucket.sort(DateTimeParserBucket.java:126)
	at org.joda.time.format.DateTimeParserBucket.computeMillis(DateTimeParserBucket.java:97)
	at org.joda.time.format.DateTimeParserBucket.computeMillis(DateTimeParserBucket.java:102)
	at org.joda.time.format.DateTimeParserBucket.computeMillis(DateTimeParserBucket.java:102)
	at org.joda.time.format.DateTimeParserBucket.computeMillis(DateTimeParserBucket.java:102)
	at org.joda.time.format.DateTimeParserBucket.computeMillis(DateTimeParserBucket.java:102)
	at org.joda.time.format.DateTimeParserBucket.computeMillis(DateTimeParserBucket.java:102)
	at org.joda.time.format.DateTimeParserBucket.computeMillis(DateTimeParserBucket.java:102)
	at org.joda.time.format.DateTimeParserBucket.computeMillis(DateTimeParserBucket.java:92)
	at org.joda.time.format.DateTimeFormatter.parseDateTime(DateTimeFormatter.java:882)
	at org.joda.time.format.TestDateTimeFormat.testFormatParse_textAdjoiningHelloWorld_UK(TestDateTimeFormat.java:1121)

testFormatParse_textAdjoiningMonthDOW_UK(org.joda.time.format.TestDateTimeFormat)  Time elapsed: 0.001 sec  <<< ERROR!
java.lang.ArrayIndexOutOfBoundsException: 8
	at org.joda.time.format.DateTimeParserBucket.sort(DateTimeParserBucket.java:126)
	at org.joda.time.format.DateTimeParserBucket.computeMillis(DateTimeParserBucket.java:97)
	at org.joda.time.format.DateTimeParserBucket.computeMillis(DateTimeParserBucket.java:102)
	at org.joda.time.format.DateTimeParserBucket.computeMillis(DateTimeParserBucket.java:102)
	at org.joda.time.format.DateTimeParserBucket.computeMillis(DateTimeParserBucket.java:102)
	at org.joda.time.format.DateTimeParserBucket.computeMillis(DateTimeParserBucket.java:102)
	at org.joda.time.format.DateTimeParserBucket.computeMillis(DateTimeParserBucket.java:102)
	at org.joda.time.format.DateTimeParserBucket.computeMillis(DateTimeParserBucket.java:92)
	at org.joda.time.format.DateTimeFormatter.parseDateTime(DateTimeFormatter.java:882)
	at org.joda.time.format.TestDateTimeFormat.testFormatParse_textAdjoiningMonthDOW_UK(TestDateTimeFormat.java:1135)

testFormat_yearOfEraParse(org.joda.time.format.TestDateTimeFormat)  Time elapsed: 0.001 sec  <<< FAILURE!
junit.framework.AssertionFailedError: expected:<-2005-10-01T00:00:00.000Z> but was:<2005-10-01T00:00:00.000Z>
	at junit.framework.Assert.fail(Assert.java:47)
	at junit.framework.Assert.failNotEquals(Assert.java:280)
	at junit.framework.Assert.assertEquals(Assert.java:64)
	at junit.framework.Assert.assertEquals(Assert.java:71)
	at org.joda.time.format.TestDateTimeFormat.testFormat_yearOfEraParse(TestDateTimeFormat.java:204)

testForStyle_shortDate(org.joda.time.format.TestDateTimeFormatStyle)  Time elapsed: 0.015 sec  <<< ERROR!
java.lang.ArrayIndexOutOfBoundsException: 8
	at org.joda.time.format.DateTimeParserBucket.sort(DateTimeParserBucket.java:126)
	at org.joda.time.format.DateTimeParserBucket.computeMillis(DateTimeParserBucket.java:97)
	at org.joda.time.format.DateTimeParserBucket.computeMillis(DateTimeParserBucket.java:102)
	at org.joda.time.format.DateTimeParserBucket.computeMillis(DateTimeParserBucket.java:102)
	at org.joda.time.format.DateTimeParserBucket.computeMillis(DateTimeParserBucket.java:102)
	at org.joda.time.format.DateTimeParserBucket.computeMillis(DateTimeParserBucket.java:102)
	at org.joda.time.format.DateTimeParserBucket.computeMillis(DateTimeParserBucket.java:102)
	at org.joda.time.format.DateTimeParserBucket.computeMillis(DateTimeParserBucket.java:92)
	at org.joda.time.format.DateTimeFormatter.parseDateTime(DateTimeFormatter.java:882)
	at org.joda.time.format.TestDateTimeFormatStyle.testForStyle_shortDate(TestDateTimeFormatStyle.java:141)

testForStyle_shortDateTime(org.joda.time.format.TestDateTimeFormatStyle)  Time elapsed: 0.003 sec  <<< ERROR!
java.lang.ArrayIndexOutOfBoundsException: 8
	at org.joda.time.format.DateTimeParserBucket.sort(DateTimeParserBucket.java:126)
	at org.joda.time.format.DateTimeParserBucket.computeMillis(DateTimeParserBucket.java:97)
	at org.joda.time.format.DateTimeParserBucket.computeMillis(DateTimeParserBucket.java:102)
	at org.joda.time.format.DateTimeParserBucket.computeMillis(DateTimeParserBucket.java:102)
	at org.joda.time.format.DateTimeParserBucket.computeMillis(DateTimeParserBucket.java:102)
	at org.joda.time.format.DateTimeParserBucket.computeMillis(DateTimeParserBucket.java:92)
	at org.joda.time.format.DateTimeFormatter.parseDateTime(DateTimeFormatter.java:882)
	at org.joda.time.format.TestDateTimeFormatStyle.testForStyle_shortDateTime(TestDateTimeFormatStyle.java:179)


Results :

Failed tests: 
  org.joda.time.TestDateMidnight_Constructors#testParse_formatter AssertionFailedError
  org.joda.time.TestDateTime_Constructors#testParse_formatter AssertionFailedError
  org.joda.time.TestInstant_Constructors#testParse_formatter AssertionFailedError
  org.joda.time.TestLocalDateTime_Constructors#testParse_formatter AssertionFailedError
  org.joda.time.TestLocalDate_Constructors#testParse_formatter AssertionFailedError
  org.joda.time.TestMonthDay_Constructors#testParse_formatter AssertionFailedError
  org.joda.time.TestMutableDateTime_Constructors#testParse_formatter AssertionFailedError
  org.joda.time.format.TestDateTimeFormat#testFormatParse_textHalfdayAM_France AssertionFailedError
  org.joda.time.format.TestDateTimeFormat#testFormatParse_textHalfdayAM_UK AssertionFailedError
  org.joda.time.format.TestDateTimeFormat#testFormat_yearOfEraParse AssertionFailedError
  org.joda.time.format.TestDateTimeFormatter#testParseLocalDate_yearOfEra AssertionFailedError
Tests in error: 
  org.joda.time.TestMonthDay_Constructors#testParse_noFormatter ArrayIndexOutOfBoundsException
  org.joda.time.TestStringConvert#testMonthDay ArrayIndexOutOfBoundsException 8
  org.joda.time.TestStringConvert#testMonthDay_leapDay ArrayIndexOutOfBoundsException
  org.joda.time.format.TestDateTimeFormat#testFormatParse_textAdjoiningHelloWorld_UK ArrayIndexOutOfBoundsException
  org.joda.time.format.TestDateTimeFormat#testFormatParse_textAdjoiningMonthDOW_UK ArrayIndexOutOfBoundsException
  org.joda.time.format.TestDateTimeFormat#testFormatParse_textMonthApr_France ArrayIndexOutOfBoundsException
  org.joda.time.format.TestDateTimeFormat#testFormatParse_textMonthApr_Korean ArrayIndexOutOfBoundsException
  org.joda.time.format.TestDateTimeFormat#testFormatParse_textMonthAtEnd_France ArrayIndexOutOfBoundsException
  org.joda.time.format.TestDateTimeFormat#testFormatParse_textMonthAtEnd_France_withSpecifiedDefault ArrayIndexOutOfBoundsException
  org.joda.time.format.TestDateTimeFormat#testFormatParse_textMonthJanLongLowerCase_UK ArrayIndexOutOfBoundsException
  org.joda.time.format.TestDateTimeFormat#testFormatParse_textMonthJanLongUpperCase_UK ArrayIndexOutOfBoundsException
  org.joda.time.format.TestDateTimeFormat#testFormatParse_textMonthJanLong_France ArrayIndexOutOfBoundsException
  org.joda.time.format.TestDateTimeFormat#testFormatParse_textMonthJanShortLowerCase_UK ArrayIndexOutOfBoundsException
  org.joda.time.format.TestDateTimeFormat#testFormatParse_textMonthJanShortUpperCase_UK ArrayIndexOutOfBoundsException
  org.joda.time.format.TestDateTimeFormat#testFormatParse_textMonthJanShort_France ArrayIndexOutOfBoundsException
  org.joda.time.format.TestDateTimeFormat#testFormatParse_textMonthJanShort_UK ArrayIndexOutOfBoundsException
  org.joda.time.format.TestDateTimeFormat#testParse_pivotYear ArrayIndexOutOfBoundsException
  org.joda.time.format.TestDateTimeFormat#testParse_pivotYear_ignored4DigitYear ArrayIndexOutOfBoundsException
  org.joda.time.format.TestDateTimeFormat#testParse_textMonthJanLong_UK ArrayIndexOutOfBoundsException
  org.joda.time.format.TestDateTimeFormatStyle#testForStyle_shortDate ArrayIndexOutOfBoundsException
  org.joda.time.format.TestDateTimeFormatStyle#testForStyle_shortDateTime ArrayIndexOutOfBoundsException
  org.joda.time.format.TestDateTimeFormatter#testParseDateTime_simple_precedence ArrayIndexOutOfBoundsException
  org.joda.time.format.TestDateTimeFormatter#testParseInto_monthDay_feb29 ArrayIndexOutOfBoundsException
  org.joda.time.format.TestDateTimeFormatter#testParseInto_monthDay_feb29_OfYear ArrayIndexOutOfBoundsException
  org.joda.time.format.TestDateTimeFormatter#testParseInto_monthDay_feb29_newYork ArrayIndexOutOfBoundsException
  org.joda.time.format.TestDateTimeFormatter#testParseInto_monthDay_feb29_newYork_endOfYear ArrayIndexOutOfBoundsException
  org.joda.time.format.TestDateTimeFormatter#testParseInto_monthDay_feb29_newYork_startOfYear ArrayIndexOutOfBoundsException
  org.joda.time.format.TestDateTimeFormatter#testParseInto_monthDay_feb29_startOfYear ArrayIndexOutOfBoundsException
  org.joda.time.format.TestDateTimeFormatter#testParseInto_monthDay_feb29_tokyo ArrayIndexOutOfBoundsException
  org.joda.time.format.TestDateTimeFormatter#testParseInto_monthDay_feb29_tokyo_endOfYear ArrayIndexOutOfBoundsException
  org.joda.time.format.TestDateTimeFormatter#testParseInto_monthDay_feb29_tokyo_startOfYear ArrayIndexOutOfBoundsException
  org.joda.time.format.TestDateTimeFormatter#testParseInto_monthDay_withDefaultYear_feb29 ArrayIndexOutOfBoundsException
  org.joda.time.format.TestDateTimeFormatter#testParseInto_monthDay_withDefaultYear_feb29_newYork ArrayIndexOutOfBoundsException
  org.joda.time.format.TestDateTimeFormatter#testParseInto_monthDay_withDefaultYear_feb29_newYork_endOfYear ArrayIndexOutOfBoundsException
  org.joda.time.format.TestDateTimeFormatter#testParseInto_monthOnly ArrayIndexOutOfBoundsException
  org.joda.time.format.TestDateTimeFormatter#testParseInto_monthOnly_baseEndYear ArrayIndexOutOfBoundsException
  org.joda.time.format.TestDateTimeFormatter#testParseInto_monthOnly_baseStartYear ArrayIndexOutOfBoundsException
  org.joda.time.format.TestDateTimeFormatter#testParseInto_monthOnly_parseEndYear ArrayIndexOutOfBoundsException
  org.joda.time.format.TestDateTimeFormatter#testParseInto_monthOnly_parseStartYear ArrayIndexOutOfBoundsException
  org.joda.time.format.TestDateTimeFormatter#testParseInto_simple_precedence ArrayIndexOutOfBoundsException
  org.joda.time.format.TestDateTimeFormatter#testParseLocalDateTime_monthDay_feb29 ArrayIndexOutOfBoundsException
  org.joda.time.format.TestDateTimeFormatter#testParseLocalDateTime_monthDay_withDefaultYear_feb29 ArrayIndexOutOfBoundsException
  org.joda.time.format.TestDateTimeFormatter#testParseLocalDate_monthDay_feb29 ArrayIndexOutOfBoundsException
  org.joda.time.format.TestDateTimeFormatter#testParseLocalDate_monthDay_withDefaultYear_feb29 ArrayIndexOutOfBoundsException
  org.joda.time.format.TestDateTimeFormatter#testParseMutableDateTime_simple_precedence ArrayIndexOutOfBoundsException
  org.joda.time.format.TestDateTimeFormatter#testPrinterParserMethods ArrayIndexOutOfBoundsException

Tests run: 4157, Failures: 11, Errors: 46, Skipped: 0

[INFO] ------------------------------------------------------------------------
[INFO] BUILD FAILURE
[INFO] ------------------------------------------------------------------------
[INFO] Total time: 16.016s
[INFO] Finished at: Thu Aug 06 08:34:48 BST 2015
[INFO] Final Memory: 8M/216M
[INFO] ------------------------------------------------------------------------
[ERROR] Failed to execute goal org.apache.maven.plugins:maven-surefire-plugin:2.18.1:test (default-test) on project joda-time: There are test failures.
[ERROR] 
[ERROR] Please refer to /home/perham/Study/LittleDarwin/Cases/joda-time-2.8.1/target/surefire-reports for the individual test results.
[ERROR] -> [Help 1]
[ERROR] 
[ERROR] To see the full stack trace of the errors, re-run Maven with the -e switch.
[ERROR] Re-run Maven using the -X switch to enable full debug logging.
[ERROR] 
[ERROR] For more information about the errors and possible solutions, please read the following articles:
[ERROR] [Help 1] http://cwiki.apache.org/confluence/display/MAVEN/MojoFailureException
