[INFO] Scanning for projects...
[INFO]                                                                         
[INFO] ------------------------------------------------------------------------
[INFO] Building Joda-Time 2.8.1
[INFO] ------------------------------------------------------------------------
[INFO] 
[INFO] --- maven-resources-plugin:2.7:resources (default-resources) @ joda-time ---
[INFO] Using 'UTF-8' encoding to copy filtered resources.
[INFO] Copying 2 resources to META-INF
[INFO] Copying 10 resources
[INFO] 
[INFO] --- maven-compiler-plugin:3.3:compile (default-compile) @ joda-time ---
[INFO] Changes detected - recompiling the module!
[INFO] Compiling 166 source files to /home/perham/Study/LittleDarwin/Cases/joda-time-2.8.1/target/classes
[INFO] 
[INFO] --- exec-maven-plugin:1.4.0:java (compile-tzdb) @ joda-time ---
Writing zoneinfo files
Writing ZoneInfoMap
[INFO] 
[INFO] --- maven-resources-plugin:2.7:testResources (default-testResources) @ joda-time ---
[INFO] Using 'UTF-8' encoding to copy filtered resources.
[INFO] Copying 34 resources
[INFO] 
[INFO] --- maven-compiler-plugin:3.3:testCompile (default-testCompile) @ joda-time ---
[INFO] Nothing to compile - all classes are up to date
[INFO] 
[INFO] --- maven-surefire-plugin:2.18.1:test (default-test) @ joda-time ---
[INFO] Surefire report directory: /home/perham/Study/LittleDarwin/Cases/joda-time-2.8.1/target/surefire-reports

-------------------------------------------------------
 T E S T S
-------------------------------------------------------
Running org.joda.time.TestAllPackages

TestBuddhistChronology.testCalendar

TestCopticChronology.testCalendar

TestEthiopicChronology.testCalendar

TestIslamicChronology.testCalendar

Testing Gregorian chronology over 1000 iterations
100% complete (i=1000)

Testing Julian chronology over 1000 iterations
100% complete (i=1000)
Writing zoneinfo files
Writing ZoneInfoMap
Tests run: 4157, Failures: 0, Errors: 118, Skipped: 0, Time elapsed: 5.341 sec <<< FAILURE! - in org.joda.time.TestAllPackages
testToString(org.joda.time.TestLocalDateTime_Basics)  Time elapsed: 0.005 sec  <<< ERROR!
java.lang.ArrayIndexOutOfBoundsException: -1
	at org.joda.time.format.DateTimeFormatterBuilder$Composite.printTo(DateTimeFormatterBuilder.java:681)
	at org.joda.time.format.DateTimeFormatter.printTo(DateTimeFormatter.java:609)
	at org.joda.time.format.DateTimeFormatter.print(DateTimeFormatter.java:663)
	at org.joda.time.LocalDateTime.toString(LocalDateTime.java:2087)
	at org.joda.time.TestLocalDateTime_Basics.testToString(TestLocalDateTime_Basics.java:1072)

testToString_String(org.joda.time.TestLocalDateTime_Basics)  Time elapsed: 0.009 sec  <<< ERROR!
java.lang.ArrayIndexOutOfBoundsException: -1
	at org.joda.time.format.DateTimeFormatterBuilder$Composite.printTo(DateTimeFormatterBuilder.java:681)
	at org.joda.time.format.DateTimeFormatter.printTo(DateTimeFormatter.java:609)
	at org.joda.time.format.DateTimeFormatter.print(DateTimeFormatter.java:663)
	at org.joda.time.LocalDateTime.toString(LocalDateTime.java:2100)
	at org.joda.time.TestLocalDateTime_Basics.testToString_String(TestLocalDateTime_Basics.java:1078)

testToString_String_Locale(org.joda.time.TestLocalDateTime_Basics)  Time elapsed: 0 sec  <<< ERROR!
java.lang.ArrayIndexOutOfBoundsException: -1
	at org.joda.time.format.DateTimeFormatterBuilder$Composite.printTo(DateTimeFormatterBuilder.java:681)
	at org.joda.time.format.DateTimeFormatter.printTo(DateTimeFormatter.java:609)
	at org.joda.time.format.DateTimeFormatter.print(DateTimeFormatter.java:663)
	at org.joda.time.LocalDateTime.toString(LocalDateTime.java:2114)
	at org.joda.time.TestLocalDateTime_Basics.testToString_String_Locale(TestLocalDateTime_Basics.java:1085)

testToString_DTFormatter(org.joda.time.TestLocalDateTime_Basics)  Time elapsed: 0 sec  <<< ERROR!
java.lang.ArrayIndexOutOfBoundsException: -1
	at org.joda.time.format.DateTimeFormatterBuilder$Composite.printTo(DateTimeFormatterBuilder.java:681)
	at org.joda.time.format.DateTimeFormatter.printTo(DateTimeFormatter.java:609)
	at org.joda.time.format.DateTimeFormatter.print(DateTimeFormatter.java:663)
	at org.joda.time.base.AbstractPartial.toString(AbstractPartial.java:412)
	at org.joda.time.TestLocalDateTime_Basics.testToString_DTFormatter(TestLocalDateTime_Basics.java:1095)

testToString(org.joda.time.TestLocalDate_Basics)  Time elapsed: 0 sec  <<< ERROR!
java.lang.ArrayIndexOutOfBoundsException: -1
	at org.joda.time.format.DateTimeFormatterBuilder$Composite.printTo(DateTimeFormatterBuilder.java:681)
	at org.joda.time.format.DateTimeFormatter.printTo(DateTimeFormatter.java:609)
	at org.joda.time.format.DateTimeFormatter.print(DateTimeFormatter.java:663)
	at org.joda.time.LocalDate.toString(LocalDate.java:1832)
	at org.joda.time.TestLocalDate_Basics.testToString(TestLocalDate_Basics.java:1126)

testToString_String(org.joda.time.TestLocalDate_Basics)  Time elapsed: 0.001 sec  <<< ERROR!
java.lang.ArrayIndexOutOfBoundsException: -1
	at org.joda.time.format.DateTimeFormatterBuilder$Composite.printTo(DateTimeFormatterBuilder.java:681)
	at org.joda.time.format.DateTimeFormatter.printTo(DateTimeFormatter.java:609)
	at org.joda.time.format.DateTimeFormatter.print(DateTimeFormatter.java:663)
	at org.joda.time.LocalDate.toString(LocalDate.java:1845)
	at org.joda.time.TestLocalDate_Basics.testToString_String(TestLocalDate_Basics.java:1132)

testToString_String_Locale(org.joda.time.TestLocalDate_Basics)  Time elapsed: 0 sec  <<< ERROR!
java.lang.ArrayIndexOutOfBoundsException: -1
	at org.joda.time.format.DateTimeFormatterBuilder$Composite.printTo(DateTimeFormatterBuilder.java:681)
	at org.joda.time.format.DateTimeFormatter.printTo(DateTimeFormatter.java:609)
	at org.joda.time.format.DateTimeFormatter.print(DateTimeFormatter.java:663)
	at org.joda.time.LocalDate.toString(LocalDate.java:1859)
	at org.joda.time.TestLocalDate_Basics.testToString_String_Locale(TestLocalDate_Basics.java:1139)

testToString_DTFormatter(org.joda.time.TestLocalDate_Basics)  Time elapsed: 0 sec  <<< ERROR!
java.lang.ArrayIndexOutOfBoundsException: -1
	at org.joda.time.format.DateTimeFormatterBuilder$Composite.printTo(DateTimeFormatterBuilder.java:681)
	at org.joda.time.format.DateTimeFormatter.printTo(DateTimeFormatter.java:609)
	at org.joda.time.format.DateTimeFormatter.print(DateTimeFormatter.java:663)
	at org.joda.time.base.AbstractPartial.toString(AbstractPartial.java:412)
	at org.joda.time.TestLocalDate_Basics.testToString_DTFormatter(TestLocalDate_Basics.java:1149)

testToString(org.joda.time.TestLocalTime_Basics)  Time elapsed: 0.001 sec  <<< ERROR!
java.lang.ArrayIndexOutOfBoundsException: -1
	at org.joda.time.format.DateTimeFormatterBuilder$Composite.printTo(DateTimeFormatterBuilder.java:681)
	at org.joda.time.format.DateTimeFormatter.printTo(DateTimeFormatter.java:609)
	at org.joda.time.format.DateTimeFormatter.print(DateTimeFormatter.java:663)
	at org.joda.time.LocalTime.toString(LocalTime.java:1299)
	at org.joda.time.TestLocalTime_Basics.testToString(TestLocalTime_Basics.java:786)

testToString_String(org.joda.time.TestLocalTime_Basics)  Time elapsed: 0.001 sec  <<< ERROR!
java.lang.ArrayIndexOutOfBoundsException: -1
	at org.joda.time.format.DateTimeFormatterBuilder$Composite.printTo(DateTimeFormatterBuilder.java:681)
	at org.joda.time.format.DateTimeFormatter.printTo(DateTimeFormatter.java:609)
	at org.joda.time.format.DateTimeFormatter.print(DateTimeFormatter.java:663)
	at org.joda.time.LocalTime.toString(LocalTime.java:1312)
	at org.joda.time.TestLocalTime_Basics.testToString_String(TestLocalTime_Basics.java:792)

testToString_String_Locale(org.joda.time.TestLocalTime_Basics)  Time elapsed: 0 sec  <<< ERROR!
java.lang.ArrayIndexOutOfBoundsException: -1
	at org.joda.time.format.DateTimeFormatterBuilder$Composite.printTo(DateTimeFormatterBuilder.java:681)
	at org.joda.time.format.DateTimeFormatter.printTo(DateTimeFormatter.java:609)
	at org.joda.time.format.DateTimeFormatter.print(DateTimeFormatter.java:663)
	at org.joda.time.LocalTime.toString(LocalTime.java:1326)
	at org.joda.time.TestLocalTime_Basics.testToString_String_Locale(TestLocalTime_Basics.java:799)

testToString_DTFormatter(org.joda.time.TestLocalTime_Basics)  Time elapsed: 0.001 sec  <<< ERROR!
java.lang.ArrayIndexOutOfBoundsException: -1
	at org.joda.time.format.DateTimeFormatterBuilder$Composite.printTo(DateTimeFormatterBuilder.java:681)
	at org.joda.time.format.DateTimeFormatter.printTo(DateTimeFormatter.java:609)
	at org.joda.time.format.DateTimeFormatter.print(DateTimeFormatter.java:663)
	at org.joda.time.base.AbstractPartial.toString(AbstractPartial.java:412)
	at org.joda.time.TestLocalTime_Basics.testToString_DTFormatter(TestLocalTime_Basics.java:808)

testToString(org.joda.time.TestTimeOfDay_Basics)  Time elapsed: 0 sec  <<< ERROR!
java.lang.ArrayIndexOutOfBoundsException: -1
	at org.joda.time.format.DateTimeFormatterBuilder$Composite.printTo(DateTimeFormatterBuilder.java:681)
	at org.joda.time.format.DateTimeFormatter.printTo(DateTimeFormatter.java:609)
	at org.joda.time.format.DateTimeFormatter.print(DateTimeFormatter.java:663)
	at org.joda.time.TimeOfDay.toString(TimeOfDay.java:1004)
	at org.joda.time.TestTimeOfDay_Basics.testToString(TestTimeOfDay_Basics.java:873)

testToString_String(org.joda.time.TestTimeOfDay_Basics)  Time elapsed: 0 sec  <<< ERROR!
java.lang.ArrayIndexOutOfBoundsException: -1
	at org.joda.time.format.DateTimeFormatterBuilder$Composite.printTo(DateTimeFormatterBuilder.java:681)
	at org.joda.time.format.DateTimeFormatter.printTo(DateTimeFormatter.java:609)
	at org.joda.time.format.DateTimeFormatter.print(DateTimeFormatter.java:663)
	at org.joda.time.base.BasePartial.toString(BasePartial.java:295)
	at org.joda.time.TestTimeOfDay_Basics.testToString_String(TestTimeOfDay_Basics.java:879)

testToString_String_Locale(org.joda.time.TestTimeOfDay_Basics)  Time elapsed: 0 sec  <<< ERROR!
java.lang.ArrayIndexOutOfBoundsException: -1
	at org.joda.time.format.DateTimeFormatterBuilder$Composite.printTo(DateTimeFormatterBuilder.java:681)
	at org.joda.time.format.DateTimeFormatter.printTo(DateTimeFormatter.java:609)
	at org.joda.time.format.DateTimeFormatter.print(DateTimeFormatter.java:663)
	at org.joda.time.base.BasePartial.toString(BasePartial.java:309)
	at org.joda.time.TestTimeOfDay_Basics.testToString_String_Locale(TestTimeOfDay_Basics.java:886)

testToString_DTFormatter(org.joda.time.TestTimeOfDay_Basics)  Time elapsed: 0.002 sec  <<< ERROR!
java.lang.ArrayIndexOutOfBoundsException: -1
	at org.joda.time.format.DateTimeFormatterBuilder$Composite.printTo(DateTimeFormatterBuilder.java:681)
	at org.joda.time.format.DateTimeFormatter.printTo(DateTimeFormatter.java:609)
	at org.joda.time.format.DateTimeFormatter.print(DateTimeFormatter.java:663)
	at org.joda.time.base.AbstractPartial.toString(AbstractPartial.java:412)
	at org.joda.time.TestTimeOfDay_Basics.testToString_DTFormatter(TestTimeOfDay_Basics.java:895)

testToString(org.joda.time.TestYearMonthDay_Basics)  Time elapsed: 0.001 sec  <<< ERROR!
java.lang.ArrayIndexOutOfBoundsException: -1
	at org.joda.time.format.DateTimeFormatterBuilder$Composite.printTo(DateTimeFormatterBuilder.java:681)
	at org.joda.time.format.DateTimeFormatter.printTo(DateTimeFormatter.java:609)
	at org.joda.time.format.DateTimeFormatter.print(DateTimeFormatter.java:663)
	at org.joda.time.YearMonthDay.toString(YearMonthDay.java:919)
	at org.joda.time.TestYearMonthDay_Basics.testToString(TestYearMonthDay_Basics.java:799)

testToString_String(org.joda.time.TestYearMonthDay_Basics)  Time elapsed: 0 sec  <<< ERROR!
java.lang.ArrayIndexOutOfBoundsException: -1
	at org.joda.time.format.DateTimeFormatterBuilder$Composite.printTo(DateTimeFormatterBuilder.java:681)
	at org.joda.time.format.DateTimeFormatter.printTo(DateTimeFormatter.java:609)
	at org.joda.time.format.DateTimeFormatter.print(DateTimeFormatter.java:663)
	at org.joda.time.base.BasePartial.toString(BasePartial.java:295)
	at org.joda.time.TestYearMonthDay_Basics.testToString_String(TestYearMonthDay_Basics.java:805)

testToString_String_Locale(org.joda.time.TestYearMonthDay_Basics)  Time elapsed: 0 sec  <<< ERROR!
java.lang.ArrayIndexOutOfBoundsException: -1
	at org.joda.time.format.DateTimeFormatterBuilder$Composite.printTo(DateTimeFormatterBuilder.java:681)
	at org.joda.time.format.DateTimeFormatter.printTo(DateTimeFormatter.java:609)
	at org.joda.time.format.DateTimeFormatter.print(DateTimeFormatter.java:663)
	at org.joda.time.base.BasePartial.toString(BasePartial.java:309)
	at org.joda.time.TestYearMonthDay_Basics.testToString_String_Locale(TestYearMonthDay_Basics.java:812)

testToString_DTFormatter(org.joda.time.TestYearMonthDay_Basics)  Time elapsed: 0.001 sec  <<< ERROR!
java.lang.ArrayIndexOutOfBoundsException: -1
	at org.joda.time.format.DateTimeFormatterBuilder$Composite.printTo(DateTimeFormatterBuilder.java:681)
	at org.joda.time.format.DateTimeFormatter.printTo(DateTimeFormatter.java:609)
	at org.joda.time.format.DateTimeFormatter.print(DateTimeFormatter.java:663)
	at org.joda.time.base.AbstractPartial.toString(AbstractPartial.java:412)
	at org.joda.time.TestYearMonthDay_Basics.testToString_DTFormatter(TestYearMonthDay_Basics.java:822)

testToString(org.joda.time.TestYearMonth_Basics)  Time elapsed: 0 sec  <<< ERROR!
java.lang.ArrayIndexOutOfBoundsException: -1
	at org.joda.time.format.DateTimeFormatterBuilder$Composite.printTo(DateTimeFormatterBuilder.java:681)
	at org.joda.time.format.DateTimeFormatter.printTo(DateTimeFormatter.java:609)
	at org.joda.time.format.DateTimeFormatter.print(DateTimeFormatter.java:663)
	at org.joda.time.YearMonth.toString(YearMonth.java:797)
	at org.joda.time.TestYearMonth_Basics.testToString(TestYearMonth_Basics.java:623)

testToString_String(org.joda.time.TestYearMonth_Basics)  Time elapsed: 0 sec  <<< ERROR!
java.lang.ArrayIndexOutOfBoundsException: -1
	at org.joda.time.format.DateTimeFormatterBuilder$Composite.printTo(DateTimeFormatterBuilder.java:681)
	at org.joda.time.format.DateTimeFormatter.printTo(DateTimeFormatter.java:609)
	at org.joda.time.format.DateTimeFormatter.print(DateTimeFormatter.java:663)
	at org.joda.time.YearMonth.toString(YearMonth.java:810)
	at org.joda.time.TestYearMonth_Basics.testToString_String(TestYearMonth_Basics.java:629)

testToString_String_Locale(org.joda.time.TestYearMonth_Basics)  Time elapsed: 0.001 sec  <<< ERROR!
java.lang.ArrayIndexOutOfBoundsException: -1
	at org.joda.time.format.DateTimeFormatterBuilder$Composite.printTo(DateTimeFormatterBuilder.java:681)
	at org.joda.time.format.DateTimeFormatter.printTo(DateTimeFormatter.java:609)
	at org.joda.time.format.DateTimeFormatter.print(DateTimeFormatter.java:663)
	at org.joda.time.YearMonth.toString(YearMonth.java:824)
	at org.joda.time.TestYearMonth_Basics.testToString_String_Locale(TestYearMonth_Basics.java:636)

testToString_DTFormatter(org.joda.time.TestYearMonth_Basics)  Time elapsed: 0 sec  <<< ERROR!
java.lang.ArrayIndexOutOfBoundsException: -1
	at org.joda.time.format.DateTimeFormatterBuilder$Composite.printTo(DateTimeFormatterBuilder.java:681)
	at org.joda.time.format.DateTimeFormatter.printTo(DateTimeFormatter.java:609)
	at org.joda.time.format.DateTimeFormatter.print(DateTimeFormatter.java:663)
	at org.joda.time.base.AbstractPartial.toString(AbstractPartial.java:412)
	at org.joda.time.TestYearMonth_Basics.testToString_DTFormatter(TestYearMonth_Basics.java:646)

testToString(org.joda.time.TestMonthDay_Basics)  Time elapsed: 0.001 sec  <<< ERROR!
java.lang.ArrayIndexOutOfBoundsException: -1
	at org.joda.time.format.DateTimeFormatterBuilder$Composite.printTo(DateTimeFormatterBuilder.java:681)
	at org.joda.time.format.DateTimeFormatter.printTo(DateTimeFormatter.java:609)
	at org.joda.time.format.DateTimeFormatter.print(DateTimeFormatter.java:663)
	at org.joda.time.MonthDay.toString(MonthDay.java:786)
	at org.joda.time.TestMonthDay_Basics.testToString(TestMonthDay_Basics.java:789)

testToString_String(org.joda.time.TestMonthDay_Basics)  Time elapsed: 0.001 sec  <<< ERROR!
java.lang.ArrayIndexOutOfBoundsException: -1
	at org.joda.time.format.DateTimeFormatterBuilder$Composite.printTo(DateTimeFormatterBuilder.java:681)
	at org.joda.time.format.DateTimeFormatter.printTo(DateTimeFormatter.java:609)
	at org.joda.time.format.DateTimeFormatter.print(DateTimeFormatter.java:663)
	at org.joda.time.MonthDay.toString(MonthDay.java:799)
	at org.joda.time.TestMonthDay_Basics.testToString_String(TestMonthDay_Basics.java:795)

testToString_String_Locale(org.joda.time.TestMonthDay_Basics)  Time elapsed: 0 sec  <<< ERROR!
java.lang.ArrayIndexOutOfBoundsException: -1
	at org.joda.time.format.DateTimeFormatterBuilder$Composite.printTo(DateTimeFormatterBuilder.java:681)
	at org.joda.time.format.DateTimeFormatter.printTo(DateTimeFormatter.java:609)
	at org.joda.time.format.DateTimeFormatter.print(DateTimeFormatter.java:663)
	at org.joda.time.MonthDay.toString(MonthDay.java:813)
	at org.joda.time.TestMonthDay_Basics.testToString_String_Locale(TestMonthDay_Basics.java:802)

testToString_DTFormatter(org.joda.time.TestMonthDay_Basics)  Time elapsed: 0 sec  <<< ERROR!
java.lang.ArrayIndexOutOfBoundsException: -1
	at org.joda.time.format.DateTimeFormatterBuilder$Composite.printTo(DateTimeFormatterBuilder.java:681)
	at org.joda.time.format.DateTimeFormatter.printTo(DateTimeFormatter.java:609)
	at org.joda.time.format.DateTimeFormatter.print(DateTimeFormatter.java:663)
	at org.joda.time.base.AbstractPartial.toString(AbstractPartial.java:412)
	at org.joda.time.TestMonthDay_Basics.testToString_DTFormatter(TestMonthDay_Basics.java:812)

testToString_String(org.joda.time.TestPartial_Basics)  Time elapsed: 0.001 sec  <<< ERROR!
java.lang.ArrayIndexOutOfBoundsException: -1
	at org.joda.time.format.DateTimeFormatterBuilder$Composite.printTo(DateTimeFormatterBuilder.java:681)
	at org.joda.time.format.DateTimeFormatter.printTo(DateTimeFormatter.java:609)
	at org.joda.time.format.DateTimeFormatter.print(DateTimeFormatter.java:663)
	at org.joda.time.Partial.toString(Partial.java:820)
	at org.joda.time.TestPartial_Basics.testToString_String(TestPartial_Basics.java:877)

testToString_String_Locale(org.joda.time.TestPartial_Basics)  Time elapsed: 0 sec  <<< ERROR!
java.lang.ArrayIndexOutOfBoundsException: -1
	at org.joda.time.format.DateTimeFormatterBuilder$Composite.printTo(DateTimeFormatterBuilder.java:681)
	at org.joda.time.format.DateTimeFormatter.printTo(DateTimeFormatter.java:609)
	at org.joda.time.format.DateTimeFormatter.print(DateTimeFormatter.java:663)
	at org.joda.time.Partial.toString(Partial.java:835)
	at org.joda.time.TestPartial_Basics.testToString_String_Locale(TestPartial_Basics.java:884)

testToString_DTFormatter(org.joda.time.TestPartial_Basics)  Time elapsed: 0.001 sec  <<< ERROR!
java.lang.ArrayIndexOutOfBoundsException: -1
	at org.joda.time.format.DateTimeFormatterBuilder$Composite.printTo(DateTimeFormatterBuilder.java:681)
	at org.joda.time.format.DateTimeFormatter.printTo(DateTimeFormatter.java:609)
	at org.joda.time.format.DateTimeFormatter.print(DateTimeFormatter.java:663)
	at org.joda.time.base.AbstractPartial.toString(AbstractPartial.java:412)
	at org.joda.time.TestPartial_Basics.testToString_DTFormatter(TestPartial_Basics.java:893)

testWithField1(org.joda.time.TestPartial_Basics)  Time elapsed: 0 sec  <<< ERROR!
java.lang.ArrayIndexOutOfBoundsException: -1
	at org.joda.time.format.DateTimeFormatterBuilder$Composite.printTo(DateTimeFormatterBuilder.java:681)
	at org.joda.time.format.DateTimeFormatter.printTo(DateTimeFormatter.java:609)
	at org.joda.time.format.DateTimeFormatter.print(DateTimeFormatter.java:663)
	at org.joda.time.Partial.toString(Partial.java:781)
	at org.joda.time.TestPartial_Basics.check(TestPartial_Basics.java:927)
	at org.joda.time.TestPartial_Basics.testWithField1(TestPartial_Basics.java:521)

testWithField2(org.joda.time.TestPartial_Basics)  Time elapsed: 0 sec  <<< ERROR!
java.lang.ArrayIndexOutOfBoundsException: -1
	at org.joda.time.format.DateTimeFormatterBuilder$Composite.printTo(DateTimeFormatterBuilder.java:681)
	at org.joda.time.format.DateTimeFormatter.printTo(DateTimeFormatter.java:609)
	at org.joda.time.format.DateTimeFormatter.print(DateTimeFormatter.java:663)
	at org.joda.time.Partial.toString(Partial.java:781)
	at org.joda.time.TestPartial_Basics.check(TestPartial_Basics.java:927)
	at org.joda.time.TestPartial_Basics.testWithField2(TestPartial_Basics.java:531)

testWithFieldAdded1(org.joda.time.TestPartial_Basics)  Time elapsed: 0.001 sec  <<< ERROR!
java.lang.ArrayIndexOutOfBoundsException: -1
	at org.joda.time.format.DateTimeFormatterBuilder$Composite.printTo(DateTimeFormatterBuilder.java:681)
	at org.joda.time.format.DateTimeFormatter.printTo(DateTimeFormatter.java:609)
	at org.joda.time.format.DateTimeFormatter.print(DateTimeFormatter.java:663)
	at org.joda.time.Partial.toString(Partial.java:781)
	at org.joda.time.TestPartial_Basics.check(TestPartial_Basics.java:927)
	at org.joda.time.TestPartial_Basics.testWithFieldAdded1(TestPartial_Basics.java:555)

testWithFieldAdded2(org.joda.time.TestPartial_Basics)  Time elapsed: 0 sec  <<< ERROR!
java.lang.ArrayIndexOutOfBoundsException: -1
	at org.joda.time.format.DateTimeFormatterBuilder$Composite.printTo(DateTimeFormatterBuilder.java:681)
	at org.joda.time.format.DateTimeFormatter.printTo(DateTimeFormatter.java:609)
	at org.joda.time.format.DateTimeFormatter.print(DateTimeFormatter.java:663)
	at org.joda.time.Partial.toString(Partial.java:781)
	at org.joda.time.TestPartial_Basics.check(TestPartial_Basics.java:927)
	at org.joda.time.TestPartial_Basics.testWithFieldAdded2(TestPartial_Basics.java:565)

testWithFieldAdded3(org.joda.time.TestPartial_Basics)  Time elapsed: 0.001 sec  <<< ERROR!
java.lang.ArrayIndexOutOfBoundsException: -1
	at org.joda.time.format.DateTimeFormatterBuilder$Composite.printTo(DateTimeFormatterBuilder.java:681)
	at org.joda.time.format.DateTimeFormatter.printTo(DateTimeFormatter.java:609)
	at org.joda.time.format.DateTimeFormatter.print(DateTimeFormatter.java:663)
	at org.joda.time.Partial.toString(Partial.java:781)
	at org.joda.time.TestPartial_Basics.check(TestPartial_Basics.java:927)
	at org.joda.time.TestPartial_Basics.testWithFieldAdded3(TestPartial_Basics.java:574)

testPlus_RP(org.joda.time.TestPartial_Basics)  Time elapsed: 0 sec  <<< ERROR!
java.lang.ArrayIndexOutOfBoundsException: -1
	at org.joda.time.format.DateTimeFormatterBuilder$Composite.printTo(DateTimeFormatterBuilder.java:681)
	at org.joda.time.format.DateTimeFormatter.printTo(DateTimeFormatter.java:609)
	at org.joda.time.format.DateTimeFormatter.print(DateTimeFormatter.java:663)
	at org.joda.time.Partial.toString(Partial.java:781)
	at org.joda.time.TestPartial_Basics.check(TestPartial_Basics.java:927)
	at org.joda.time.TestPartial_Basics.testPlus_RP(TestPartial_Basics.java:723)

testMinus_RP(org.joda.time.TestPartial_Basics)  Time elapsed: 0 sec  <<< ERROR!
java.lang.ArrayIndexOutOfBoundsException: -1
	at org.joda.time.format.DateTimeFormatterBuilder$Composite.printTo(DateTimeFormatterBuilder.java:681)
	at org.joda.time.format.DateTimeFormatter.printTo(DateTimeFormatter.java:609)
	at org.joda.time.format.DateTimeFormatter.print(DateTimeFormatter.java:663)
	at org.joda.time.Partial.toString(Partial.java:781)
	at org.joda.time.TestPartial_Basics.check(TestPartial_Basics.java:927)
	at org.joda.time.TestPartial_Basics.testMinus_RP(TestPartial_Basics.java:734)

testToDateTime_RI(org.joda.time.TestPartial_Basics)  Time elapsed: 0 sec  <<< ERROR!
java.lang.ArrayIndexOutOfBoundsException: -1
	at org.joda.time.format.DateTimeFormatterBuilder$Composite.printTo(DateTimeFormatterBuilder.java:681)
	at org.joda.time.format.DateTimeFormatter.printTo(DateTimeFormatter.java:609)
	at org.joda.time.format.DateTimeFormatter.print(DateTimeFormatter.java:663)
	at org.joda.time.Partial.toString(Partial.java:781)
	at org.joda.time.TestPartial_Basics.check(TestPartial_Basics.java:927)
	at org.joda.time.TestPartial_Basics.testToDateTime_RI(TestPartial_Basics.java:748)

testToDateTime_nullRI(org.joda.time.TestPartial_Basics)  Time elapsed: 0 sec  <<< ERROR!
java.lang.ArrayIndexOutOfBoundsException: -1
	at org.joda.time.format.DateTimeFormatterBuilder$Composite.printTo(DateTimeFormatterBuilder.java:681)
	at org.joda.time.format.DateTimeFormatter.printTo(DateTimeFormatter.java:609)
	at org.joda.time.format.DateTimeFormatter.print(DateTimeFormatter.java:663)
	at org.joda.time.Partial.toString(Partial.java:781)
	at org.joda.time.TestPartial_Basics.check(TestPartial_Basics.java:927)
	at org.joda.time.TestPartial_Basics.testToDateTime_nullRI(TestPartial_Basics.java:758)

testWithField3(org.joda.time.TestPartial_Basics)  Time elapsed: 0.001 sec  <<< ERROR!
java.lang.ArrayIndexOutOfBoundsException: -1
	at org.joda.time.format.DateTimeFormatterBuilder$Composite.printTo(DateTimeFormatterBuilder.java:681)
	at org.joda.time.format.DateTimeFormatter.printTo(DateTimeFormatter.java:609)
	at org.joda.time.format.DateTimeFormatter.print(DateTimeFormatter.java:663)
	at org.joda.time.Partial.toString(Partial.java:781)
	at org.joda.time.TestPartial_Basics.check(TestPartial_Basics.java:927)
	at org.joda.time.TestPartial_Basics.testWithField3(TestPartial_Basics.java:540)

testWithChronologyRetainFields_Chrono(org.joda.time.TestPartial_Basics)  Time elapsed: 0.001 sec  <<< ERROR!
java.lang.ArrayIndexOutOfBoundsException: -1
	at org.joda.time.format.DateTimeFormatterBuilder$Composite.printTo(DateTimeFormatterBuilder.java:681)
	at org.joda.time.format.DateTimeFormatter.printTo(DateTimeFormatter.java:609)
	at org.joda.time.format.DateTimeFormatter.print(DateTimeFormatter.java:663)
	at org.joda.time.Partial.toString(Partial.java:781)
	at org.joda.time.TestPartial_Basics.check(TestPartial_Basics.java:927)
	at org.joda.time.TestPartial_Basics.testWithChronologyRetainFields_Chrono(TestPartial_Basics.java:322)

testWithChronologyRetainFields_nullChrono(org.joda.time.TestPartial_Basics)  Time elapsed: 0 sec  <<< ERROR!
java.lang.ArrayIndexOutOfBoundsException: -1
	at org.joda.time.format.DateTimeFormatterBuilder$Composite.printTo(DateTimeFormatterBuilder.java:681)
	at org.joda.time.format.DateTimeFormatter.printTo(DateTimeFormatter.java:609)
	at org.joda.time.format.DateTimeFormatter.print(DateTimeFormatter.java:663)
	at org.joda.time.Partial.toString(Partial.java:781)
	at org.joda.time.TestPartial_Basics.check(TestPartial_Basics.java:927)
	at org.joda.time.TestPartial_Basics.testWithChronologyRetainFields_nullChrono(TestPartial_Basics.java:337)

testWithFieldAdded5(org.joda.time.TestPartial_Basics)  Time elapsed: 0.001 sec  <<< ERROR!
java.lang.ArrayIndexOutOfBoundsException: -1
	at org.joda.time.format.DateTimeFormatterBuilder$Composite.printTo(DateTimeFormatterBuilder.java:681)
	at org.joda.time.format.DateTimeFormatter.printTo(DateTimeFormatter.java:609)
	at org.joda.time.format.DateTimeFormatter.print(DateTimeFormatter.java:663)
	at org.joda.time.Partial.toString(Partial.java:781)
	at org.joda.time.TestPartial_Basics.check(TestPartial_Basics.java:927)
	at org.joda.time.TestPartial_Basics.testWithFieldAdded5(TestPartial_Basics.java:589)

testWithFieldAdded6(org.joda.time.TestPartial_Basics)  Time elapsed: 0 sec  <<< ERROR!
java.lang.ArrayIndexOutOfBoundsException: -1
	at org.joda.time.format.DateTimeFormatterBuilder$Composite.printTo(DateTimeFormatterBuilder.java:681)
	at org.joda.time.format.DateTimeFormatter.printTo(DateTimeFormatter.java:609)
	at org.joda.time.format.DateTimeFormatter.print(DateTimeFormatter.java:663)
	at org.joda.time.Partial.toString(Partial.java:781)
	at org.joda.time.TestPartial_Basics.check(TestPartial_Basics.java:927)
	at org.joda.time.TestPartial_Basics.testWithFieldAdded6(TestPartial_Basics.java:600)

testWithFieldAdded7(org.joda.time.TestPartial_Basics)  Time elapsed: 0 sec  <<< ERROR!
java.lang.ArrayIndexOutOfBoundsException: -1
	at org.joda.time.format.DateTimeFormatterBuilder$Composite.printTo(DateTimeFormatterBuilder.java:681)
	at org.joda.time.format.DateTimeFormatter.printTo(DateTimeFormatter.java:609)
	at org.joda.time.format.DateTimeFormatter.print(DateTimeFormatter.java:663)
	at org.joda.time.Partial.toString(Partial.java:781)
	at org.joda.time.TestPartial_Basics.check(TestPartial_Basics.java:927)
	at org.joda.time.TestPartial_Basics.testWithFieldAdded7(TestPartial_Basics.java:611)

testWithFieldAdded8(org.joda.time.TestPartial_Basics)  Time elapsed: 0.001 sec  <<< ERROR!
java.lang.ArrayIndexOutOfBoundsException: -1
	at org.joda.time.format.DateTimeFormatterBuilder$Composite.printTo(DateTimeFormatterBuilder.java:681)
	at org.joda.time.format.DateTimeFormatter.printTo(DateTimeFormatter.java:609)
	at org.joda.time.format.DateTimeFormatter.print(DateTimeFormatter.java:663)
	at org.joda.time.Partial.toString(Partial.java:781)
	at org.joda.time.TestPartial_Basics.check(TestPartial_Basics.java:927)
	at org.joda.time.TestPartial_Basics.testWithFieldAdded8(TestPartial_Basics.java:631)

testWith1(org.joda.time.TestPartial_Basics)  Time elapsed: 0.001 sec  <<< ERROR!
java.lang.ArrayIndexOutOfBoundsException: -1
	at org.joda.time.format.DateTimeFormatterBuilder$Composite.printTo(DateTimeFormatterBuilder.java:681)
	at org.joda.time.format.DateTimeFormatter.printTo(DateTimeFormatter.java:609)
	at org.joda.time.format.DateTimeFormatter.print(DateTimeFormatter.java:663)
	at org.joda.time.Partial.toString(Partial.java:781)
	at org.joda.time.TestPartial_Basics.check(TestPartial_Basics.java:927)
	at org.joda.time.TestPartial_Basics.testWith1(TestPartial_Basics.java:347)

testWith2(org.joda.time.TestPartial_Basics)  Time elapsed: 0 sec  <<< ERROR!
java.lang.ArrayIndexOutOfBoundsException: -1
	at org.joda.time.format.DateTimeFormatterBuilder$Composite.printTo(DateTimeFormatterBuilder.java:681)
	at org.joda.time.format.DateTimeFormatter.printTo(DateTimeFormatter.java:609)
	at org.joda.time.format.DateTimeFormatter.print(DateTimeFormatter.java:663)
	at org.joda.time.Partial.toString(Partial.java:781)
	at org.joda.time.TestPartial_Basics.check(TestPartial_Basics.java:927)
	at org.joda.time.TestPartial_Basics.testWith2(TestPartial_Basics.java:357)

testWith3(org.joda.time.TestPartial_Basics)  Time elapsed: 0.001 sec  <<< ERROR!
java.lang.ArrayIndexOutOfBoundsException: -1
	at org.joda.time.format.DateTimeFormatterBuilder$Composite.printTo(DateTimeFormatterBuilder.java:681)
	at org.joda.time.format.DateTimeFormatter.printTo(DateTimeFormatter.java:609)
	at org.joda.time.format.DateTimeFormatter.print(DateTimeFormatter.java:663)
	at org.joda.time.Partial.toString(Partial.java:781)
	at org.joda.time.TestPartial_Basics.check(TestPartial_Basics.java:927)
	at org.joda.time.TestPartial_Basics.testWith3(TestPartial_Basics.java:366)

testWith3a(org.joda.time.TestPartial_Basics)  Time elapsed: 0.001 sec  <<< ERROR!
java.lang.ArrayIndexOutOfBoundsException: -1
	at org.joda.time.format.DateTimeFormatterBuilder$Composite.printTo(DateTimeFormatterBuilder.java:681)
	at org.joda.time.format.DateTimeFormatter.printTo(DateTimeFormatter.java:609)
	at org.joda.time.format.DateTimeFormatter.print(DateTimeFormatter.java:663)
	at org.joda.time.Partial.toString(Partial.java:781)
	at org.joda.time.TestPartial_Basics.check(TestPartial_Basics.java:927)
	at org.joda.time.TestPartial_Basics.testWith3a(TestPartial_Basics.java:372)

testWithout1(org.joda.time.TestPartial_Basics)  Time elapsed: 0.001 sec  <<< ERROR!
java.lang.ArrayIndexOutOfBoundsException: -1
	at org.joda.time.format.DateTimeFormatterBuilder$Composite.printTo(DateTimeFormatterBuilder.java:681)
	at org.joda.time.format.DateTimeFormatter.printTo(DateTimeFormatter.java:609)
	at org.joda.time.format.DateTimeFormatter.print(DateTimeFormatter.java:663)
	at org.joda.time.Partial.toString(Partial.java:781)
	at org.joda.time.TestPartial_Basics.check(TestPartial_Basics.java:927)
	at org.joda.time.TestPartial_Basics.testWithout1(TestPartial_Basics.java:479)

testWithout2(org.joda.time.TestPartial_Basics)  Time elapsed: 0.001 sec  <<< ERROR!
java.lang.ArrayIndexOutOfBoundsException: -1
	at org.joda.time.format.DateTimeFormatterBuilder$Composite.printTo(DateTimeFormatterBuilder.java:681)
	at org.joda.time.format.DateTimeFormatter.printTo(DateTimeFormatter.java:609)
	at org.joda.time.format.DateTimeFormatter.print(DateTimeFormatter.java:663)
	at org.joda.time.Partial.toString(Partial.java:781)
	at org.joda.time.TestPartial_Basics.check(TestPartial_Basics.java:927)
	at org.joda.time.TestPartial_Basics.testWithout2(TestPartial_Basics.java:486)

testWithout3(org.joda.time.TestPartial_Basics)  Time elapsed: 0 sec  <<< ERROR!
java.lang.ArrayIndexOutOfBoundsException: -1
	at org.joda.time.format.DateTimeFormatterBuilder$Composite.printTo(DateTimeFormatterBuilder.java:681)
	at org.joda.time.format.DateTimeFormatter.printTo(DateTimeFormatter.java:609)
	at org.joda.time.format.DateTimeFormatter.print(DateTimeFormatter.java:663)
	at org.joda.time.Partial.toString(Partial.java:781)
	at org.joda.time.TestPartial_Basics.check(TestPartial_Basics.java:927)
	at org.joda.time.TestPartial_Basics.testWithout3(TestPartial_Basics.java:493)

testWithout4(org.joda.time.TestPartial_Basics)  Time elapsed: 0.001 sec  <<< ERROR!
java.lang.ArrayIndexOutOfBoundsException: -1
	at org.joda.time.format.DateTimeFormatterBuilder$Composite.printTo(DateTimeFormatterBuilder.java:681)
	at org.joda.time.format.DateTimeFormatter.printTo(DateTimeFormatter.java:609)
	at org.joda.time.format.DateTimeFormatter.print(DateTimeFormatter.java:663)
	at org.joda.time.Partial.toString(Partial.java:781)
	at org.joda.time.TestPartial_Basics.check(TestPartial_Basics.java:927)
	at org.joda.time.TestPartial_Basics.testWithout4(TestPartial_Basics.java:503)

testWithFieldAddWrapped1(org.joda.time.TestPartial_Basics)  Time elapsed: 0.001 sec  <<< ERROR!
java.lang.ArrayIndexOutOfBoundsException: -1
	at org.joda.time.format.DateTimeFormatterBuilder$Composite.printTo(DateTimeFormatterBuilder.java:681)
	at org.joda.time.format.DateTimeFormatter.printTo(DateTimeFormatter.java:609)
	at org.joda.time.format.DateTimeFormatter.print(DateTimeFormatter.java:663)
	at org.joda.time.Partial.toString(Partial.java:781)
	at org.joda.time.TestPartial_Basics.check(TestPartial_Basics.java:927)
	at org.joda.time.TestPartial_Basics.testWithFieldAddWrapped1(TestPartial_Basics.java:649)

testWithFieldAddWrapped2(org.joda.time.TestPartial_Basics)  Time elapsed: 0.001 sec  <<< ERROR!
java.lang.ArrayIndexOutOfBoundsException: -1
	at org.joda.time.format.DateTimeFormatterBuilder$Composite.printTo(DateTimeFormatterBuilder.java:681)
	at org.joda.time.format.DateTimeFormatter.printTo(DateTimeFormatter.java:609)
	at org.joda.time.format.DateTimeFormatter.print(DateTimeFormatter.java:663)
	at org.joda.time.Partial.toString(Partial.java:781)
	at org.joda.time.TestPartial_Basics.check(TestPartial_Basics.java:927)
	at org.joda.time.TestPartial_Basics.testWithFieldAddWrapped2(TestPartial_Basics.java:659)

testWithFieldAddWrapped3(org.joda.time.TestPartial_Basics)  Time elapsed: 0.001 sec  <<< ERROR!
java.lang.ArrayIndexOutOfBoundsException: -1
	at org.joda.time.format.DateTimeFormatterBuilder$Composite.printTo(DateTimeFormatterBuilder.java:681)
	at org.joda.time.format.DateTimeFormatter.printTo(DateTimeFormatter.java:609)
	at org.joda.time.format.DateTimeFormatter.print(DateTimeFormatter.java:663)
	at org.joda.time.Partial.toString(Partial.java:781)
	at org.joda.time.TestPartial_Basics.check(TestPartial_Basics.java:927)
	at org.joda.time.TestPartial_Basics.testWithFieldAddWrapped3(TestPartial_Basics.java:668)

testWith3b(org.joda.time.TestPartial_Basics)  Time elapsed: 0 sec  <<< ERROR!
java.lang.ArrayIndexOutOfBoundsException: -1
	at org.joda.time.format.DateTimeFormatterBuilder$Composite.printTo(DateTimeFormatterBuilder.java:681)
	at org.joda.time.format.DateTimeFormatter.printTo(DateTimeFormatter.java:609)
	at org.joda.time.format.DateTimeFormatter.print(DateTimeFormatter.java:663)
	at org.joda.time.Partial.toString(Partial.java:781)
	at org.joda.time.TestPartial_Basics.check(TestPartial_Basics.java:927)
	at org.joda.time.TestPartial_Basics.testWith3b(TestPartial_Basics.java:388)

testWith3c(org.joda.time.TestPartial_Basics)  Time elapsed: 0 sec  <<< ERROR!
java.lang.ArrayIndexOutOfBoundsException: -1
	at org.joda.time.format.DateTimeFormatterBuilder$Composite.printTo(DateTimeFormatterBuilder.java:681)
	at org.joda.time.format.DateTimeFormatter.printTo(DateTimeFormatter.java:609)
	at org.joda.time.format.DateTimeFormatter.print(DateTimeFormatter.java:663)
	at org.joda.time.Partial.toString(Partial.java:781)
	at org.joda.time.TestPartial_Basics.check(TestPartial_Basics.java:927)
	at org.joda.time.TestPartial_Basics.testWith3c(TestPartial_Basics.java:404)

testWithFieldAddWrapped5(org.joda.time.TestPartial_Basics)  Time elapsed: 0.001 sec  <<< ERROR!
java.lang.ArrayIndexOutOfBoundsException: -1
	at org.joda.time.format.DateTimeFormatterBuilder$Composite.printTo(DateTimeFormatterBuilder.java:681)
	at org.joda.time.format.DateTimeFormatter.printTo(DateTimeFormatter.java:609)
	at org.joda.time.format.DateTimeFormatter.print(DateTimeFormatter.java:663)
	at org.joda.time.Partial.toString(Partial.java:781)
	at org.joda.time.TestPartial_Basics.check(TestPartial_Basics.java:927)
	at org.joda.time.TestPartial_Basics.testWithFieldAddWrapped5(TestPartial_Basics.java:683)

testWithFieldAddWrapped6(org.joda.time.TestPartial_Basics)  Time elapsed: 0.001 sec  <<< ERROR!
java.lang.ArrayIndexOutOfBoundsException: -1
	at org.joda.time.format.DateTimeFormatterBuilder$Composite.printTo(DateTimeFormatterBuilder.java:681)
	at org.joda.time.format.DateTimeFormatter.printTo(DateTimeFormatter.java:609)
	at org.joda.time.format.DateTimeFormatter.print(DateTimeFormatter.java:663)
	at org.joda.time.Partial.toString(Partial.java:781)
	at org.joda.time.TestPartial_Basics.check(TestPartial_Basics.java:927)
	at org.joda.time.TestPartial_Basics.testWithFieldAddWrapped6(TestPartial_Basics.java:691)

testWithFieldAddWrapped7(org.joda.time.TestPartial_Basics)  Time elapsed: 0 sec  <<< ERROR!
java.lang.ArrayIndexOutOfBoundsException: -1
	at org.joda.time.format.DateTimeFormatterBuilder$Composite.printTo(DateTimeFormatterBuilder.java:681)
	at org.joda.time.format.DateTimeFormatter.printTo(DateTimeFormatter.java:609)
	at org.joda.time.format.DateTimeFormatter.print(DateTimeFormatter.java:663)
	at org.joda.time.Partial.toString(Partial.java:781)
	at org.joda.time.TestPartial_Basics.check(TestPartial_Basics.java:927)
	at org.joda.time.TestPartial_Basics.testWithFieldAddWrapped7(TestPartial_Basics.java:698)

testWithFieldAddWrapped8(org.joda.time.TestPartial_Basics)  Time elapsed: 0.001 sec  <<< ERROR!
java.lang.ArrayIndexOutOfBoundsException: -1
	at org.joda.time.format.DateTimeFormatterBuilder$Composite.printTo(DateTimeFormatterBuilder.java:681)
	at org.joda.time.format.DateTimeFormatter.printTo(DateTimeFormatter.java:609)
	at org.joda.time.format.DateTimeFormatter.print(DateTimeFormatter.java:663)
	at org.joda.time.Partial.toString(Partial.java:781)
	at org.joda.time.TestPartial_Basics.check(TestPartial_Basics.java:927)
	at org.joda.time.TestPartial_Basics.testWithFieldAddWrapped8(TestPartial_Basics.java:710)

testGetFormatter1(org.joda.time.TestPartial_Basics)  Time elapsed: 0.001 sec  <<< ERROR!
java.lang.ArrayIndexOutOfBoundsException: -1
	at org.joda.time.format.DateTimeFormatterBuilder$Composite.printTo(DateTimeFormatterBuilder.java:681)
	at org.joda.time.format.DateTimeFormatter.printTo(DateTimeFormatter.java:609)
	at org.joda.time.format.DateTimeFormatter.print(DateTimeFormatter.java:663)
	at org.joda.time.TestPartial_Basics.testGetFormatter1(TestPartial_Basics.java:804)

testGetFormatter3(org.joda.time.TestPartial_Basics)  Time elapsed: 0.001 sec  <<< ERROR!
java.lang.ArrayIndexOutOfBoundsException: -1
	at org.joda.time.format.DateTimeFormatterBuilder$Composite.printTo(DateTimeFormatterBuilder.java:681)
	at org.joda.time.format.DateTimeFormatter.printTo(DateTimeFormatter.java:609)
	at org.joda.time.format.DateTimeFormatter.print(DateTimeFormatter.java:663)
	at org.joda.time.TestPartial_Basics.testGetFormatter3(TestPartial_Basics.java:826)

testToString1(org.joda.time.TestPartial_Basics)  Time elapsed: 0 sec  <<< ERROR!
java.lang.ArrayIndexOutOfBoundsException: -1
	at org.joda.time.format.DateTimeFormatterBuilder$Composite.printTo(DateTimeFormatterBuilder.java:681)
	at org.joda.time.format.DateTimeFormatter.printTo(DateTimeFormatter.java:609)
	at org.joda.time.format.DateTimeFormatter.print(DateTimeFormatter.java:663)
	at org.joda.time.Partial.toString(Partial.java:781)
	at org.joda.time.TestPartial_Basics.testToString1(TestPartial_Basics.java:836)

testToString3(org.joda.time.TestPartial_Basics)  Time elapsed: 0 sec  <<< ERROR!
java.lang.ArrayIndexOutOfBoundsException: -1
	at org.joda.time.format.DateTimeFormatterBuilder$Composite.printTo(DateTimeFormatterBuilder.java:681)
	at org.joda.time.format.DateTimeFormatter.printTo(DateTimeFormatter.java:609)
	at org.joda.time.format.DateTimeFormatter.print(DateTimeFormatter.java:663)
	at org.joda.time.Partial.toString(Partial.java:781)
	at org.joda.time.TestPartial_Basics.testToString3(TestPartial_Basics.java:849)

testToString4(org.joda.time.TestPartial_Basics)  Time elapsed: 0.001 sec  <<< ERROR!
java.lang.ArrayIndexOutOfBoundsException: -1
	at org.joda.time.format.DateTimeFormatterBuilder$Composite.printTo(DateTimeFormatterBuilder.java:681)
	at org.joda.time.format.DateTimeFormatter.printTo(DateTimeFormatter.java:609)
	at org.joda.time.format.DateTimeFormatter.print(DateTimeFormatter.java:663)
	at org.joda.time.Partial.toString(Partial.java:781)
	at org.joda.time.TestPartial_Basics.testToString4(TestPartial_Basics.java:860)

test_LocalDate_new_Gaza(org.joda.time.TestDateTimeZoneCutover)  Time elapsed: 0 sec  <<< ERROR!
java.lang.ArrayIndexOutOfBoundsException: -1
	at org.joda.time.format.DateTimeFormatterBuilder$Composite.printTo(DateTimeFormatterBuilder.java:681)
	at org.joda.time.format.DateTimeFormatter.printTo(DateTimeFormatter.java:609)
	at org.joda.time.format.DateTimeFormatter.print(DateTimeFormatter.java:663)
	at org.joda.time.LocalDate.toString(LocalDate.java:1832)
	at org.joda.time.TestDateTimeZoneCutover.test_LocalDate_new_Gaza(TestDateTimeZoneCutover.java:216)

test_LocalDate_new_Turk(org.joda.time.TestDateTimeZoneCutover)  Time elapsed: 0 sec  <<< ERROR!
java.lang.ArrayIndexOutOfBoundsException: -1
	at org.joda.time.format.DateTimeFormatterBuilder$Composite.printTo(DateTimeFormatterBuilder.java:681)
	at org.joda.time.format.DateTimeFormatter.printTo(DateTimeFormatter.java:609)
	at org.joda.time.format.DateTimeFormatter.print(DateTimeFormatter.java:663)
	at org.joda.time.LocalDate.toString(LocalDate.java:1832)
	at org.joda.time.TestDateTimeZoneCutover.test_LocalDate_new_Turk(TestDateTimeZoneCutover.java:433)

test_DateTime_JustAfterLastEverOverlap(org.joda.time.TestDateTimeZoneCutover)  Time elapsed: 0.003 sec  <<< ERROR!
java.lang.ArrayIndexOutOfBoundsException: -1
	at org.joda.time.format.DateTimeFormatterBuilder$Composite.printTo(DateTimeFormatterBuilder.java:681)
	at org.joda.time.format.DateTimeFormatter.printTo(DateTimeFormatter.java:609)
	at org.joda.time.format.DateTimeFormatter.print(DateTimeFormatter.java:663)
	at org.joda.time.LocalDate.toString(LocalDate.java:1832)
	at org.joda.time.TestDateTimeZoneCutover.test_DateTime_JustAfterLastEverOverlap(TestDateTimeZoneCutover.java:1099)

testLocalDateTime(org.joda.time.TestStringConvert)  Time elapsed: 0.031 sec  <<< ERROR!
java.lang.ArrayIndexOutOfBoundsException: -1
	at org.joda.time.format.DateTimeFormatterBuilder$Composite.printTo(DateTimeFormatterBuilder.java:681)
	at org.joda.time.format.DateTimeFormatter.printTo(DateTimeFormatter.java:609)
	at org.joda.time.format.DateTimeFormatter.print(DateTimeFormatter.java:663)
	at org.joda.time.LocalDateTime.toString(LocalDateTime.java:2087)
	at sun.reflect.NativeMethodAccessorImpl.invoke0(Native Method)
	at sun.reflect.NativeMethodAccessorImpl.invoke(NativeMethodAccessorImpl.java:57)
	at sun.reflect.DelegatingMethodAccessorImpl.invoke(DelegatingMethodAccessorImpl.java:43)
	at java.lang.reflect.Method.invoke(Method.java:606)
	at org.joda.convert.ReflectionStringConverter.convertToString(ReflectionStringConverter.java:63)
	at org.joda.convert.StringConvert.convertToString(StringConvert.java:124)
	at org.joda.time.TestStringConvert.testLocalDateTime(TestStringConvert.java:76)

testLocalDate(org.joda.time.TestStringConvert)  Time elapsed: 0.004 sec  <<< ERROR!
java.lang.ArrayIndexOutOfBoundsException: -1
	at org.joda.time.format.DateTimeFormatterBuilder$Composite.printTo(DateTimeFormatterBuilder.java:681)
	at org.joda.time.format.DateTimeFormatter.printTo(DateTimeFormatter.java:609)
	at org.joda.time.format.DateTimeFormatter.print(DateTimeFormatter.java:663)
	at org.joda.time.LocalDate.toString(LocalDate.java:1832)
	at sun.reflect.NativeMethodAccessorImpl.invoke0(Native Method)
	at sun.reflect.NativeMethodAccessorImpl.invoke(NativeMethodAccessorImpl.java:57)
	at sun.reflect.DelegatingMethodAccessorImpl.invoke(DelegatingMethodAccessorImpl.java:43)
	at java.lang.reflect.Method.invoke(Method.java:606)
	at org.joda.convert.ReflectionStringConverter.convertToString(ReflectionStringConverter.java:63)
	at org.joda.convert.StringConvert.convertToString(StringConvert.java:124)
	at org.joda.time.TestStringConvert.testLocalDate(TestStringConvert.java:83)

testLocalTime(org.joda.time.TestStringConvert)  Time elapsed: 0.001 sec  <<< ERROR!
java.lang.ArrayIndexOutOfBoundsException: -1
	at org.joda.time.format.DateTimeFormatterBuilder$Composite.printTo(DateTimeFormatterBuilder.java:681)
	at org.joda.time.format.DateTimeFormatter.printTo(DateTimeFormatter.java:609)
	at org.joda.time.format.DateTimeFormatter.print(DateTimeFormatter.java:663)
	at org.joda.time.LocalTime.toString(LocalTime.java:1299)
	at sun.reflect.NativeMethodAccessorImpl.invoke0(Native Method)
	at sun.reflect.NativeMethodAccessorImpl.invoke(NativeMethodAccessorImpl.java:57)
	at sun.reflect.DelegatingMethodAccessorImpl.invoke(DelegatingMethodAccessorImpl.java:43)
	at java.lang.reflect.Method.invoke(Method.java:606)
	at org.joda.convert.ReflectionStringConverter.convertToString(ReflectionStringConverter.java:63)
	at org.joda.convert.StringConvert.convertToString(StringConvert.java:124)
	at org.joda.time.TestStringConvert.testLocalTime(TestStringConvert.java:90)

testYearMonth(org.joda.time.TestStringConvert)  Time elapsed: 0.001 sec  <<< ERROR!
java.lang.ArrayIndexOutOfBoundsException: -1
	at org.joda.time.format.DateTimeFormatterBuilder$Composite.printTo(DateTimeFormatterBuilder.java:681)
	at org.joda.time.format.DateTimeFormatter.printTo(DateTimeFormatter.java:609)
	at org.joda.time.format.DateTimeFormatter.print(DateTimeFormatter.java:663)
	at org.joda.time.YearMonth.toString(YearMonth.java:797)
	at sun.reflect.NativeMethodAccessorImpl.invoke0(Native Method)
	at sun.reflect.NativeMethodAccessorImpl.invoke(NativeMethodAccessorImpl.java:57)
	at sun.reflect.DelegatingMethodAccessorImpl.invoke(DelegatingMethodAccessorImpl.java:43)
	at java.lang.reflect.Method.invoke(Method.java:606)
	at org.joda.convert.ReflectionStringConverter.convertToString(ReflectionStringConverter.java:63)
	at org.joda.convert.StringConvert.convertToString(StringConvert.java:124)
	at org.joda.time.TestStringConvert.testYearMonth(TestStringConvert.java:97)

testMonthDay(org.joda.time.TestStringConvert)  Time elapsed: 0.002 sec  <<< ERROR!
java.lang.ArrayIndexOutOfBoundsException: -1
	at org.joda.time.format.DateTimeFormatterBuilder$Composite.printTo(DateTimeFormatterBuilder.java:681)
	at org.joda.time.format.DateTimeFormatter.printTo(DateTimeFormatter.java:609)
	at org.joda.time.format.DateTimeFormatter.print(DateTimeFormatter.java:663)
	at org.joda.time.MonthDay.toString(MonthDay.java:786)
	at sun.reflect.NativeMethodAccessorImpl.invoke0(Native Method)
	at sun.reflect.NativeMethodAccessorImpl.invoke(NativeMethodAccessorImpl.java:57)
	at sun.reflect.DelegatingMethodAccessorImpl.invoke(DelegatingMethodAccessorImpl.java:43)
	at java.lang.reflect.Method.invoke(Method.java:606)
	at org.joda.convert.ReflectionStringConverter.convertToString(ReflectionStringConverter.java:63)
	at org.joda.convert.StringConvert.convertToString(StringConvert.java:124)
	at org.joda.time.TestStringConvert.testMonthDay(TestStringConvert.java:104)

testMonthDay_leapDay(org.joda.time.TestStringConvert)  Time elapsed: 0.001 sec  <<< ERROR!
java.lang.ArrayIndexOutOfBoundsException: -1
	at org.joda.time.format.DateTimeFormatterBuilder$Composite.printTo(DateTimeFormatterBuilder.java:681)
	at org.joda.time.format.DateTimeFormatter.printTo(DateTimeFormatter.java:609)
	at org.joda.time.format.DateTimeFormatter.print(DateTimeFormatter.java:663)
	at org.joda.time.MonthDay.toString(MonthDay.java:786)
	at sun.reflect.NativeMethodAccessorImpl.invoke0(Native Method)
	at sun.reflect.NativeMethodAccessorImpl.invoke(NativeMethodAccessorImpl.java:57)
	at sun.reflect.DelegatingMethodAccessorImpl.invoke(DelegatingMethodAccessorImpl.java:43)
	at java.lang.reflect.Method.invoke(Method.java:606)
	at org.joda.convert.ReflectionStringConverter.convertToString(ReflectionStringConverter.java:63)
	at org.joda.convert.StringConvert.convertToString(StringConvert.java:124)
	at org.joda.time.TestStringConvert.testMonthDay_leapDay(TestStringConvert.java:111)

testPrint_bufferMethods(org.joda.time.format.TestDateTimeFormatter)  Time elapsed: 0.001 sec  <<< ERROR!
java.lang.ArrayIndexOutOfBoundsException: -1
	at org.joda.time.format.DateTimeFormatterBuilder$Composite.printTo(DateTimeFormatterBuilder.java:681)
	at org.joda.time.format.DateTimeFormatter.printTo(DateTimeFormatter.java:609)
	at org.joda.time.format.DateTimeFormatter.printTo(DateTimeFormatter.java:575)
	at org.joda.time.format.TestDateTimeFormatter.testPrint_bufferMethods(TestDateTimeFormatter.java:171)

testPrint_writerMethods(org.joda.time.format.TestDateTimeFormatter)  Time elapsed: 0.001 sec  <<< ERROR!
java.lang.ArrayIndexOutOfBoundsException: -1
	at org.joda.time.format.DateTimeFormatterBuilder$Composite.printTo(DateTimeFormatterBuilder.java:681)
	at org.joda.time.format.DateTimeFormatter.printTo(DateTimeFormatter.java:609)
	at org.joda.time.format.DateTimeFormatter.printTo(DateTimeFormatter.java:591)
	at org.joda.time.format.TestDateTimeFormatter.testPrint_writerMethods(TestDateTimeFormatter.java:193)

testPrint_appendableMethods(org.joda.time.format.TestDateTimeFormatter)  Time elapsed: 0.001 sec  <<< ERROR!
java.lang.ArrayIndexOutOfBoundsException: -1
	at org.joda.time.format.DateTimeFormatterBuilder$Composite.printTo(DateTimeFormatterBuilder.java:681)
	at org.joda.time.format.DateTimeFormatter.printTo(DateTimeFormatter.java:609)
	at org.joda.time.format.TestDateTimeFormatter.testPrint_appendableMethods(TestDateTimeFormatter.java:215)

testFormat_date_partial(org.joda.time.format.TestISODateTimeFormat)  Time elapsed: 0 sec  <<< ERROR!
java.lang.ArrayIndexOutOfBoundsException: -1
	at org.joda.time.format.DateTimeFormatterBuilder$Composite.printTo(DateTimeFormatterBuilder.java:681)
	at org.joda.time.format.DateTimeFormatter.printTo(DateTimeFormatter.java:609)
	at org.joda.time.format.DateTimeFormatter.print(DateTimeFormatter.java:663)
	at org.joda.time.format.TestISODateTimeFormat.testFormat_date_partial(TestISODateTimeFormat.java:111)

testFormat_time_partial(org.joda.time.format.TestISODateTimeFormat)  Time elapsed: 0 sec  <<< ERROR!
java.lang.ArrayIndexOutOfBoundsException: -1
	at org.joda.time.format.DateTimeFormatterBuilder$Composite.printTo(DateTimeFormatterBuilder.java:681)
	at org.joda.time.format.DateTimeFormatter.printTo(DateTimeFormatter.java:609)
	at org.joda.time.format.DateTimeFormatter.print(DateTimeFormatter.java:663)
	at org.joda.time.format.TestISODateTimeFormat.testFormat_time_partial(TestISODateTimeFormat.java:130)

testFormat_timeNoMillis_partial(org.joda.time.format.TestISODateTimeFormat)  Time elapsed: 0 sec  <<< ERROR!
java.lang.ArrayIndexOutOfBoundsException: -1
	at org.joda.time.format.DateTimeFormatterBuilder$Composite.printTo(DateTimeFormatterBuilder.java:681)
	at org.joda.time.format.DateTimeFormatter.printTo(DateTimeFormatter.java:609)
	at org.joda.time.format.DateTimeFormatter.print(DateTimeFormatter.java:663)
	at org.joda.time.format.TestISODateTimeFormat.testFormat_timeNoMillis_partial(TestISODateTimeFormat.java:149)

testForFields_weekBased_W(org.joda.time.format.TestISODateTimeFormat_Fields)  Time elapsed: 0 sec  <<< ERROR!
java.lang.ArrayIndexOutOfBoundsException: -1
	at org.joda.time.format.DateTimeFormatterBuilder$Composite.printTo(DateTimeFormatterBuilder.java:681)
	at org.joda.time.format.DateTimeFormatter.printTo(DateTimeFormatter.java:609)
	at org.joda.time.format.DateTimeFormatter.print(DateTimeFormatter.java:663)
	at org.joda.time.format.TestISODateTimeFormat_Fields.testForFields_weekBased_W(TestISODateTimeFormat_Fields.java:379)

testForFields_weekBased_D(org.joda.time.format.TestISODateTimeFormat_Fields)  Time elapsed: 0.001 sec  <<< ERROR!
java.lang.ArrayIndexOutOfBoundsException: -1
	at org.joda.time.format.DateTimeFormatterBuilder$Composite.printTo(DateTimeFormatterBuilder.java:681)
	at org.joda.time.format.DateTimeFormatter.printTo(DateTimeFormatter.java:609)
	at org.joda.time.format.DateTimeFormatter.print(DateTimeFormatter.java:663)
	at org.joda.time.format.TestISODateTimeFormat_Fields.testForFields_weekBased_D(TestISODateTimeFormat_Fields.java:406)

testForFields_weekBased_YW(org.joda.time.format.TestISODateTimeFormat_Fields)  Time elapsed: 0 sec  <<< ERROR!
java.lang.ArrayIndexOutOfBoundsException: -1
	at org.joda.time.format.DateTimeFormatterBuilder$Composite.printTo(DateTimeFormatterBuilder.java:681)
	at org.joda.time.format.DateTimeFormatter.printTo(DateTimeFormatter.java:609)
	at org.joda.time.format.DateTimeFormatter.print(DateTimeFormatter.java:663)
	at org.joda.time.format.TestISODateTimeFormat_Fields.testForFields_weekBased_YW(TestISODateTimeFormat_Fields.java:434)

testForFields_weekBased_WD(org.joda.time.format.TestISODateTimeFormat_Fields)  Time elapsed: 0.001 sec  <<< ERROR!
java.lang.ArrayIndexOutOfBoundsException: -1
	at org.joda.time.format.DateTimeFormatterBuilder$Composite.printTo(DateTimeFormatterBuilder.java:681)
	at org.joda.time.format.DateTimeFormatter.printTo(DateTimeFormatter.java:609)
	at org.joda.time.format.DateTimeFormatter.print(DateTimeFormatter.java:663)
	at org.joda.time.format.TestISODateTimeFormat_Fields.testForFields_weekBased_WD(TestISODateTimeFormat_Fields.java:462)

testForFields_weekBased_YD(org.joda.time.format.TestISODateTimeFormat_Fields)  Time elapsed: 0 sec  <<< ERROR!
java.lang.ArrayIndexOutOfBoundsException: -1
	at org.joda.time.format.DateTimeFormatterBuilder$Composite.printTo(DateTimeFormatterBuilder.java:681)
	at org.joda.time.format.DateTimeFormatter.printTo(DateTimeFormatter.java:609)
	at org.joda.time.format.DateTimeFormatter.print(DateTimeFormatter.java:663)
	at org.joda.time.format.TestISODateTimeFormat_Fields.testForFields_weekBased_YD(TestISODateTimeFormat_Fields.java:490)

testForFields_ordinalBased_YD(org.joda.time.format.TestISODateTimeFormat_Fields)  Time elapsed: 0.002 sec  <<< ERROR!
java.lang.ArrayIndexOutOfBoundsException: -1
	at org.joda.time.format.DateTimeFormatterBuilder$Composite.printTo(DateTimeFormatterBuilder.java:681)
	at org.joda.time.format.DateTimeFormatter.printTo(DateTimeFormatter.java:609)
	at org.joda.time.format.DateTimeFormatter.print(DateTimeFormatter.java:663)
	at org.joda.time.format.TestISODateTimeFormat_Fields.testForFields_ordinalBased_YD(TestISODateTimeFormat_Fields.java:522)

testForFields_ordinalBased_D(org.joda.time.format.TestISODateTimeFormat_Fields)  Time elapsed: 0 sec  <<< ERROR!
java.lang.ArrayIndexOutOfBoundsException: -1
	at org.joda.time.format.DateTimeFormatterBuilder$Composite.printTo(DateTimeFormatterBuilder.java:681)
	at org.joda.time.format.DateTimeFormatter.printTo(DateTimeFormatter.java:609)
	at org.joda.time.format.DateTimeFormatter.print(DateTimeFormatter.java:663)
	at org.joda.time.format.TestISODateTimeFormat_Fields.testForFields_ordinalBased_D(TestISODateTimeFormat_Fields.java:576)

testForFields_time_HMSm(org.joda.time.format.TestISODateTimeFormat_Fields)  Time elapsed: 0 sec  <<< ERROR!
java.lang.ArrayIndexOutOfBoundsException: -1
	at org.joda.time.format.DateTimeFormatterBuilder$Composite.printTo(DateTimeFormatterBuilder.java:681)
	at org.joda.time.format.DateTimeFormatter.printTo(DateTimeFormatter.java:609)
	at org.joda.time.format.DateTimeFormatter.print(DateTimeFormatter.java:663)
	at org.joda.time.format.TestISODateTimeFormat_Fields.testForFields_time_HMSm(TestISODateTimeFormat_Fields.java:608)

testForFields_time_HMS(org.joda.time.format.TestISODateTimeFormat_Fields)  Time elapsed: 0 sec  <<< ERROR!
java.lang.ArrayIndexOutOfBoundsException: -1
	at org.joda.time.format.DateTimeFormatterBuilder$Composite.printTo(DateTimeFormatterBuilder.java:681)
	at org.joda.time.format.DateTimeFormatter.printTo(DateTimeFormatter.java:609)
	at org.joda.time.format.DateTimeFormatter.print(DateTimeFormatter.java:663)
	at org.joda.time.format.TestISODateTimeFormat_Fields.testForFields_time_HMS(TestISODateTimeFormat_Fields.java:637)

testForFields_time_HM(org.joda.time.format.TestISODateTimeFormat_Fields)  Time elapsed: 0 sec  <<< ERROR!
java.lang.ArrayIndexOutOfBoundsException: -1
	at org.joda.time.format.DateTimeFormatterBuilder$Composite.printTo(DateTimeFormatterBuilder.java:681)
	at org.joda.time.format.DateTimeFormatter.printTo(DateTimeFormatter.java:609)
	at org.joda.time.format.DateTimeFormatter.print(DateTimeFormatter.java:663)
	at org.joda.time.format.TestISODateTimeFormat_Fields.testForFields_time_HM(TestISODateTimeFormat_Fields.java:665)

testForFields_time_MSm(org.joda.time.format.TestISODateTimeFormat_Fields)  Time elapsed: 0.001 sec  <<< ERROR!
java.lang.ArrayIndexOutOfBoundsException: -1
	at org.joda.time.format.DateTimeFormatterBuilder$Composite.printTo(DateTimeFormatterBuilder.java:681)
	at org.joda.time.format.DateTimeFormatter.printTo(DateTimeFormatter.java:609)
	at org.joda.time.format.DateTimeFormatter.print(DateTimeFormatter.java:663)
	at org.joda.time.format.TestISODateTimeFormat_Fields.testForFields_time_MSm(TestISODateTimeFormat_Fields.java:721)

testForFields_time_MS(org.joda.time.format.TestISODateTimeFormat_Fields)  Time elapsed: 0.001 sec  <<< ERROR!
java.lang.ArrayIndexOutOfBoundsException: -1
	at org.joda.time.format.DateTimeFormatterBuilder$Composite.printTo(DateTimeFormatterBuilder.java:681)
	at org.joda.time.format.DateTimeFormatter.printTo(DateTimeFormatter.java:609)
	at org.joda.time.format.DateTimeFormatter.print(DateTimeFormatter.java:663)
	at org.joda.time.format.TestISODateTimeFormat_Fields.testForFields_time_MS(TestISODateTimeFormat_Fields.java:749)

testForFields_time_M(org.joda.time.format.TestISODateTimeFormat_Fields)  Time elapsed: 0 sec  <<< ERROR!
java.lang.ArrayIndexOutOfBoundsException: -1
	at org.joda.time.format.DateTimeFormatterBuilder$Composite.printTo(DateTimeFormatterBuilder.java:681)
	at org.joda.time.format.DateTimeFormatter.printTo(DateTimeFormatter.java:609)
	at org.joda.time.format.DateTimeFormatter.print(DateTimeFormatter.java:663)
	at org.joda.time.format.TestISODateTimeFormat_Fields.testForFields_time_M(TestISODateTimeFormat_Fields.java:776)

testForFields_time_Sm(org.joda.time.format.TestISODateTimeFormat_Fields)  Time elapsed: 0.001 sec  <<< ERROR!
java.lang.ArrayIndexOutOfBoundsException: -1
	at org.joda.time.format.DateTimeFormatterBuilder$Composite.printTo(DateTimeFormatterBuilder.java:681)
	at org.joda.time.format.DateTimeFormatter.printTo(DateTimeFormatter.java:609)
	at org.joda.time.format.DateTimeFormatter.print(DateTimeFormatter.java:663)
	at org.joda.time.format.TestISODateTimeFormat_Fields.testForFields_time_Sm(TestISODateTimeFormat_Fields.java:804)

testForFields_time_S(org.joda.time.format.TestISODateTimeFormat_Fields)  Time elapsed: 0.001 sec  <<< ERROR!
java.lang.ArrayIndexOutOfBoundsException: -1
	at org.joda.time.format.DateTimeFormatterBuilder$Composite.printTo(DateTimeFormatterBuilder.java:681)
	at org.joda.time.format.DateTimeFormatter.printTo(DateTimeFormatter.java:609)
	at org.joda.time.format.DateTimeFormatter.print(DateTimeFormatter.java:663)
	at org.joda.time.format.TestISODateTimeFormat_Fields.testForFields_time_S(TestISODateTimeFormat_Fields.java:831)

testForFields_time_m(org.joda.time.format.TestISODateTimeFormat_Fields)  Time elapsed: 0 sec  <<< ERROR!
java.lang.ArrayIndexOutOfBoundsException: -1
	at org.joda.time.format.DateTimeFormatterBuilder$Composite.printTo(DateTimeFormatterBuilder.java:681)
	at org.joda.time.format.DateTimeFormatter.printTo(DateTimeFormatter.java:609)
	at org.joda.time.format.DateTimeFormatter.print(DateTimeFormatter.java:663)
	at org.joda.time.format.TestISODateTimeFormat_Fields.testForFields_time_m(TestISODateTimeFormat_Fields.java:858)

testForFields_time_Hm(org.joda.time.format.TestISODateTimeFormat_Fields)  Time elapsed: 0.001 sec  <<< ERROR!
java.lang.ArrayIndexOutOfBoundsException: -1
	at org.joda.time.format.DateTimeFormatterBuilder$Composite.printTo(DateTimeFormatterBuilder.java:681)
	at org.joda.time.format.DateTimeFormatter.printTo(DateTimeFormatter.java:609)
	at org.joda.time.format.DateTimeFormatter.print(DateTimeFormatter.java:663)
	at org.joda.time.format.TestISODateTimeFormat_Fields.testForFields_time_Hm(TestISODateTimeFormat_Fields.java:888)

testForFields_time_HS(org.joda.time.format.TestISODateTimeFormat_Fields)  Time elapsed: 0 sec  <<< ERROR!
java.lang.ArrayIndexOutOfBoundsException: -1
	at org.joda.time.format.DateTimeFormatterBuilder$Composite.printTo(DateTimeFormatterBuilder.java:681)
	at org.joda.time.format.DateTimeFormatter.printTo(DateTimeFormatter.java:609)
	at org.joda.time.format.DateTimeFormatter.print(DateTimeFormatter.java:663)
	at org.joda.time.format.TestISODateTimeFormat_Fields.testForFields_time_HS(TestISODateTimeFormat_Fields.java:918)

testForFields_time_Mm(org.joda.time.format.TestISODateTimeFormat_Fields)  Time elapsed: 0.001 sec  <<< ERROR!
java.lang.ArrayIndexOutOfBoundsException: -1
	at org.joda.time.format.DateTimeFormatterBuilder$Composite.printTo(DateTimeFormatterBuilder.java:681)
	at org.joda.time.format.DateTimeFormatter.printTo(DateTimeFormatter.java:609)
	at org.joda.time.format.DateTimeFormatter.print(DateTimeFormatter.java:663)
	at org.joda.time.format.TestISODateTimeFormat_Fields.testForFields_time_Mm(TestISODateTimeFormat_Fields.java:948)

testForFields_time_HSm(org.joda.time.format.TestISODateTimeFormat_Fields)  Time elapsed: 0 sec  <<< ERROR!
java.lang.ArrayIndexOutOfBoundsException: -1
	at org.joda.time.format.DateTimeFormatterBuilder$Composite.printTo(DateTimeFormatterBuilder.java:681)
	at org.joda.time.format.DateTimeFormatter.printTo(DateTimeFormatter.java:609)
	at org.joda.time.format.DateTimeFormatter.print(DateTimeFormatter.java:663)
	at org.joda.time.format.TestISODateTimeFormat_Fields.testForFields_time_HSm(TestISODateTimeFormat_Fields.java:979)

testForFields_time_HMm(org.joda.time.format.TestISODateTimeFormat_Fields)  Time elapsed: 0.001 sec  <<< ERROR!
java.lang.ArrayIndexOutOfBoundsException: -1
	at org.joda.time.format.DateTimeFormatterBuilder$Composite.printTo(DateTimeFormatterBuilder.java:681)
	at org.joda.time.format.DateTimeFormatter.printTo(DateTimeFormatter.java:609)
	at org.joda.time.format.DateTimeFormatter.print(DateTimeFormatter.java:663)
	at org.joda.time.format.TestISODateTimeFormat_Fields.testForFields_time_HMm(TestISODateTimeFormat_Fields.java:1010)

testForFields_datetime_YMDH(org.joda.time.format.TestISODateTimeFormat_Fields)  Time elapsed: 0 sec  <<< ERROR!
java.lang.ArrayIndexOutOfBoundsException: -1
	at org.joda.time.format.DateTimeFormatterBuilder$Composite.printTo(DateTimeFormatterBuilder.java:681)
	at org.joda.time.format.DateTimeFormatter.printTo(DateTimeFormatter.java:609)
	at org.joda.time.format.DateTimeFormatter.print(DateTimeFormatter.java:663)
	at org.joda.time.format.TestISODateTimeFormat_Fields.testForFields_datetime_YMDH(TestISODateTimeFormat_Fields.java:1044)

testForFields_datetime_DH(org.joda.time.format.TestISODateTimeFormat_Fields)  Time elapsed: 0.001 sec  <<< ERROR!
java.lang.ArrayIndexOutOfBoundsException: -1
	at org.joda.time.format.DateTimeFormatterBuilder$Composite.printTo(DateTimeFormatterBuilder.java:681)
	at org.joda.time.format.DateTimeFormatter.printTo(DateTimeFormatter.java:609)
	at org.joda.time.format.DateTimeFormatter.print(DateTimeFormatter.java:663)
	at org.joda.time.format.TestISODateTimeFormat_Fields.testForFields_datetime_DH(TestISODateTimeFormat_Fields.java:1072)

testForFields_datetime_YH(org.joda.time.format.TestISODateTimeFormat_Fields)  Time elapsed: 0 sec  <<< ERROR!
java.lang.ArrayIndexOutOfBoundsException: -1
	at org.joda.time.format.DateTimeFormatterBuilder$Composite.printTo(DateTimeFormatterBuilder.java:681)
	at org.joda.time.format.DateTimeFormatter.printTo(DateTimeFormatter.java:609)
	at org.joda.time.format.DateTimeFormatter.print(DateTimeFormatter.java:663)
	at org.joda.time.format.TestISODateTimeFormat_Fields.testForFields_datetime_YH(TestISODateTimeFormat_Fields.java:1100)

testForFields_datetime_DM(org.joda.time.format.TestISODateTimeFormat_Fields)  Time elapsed: 0 sec  <<< ERROR!
java.lang.ArrayIndexOutOfBoundsException: -1
	at org.joda.time.format.DateTimeFormatterBuilder$Composite.printTo(DateTimeFormatterBuilder.java:681)
	at org.joda.time.format.DateTimeFormatter.printTo(DateTimeFormatter.java:609)
	at org.joda.time.format.DateTimeFormatter.print(DateTimeFormatter.java:663)
	at org.joda.time.format.TestISODateTimeFormat_Fields.testForFields_datetime_DM(TestISODateTimeFormat_Fields.java:1130)

testForFields_calBased_YMD(org.joda.time.format.TestISODateTimeFormat_Fields)  Time elapsed: 0 sec  <<< ERROR!
java.lang.ArrayIndexOutOfBoundsException: -1
	at org.joda.time.format.DateTimeFormatterBuilder$Composite.printTo(DateTimeFormatterBuilder.java:681)
	at org.joda.time.format.DateTimeFormatter.printTo(DateTimeFormatter.java:609)
	at org.joda.time.format.DateTimeFormatter.print(DateTimeFormatter.java:663)
	at org.joda.time.format.TestISODateTimeFormat_Fields.testForFields_calBased_YMD(TestISODateTimeFormat_Fields.java:83)

testForFields_calBased_YMD_unmodifiable(org.joda.time.format.TestISODateTimeFormat_Fields)  Time elapsed: 0.001 sec  <<< ERROR!
java.lang.ArrayIndexOutOfBoundsException: -1
	at org.joda.time.format.DateTimeFormatterBuilder$Composite.printTo(DateTimeFormatterBuilder.java:681)
	at org.joda.time.format.DateTimeFormatter.printTo(DateTimeFormatter.java:609)
	at org.joda.time.format.DateTimeFormatter.print(DateTimeFormatter.java:663)
	at org.joda.time.format.TestISODateTimeFormat_Fields.testForFields_calBased_YMD_unmodifiable(TestISODateTimeFormat_Fields.java:112)

testForFields_calBased_YMD_duplicates(org.joda.time.format.TestISODateTimeFormat_Fields)  Time elapsed: 0.001 sec  <<< ERROR!
java.lang.ArrayIndexOutOfBoundsException: -1
	at org.joda.time.format.DateTimeFormatterBuilder$Composite.printTo(DateTimeFormatterBuilder.java:681)
	at org.joda.time.format.DateTimeFormatter.printTo(DateTimeFormatter.java:609)
	at org.joda.time.format.DateTimeFormatter.print(DateTimeFormatter.java:663)
	at org.joda.time.format.TestISODateTimeFormat_Fields.testForFields_calBased_YMD_duplicates(TestISODateTimeFormat_Fields.java:137)

testForFields_calBased_M(org.joda.time.format.TestISODateTimeFormat_Fields)  Time elapsed: 0.001 sec  <<< ERROR!
java.lang.ArrayIndexOutOfBoundsException: -1
	at org.joda.time.format.DateTimeFormatterBuilder$Composite.printTo(DateTimeFormatterBuilder.java:681)
	at org.joda.time.format.DateTimeFormatter.printTo(DateTimeFormatter.java:609)
	at org.joda.time.format.DateTimeFormatter.print(DateTimeFormatter.java:663)
	at org.joda.time.format.TestISODateTimeFormat_Fields.testForFields_calBased_M(TestISODateTimeFormat_Fields.java:181)

testForFields_calBased_D(org.joda.time.format.TestISODateTimeFormat_Fields)  Time elapsed: 0 sec  <<< ERROR!
java.lang.ArrayIndexOutOfBoundsException: -1
	at org.joda.time.format.DateTimeFormatterBuilder$Composite.printTo(DateTimeFormatterBuilder.java:681)
	at org.joda.time.format.DateTimeFormatter.printTo(DateTimeFormatter.java:609)
	at org.joda.time.format.DateTimeFormatter.print(DateTimeFormatter.java:663)
	at org.joda.time.format.TestISODateTimeFormat_Fields.testForFields_calBased_D(TestISODateTimeFormat_Fields.java:208)

testForFields_calBased_YM(org.joda.time.format.TestISODateTimeFormat_Fields)  Time elapsed: 0.001 sec  <<< ERROR!
java.lang.ArrayIndexOutOfBoundsException: -1
	at org.joda.time.format.DateTimeFormatterBuilder$Composite.printTo(DateTimeFormatterBuilder.java:681)
	at org.joda.time.format.DateTimeFormatter.printTo(DateTimeFormatter.java:609)
	at org.joda.time.format.DateTimeFormatter.print(DateTimeFormatter.java:663)
	at org.joda.time.format.TestISODateTimeFormat_Fields.testForFields_calBased_YM(TestISODateTimeFormat_Fields.java:236)

testForFields_calBased_MD(org.joda.time.format.TestISODateTimeFormat_Fields)  Time elapsed: 0.001 sec  <<< ERROR!
java.lang.ArrayIndexOutOfBoundsException: -1
	at org.joda.time.format.DateTimeFormatterBuilder$Composite.printTo(DateTimeFormatterBuilder.java:681)
	at org.joda.time.format.DateTimeFormatter.printTo(DateTimeFormatter.java:609)
	at org.joda.time.format.DateTimeFormatter.print(DateTimeFormatter.java:663)
	at org.joda.time.format.TestISODateTimeFormat_Fields.testForFields_calBased_MD(TestISODateTimeFormat_Fields.java:264)

testForFields_calBased_YD(org.joda.time.format.TestISODateTimeFormat_Fields)  Time elapsed: 0 sec  <<< ERROR!
java.lang.ArrayIndexOutOfBoundsException: -1
	at org.joda.time.format.DateTimeFormatterBuilder$Composite.printTo(DateTimeFormatterBuilder.java:681)
	at org.joda.time.format.DateTimeFormatter.printTo(DateTimeFormatter.java:609)
	at org.joda.time.format.DateTimeFormatter.print(DateTimeFormatter.java:663)
	at org.joda.time.format.TestISODateTimeFormat_Fields.testForFields_calBased_YD(TestISODateTimeFormat_Fields.java:292)

testForFields_weekBased_YWD(org.joda.time.format.TestISODateTimeFormat_Fields)  Time elapsed: 0.001 sec  <<< ERROR!
java.lang.ArrayIndexOutOfBoundsException: -1
	at org.joda.time.format.DateTimeFormatterBuilder$Composite.printTo(DateTimeFormatterBuilder.java:681)
	at org.joda.time.format.DateTimeFormatter.printTo(DateTimeFormatter.java:609)
	at org.joda.time.format.DateTimeFormatter.print(DateTimeFormatter.java:663)
	at org.joda.time.format.TestISODateTimeFormat_Fields.testForFields_weekBased_YWD(TestISODateTimeFormat_Fields.java:325)


Results :

Tests in error: 
  org.joda.time.TestDateTimeZoneCutover#test_DateTime_JustAfterLastEverOverlap ArrayIndexOutOfBoundsException
  org.joda.time.TestDateTimeZoneCutover#test_LocalDate_new_Gaza ArrayIndexOutOfBoundsException
  org.joda.time.TestDateTimeZoneCutover#test_LocalDate_new_Turk ArrayIndexOutOfBoundsException
  org.joda.time.TestLocalDateTime_Basics#testToString ArrayIndexOutOfBoundsException
  org.joda.time.TestLocalDateTime_Basics#testToString_DTFormatter ArrayIndexOutOfBoundsException
  org.joda.time.TestLocalDateTime_Basics#testToString_String ArrayIndexOutOfBoundsException
  org.joda.time.TestLocalDateTime_Basics#testToString_String_Locale ArrayIndexOutOfBoundsException
  org.joda.time.TestLocalDate_Basics#testToString ArrayIndexOutOfBoundsException
  org.joda.time.TestLocalDate_Basics#testToString_DTFormatter ArrayIndexOutOfBoundsException
  org.joda.time.TestLocalDate_Basics#testToString_String ArrayIndexOutOfBoundsException
  org.joda.time.TestLocalDate_Basics#testToString_String_Locale ArrayIndexOutOfBoundsException
  org.joda.time.TestLocalTime_Basics#testToString ArrayIndexOutOfBoundsException
  org.joda.time.TestLocalTime_Basics#testToString_DTFormatter ArrayIndexOutOfBoundsException
  org.joda.time.TestLocalTime_Basics#testToString_String ArrayIndexOutOfBoundsException
  org.joda.time.TestLocalTime_Basics#testToString_String_Locale ArrayIndexOutOfBoundsException
  org.joda.time.TestMonthDay_Basics#testToString ArrayIndexOutOfBoundsException ...
  org.joda.time.TestMonthDay_Basics#testToString_DTFormatter ArrayIndexOutOfBoundsException
  org.joda.time.TestMonthDay_Basics#testToString_String ArrayIndexOutOfBoundsException
  org.joda.time.TestMonthDay_Basics#testToString_String_Locale ArrayIndexOutOfBoundsException
  org.joda.time.TestPartial_Basics#testGetFormatter1 ArrayIndexOutOfBoundsException
  org.joda.time.TestPartial_Basics#testGetFormatter3 ArrayIndexOutOfBoundsException
  org.joda.time.TestPartial_Basics#testMinus_RP ArrayIndexOutOfBoundsException -...
  org.joda.time.TestPartial_Basics#testPlus_RP ArrayIndexOutOfBoundsException -1
  org.joda.time.TestPartial_Basics#testToDateTime_RI ArrayIndexOutOfBoundsException
  org.joda.time.TestPartial_Basics#testToDateTime_nullRI ArrayIndexOutOfBoundsException
  org.joda.time.TestPartial_Basics#testToString1 ArrayIndexOutOfBoundsException ...
  org.joda.time.TestPartial_Basics#testToString3 ArrayIndexOutOfBoundsException ...
  org.joda.time.TestPartial_Basics#testToString4 ArrayIndexOutOfBoundsException ...
  org.joda.time.TestPartial_Basics#testToString_DTFormatter ArrayIndexOutOfBoundsException
  org.joda.time.TestPartial_Basics#testToString_String ArrayIndexOutOfBoundsException
  org.joda.time.TestPartial_Basics#testToString_String_Locale ArrayIndexOutOfBoundsException
  org.joda.time.TestPartial_Basics#testWith1 ArrayIndexOutOfBoundsException -1
  org.joda.time.TestPartial_Basics#testWith2 ArrayIndexOutOfBoundsException -1
  org.joda.time.TestPartial_Basics#testWith3 ArrayIndexOutOfBoundsException -1
  org.joda.time.TestPartial_Basics#testWith3a ArrayIndexOutOfBoundsException -1
  org.joda.time.TestPartial_Basics#testWith3b ArrayIndexOutOfBoundsException -1
  org.joda.time.TestPartial_Basics#testWith3c ArrayIndexOutOfBoundsException -1
  org.joda.time.TestPartial_Basics#testWithChronologyRetainFields_Chrono ArrayIndexOutOfBoundsException
  org.joda.time.TestPartial_Basics#testWithChronologyRetainFields_nullChrono ArrayIndexOutOfBoundsException
  org.joda.time.TestPartial_Basics#testWithField1 ArrayIndexOutOfBoundsException
  org.joda.time.TestPartial_Basics#testWithField2 ArrayIndexOutOfBoundsException
  org.joda.time.TestPartial_Basics#testWithField3 ArrayIndexOutOfBoundsException
  org.joda.time.TestPartial_Basics#testWithFieldAddWrapped1 ArrayIndexOutOfBoundsException
  org.joda.time.TestPartial_Basics#testWithFieldAddWrapped2 ArrayIndexOutOfBoundsException
  org.joda.time.TestPartial_Basics#testWithFieldAddWrapped3 ArrayIndexOutOfBoundsException
  org.joda.time.TestPartial_Basics#testWithFieldAddWrapped5 ArrayIndexOutOfBoundsException
  org.joda.time.TestPartial_Basics#testWithFieldAddWrapped6 ArrayIndexOutOfBoundsException
  org.joda.time.TestPartial_Basics#testWithFieldAddWrapped7 ArrayIndexOutOfBoundsException
  org.joda.time.TestPartial_Basics#testWithFieldAddWrapped8 ArrayIndexOutOfBoundsException
  org.joda.time.TestPartial_Basics#testWithFieldAdded1 ArrayIndexOutOfBoundsException
  org.joda.time.TestPartial_Basics#testWithFieldAdded2 ArrayIndexOutOfBoundsException
  org.joda.time.TestPartial_Basics#testWithFieldAdded3 ArrayIndexOutOfBoundsException
  org.joda.time.TestPartial_Basics#testWithFieldAdded5 ArrayIndexOutOfBoundsException
  org.joda.time.TestPartial_Basics#testWithFieldAdded6 ArrayIndexOutOfBoundsException
  org.joda.time.TestPartial_Basics#testWithFieldAdded7 ArrayIndexOutOfBoundsException
  org.joda.time.TestPartial_Basics#testWithFieldAdded8 ArrayIndexOutOfBoundsException
  org.joda.time.TestPartial_Basics#testWithout1 ArrayIndexOutOfBoundsException -...
  org.joda.time.TestPartial_Basics#testWithout2 ArrayIndexOutOfBoundsException -...
  org.joda.time.TestPartial_Basics#testWithout3 ArrayIndexOutOfBoundsException -...
  org.joda.time.TestPartial_Basics#testWithout4 ArrayIndexOutOfBoundsException -...
  org.joda.time.TestStringConvert#testLocalDate ArrayIndexOutOfBoundsException -...
  org.joda.time.TestStringConvert#testLocalDateTime ArrayIndexOutOfBoundsException
  org.joda.time.TestStringConvert#testLocalTime ArrayIndexOutOfBoundsException -...
  org.joda.time.TestStringConvert#testMonthDay ArrayIndexOutOfBoundsException -1
  org.joda.time.TestStringConvert#testMonthDay_leapDay ArrayIndexOutOfBoundsException
  org.joda.time.TestStringConvert#testYearMonth ArrayIndexOutOfBoundsException -...
  org.joda.time.TestTimeOfDay_Basics#testToString ArrayIndexOutOfBoundsException
  org.joda.time.TestTimeOfDay_Basics#testToString_DTFormatter ArrayIndexOutOfBoundsException
  org.joda.time.TestTimeOfDay_Basics#testToString_String ArrayIndexOutOfBoundsException
  org.joda.time.TestTimeOfDay_Basics#testToString_String_Locale ArrayIndexOutOfBoundsException
  org.joda.time.TestYearMonthDay_Basics#testToString ArrayIndexOutOfBoundsException
  org.joda.time.TestYearMonthDay_Basics#testToString_DTFormatter ArrayIndexOutOfBoundsException
  org.joda.time.TestYearMonthDay_Basics#testToString_String ArrayIndexOutOfBoundsException
  org.joda.time.TestYearMonthDay_Basics#testToString_String_Locale ArrayIndexOutOfBoundsException
  org.joda.time.TestYearMonth_Basics#testToString ArrayIndexOutOfBoundsException
  org.joda.time.TestYearMonth_Basics#testToString_DTFormatter ArrayIndexOutOfBoundsException
  org.joda.time.TestYearMonth_Basics#testToString_String ArrayIndexOutOfBoundsException
  org.joda.time.TestYearMonth_Basics#testToString_String_Locale ArrayIndexOutOfBoundsException
  org.joda.time.format.TestDateTimeFormatter#testPrint_appendableMethods ArrayIndexOutOfBoundsException
  org.joda.time.format.TestDateTimeFormatter#testPrint_bufferMethods ArrayIndexOutOfBoundsException
  org.joda.time.format.TestDateTimeFormatter#testPrint_writerMethods ArrayIndexOutOfBoundsException
  org.joda.time.format.TestISODateTimeFormat#testFormat_date_partial ArrayIndexOutOfBoundsException
  org.joda.time.format.TestISODateTimeFormat#testFormat_timeNoMillis_partial ArrayIndexOutOfBoundsException
  org.joda.time.format.TestISODateTimeFormat#testFormat_time_partial ArrayIndexOutOfBoundsException
  org.joda.time.format.TestISODateTimeFormat_Fields#testForFields_calBased_D ArrayIndexOutOfBoundsException
  org.joda.time.format.TestISODateTimeFormat_Fields#testForFields_calBased_M ArrayIndexOutOfBoundsException
  org.joda.time.format.TestISODateTimeFormat_Fields#testForFields_calBased_MD ArrayIndexOutOfBoundsException
  org.joda.time.format.TestISODateTimeFormat_Fields#testForFields_calBased_YD ArrayIndexOutOfBoundsException
  org.joda.time.format.TestISODateTimeFormat_Fields#testForFields_calBased_YM ArrayIndexOutOfBoundsException
  org.joda.time.format.TestISODateTimeFormat_Fields#testForFields_calBased_YMD ArrayIndexOutOfBoundsException
  org.joda.time.format.TestISODateTimeFormat_Fields#testForFields_calBased_YMD_duplicates ArrayIndexOutOfBoundsException
  org.joda.time.format.TestISODateTimeFormat_Fields#testForFields_calBased_YMD_unmodifiable ArrayIndexOutOfBoundsException
  org.joda.time.format.TestISODateTimeFormat_Fields#testForFields_datetime_DH ArrayIndexOutOfBoundsException
  org.joda.time.format.TestISODateTimeFormat_Fields#testForFields_datetime_DM ArrayIndexOutOfBoundsException
  org.joda.time.format.TestISODateTimeFormat_Fields#testForFields_datetime_YH ArrayIndexOutOfBoundsException
  org.joda.time.format.TestISODateTimeFormat_Fields#testForFields_datetime_YMDH ArrayIndexOutOfBoundsException
  org.joda.time.format.TestISODateTimeFormat_Fields#testForFields_ordinalBased_D ArrayIndexOutOfBoundsException
  org.joda.time.format.TestISODateTimeFormat_Fields#testForFields_ordinalBased_YD ArrayIndexOutOfBoundsException
  org.joda.time.format.TestISODateTimeFormat_Fields#testForFields_time_HM ArrayIndexOutOfBoundsException
  org.joda.time.format.TestISODateTimeFormat_Fields#testForFields_time_HMS ArrayIndexOutOfBoundsException
  org.joda.time.format.TestISODateTimeFormat_Fields#testForFields_time_HMSm ArrayIndexOutOfBoundsException
  org.joda.time.format.TestISODateTimeFormat_Fields#testForFields_time_HMm ArrayIndexOutOfBoundsException
  org.joda.time.format.TestISODateTimeFormat_Fields#testForFields_time_HS ArrayIndexOutOfBoundsException
  org.joda.time.format.TestISODateTimeFormat_Fields#testForFields_time_HSm ArrayIndexOutOfBoundsException
  org.joda.time.format.TestISODateTimeFormat_Fields#testForFields_time_Hm ArrayIndexOutOfBoundsException
  org.joda.time.format.TestISODateTimeFormat_Fields#testForFields_time_M ArrayIndexOutOfBoundsException
  org.joda.time.format.TestISODateTimeFormat_Fields#testForFields_time_MS ArrayIndexOutOfBoundsException
  org.joda.time.format.TestISODateTimeFormat_Fields#testForFields_time_MSm ArrayIndexOutOfBoundsException
  org.joda.time.format.TestISODateTimeFormat_Fields#testForFields_time_Mm ArrayIndexOutOfBoundsException
  org.joda.time.format.TestISODateTimeFormat_Fields#testForFields_time_S ArrayIndexOutOfBoundsException
  org.joda.time.format.TestISODateTimeFormat_Fields#testForFields_time_Sm ArrayIndexOutOfBoundsException
  org.joda.time.format.TestISODateTimeFormat_Fields#testForFields_time_m ArrayIndexOutOfBoundsException
  org.joda.time.format.TestISODateTimeFormat_Fields#testForFields_weekBased_D ArrayIndexOutOfBoundsException
  org.joda.time.format.TestISODateTimeFormat_Fields#testForFields_weekBased_W ArrayIndexOutOfBoundsException
  org.joda.time.format.TestISODateTimeFormat_Fields#testForFields_weekBased_WD ArrayIndexOutOfBoundsException
  org.joda.time.format.TestISODateTimeFormat_Fields#testForFields_weekBased_YD ArrayIndexOutOfBoundsException
  org.joda.time.format.TestISODateTimeFormat_Fields#testForFields_weekBased_YW ArrayIndexOutOfBoundsException
  org.joda.time.format.TestISODateTimeFormat_Fields#testForFields_weekBased_YWD ArrayIndexOutOfBoundsException

Tests run: 4157, Failures: 0, Errors: 118, Skipped: 0

[INFO] ------------------------------------------------------------------------
[INFO] BUILD FAILURE
[INFO] ------------------------------------------------------------------------
[INFO] Total time: 15.580s
[INFO] Finished at: Thu Aug 06 06:59:20 BST 2015
[INFO] Final Memory: 8M/215M
[INFO] ------------------------------------------------------------------------
[ERROR] Failed to execute goal org.apache.maven.plugins:maven-surefire-plugin:2.18.1:test (default-test) on project joda-time: There are test failures.
[ERROR] 
[ERROR] Please refer to /home/perham/Study/LittleDarwin/Cases/joda-time-2.8.1/target/surefire-reports for the individual test results.
[ERROR] -> [Help 1]
[ERROR] 
[ERROR] To see the full stack trace of the errors, re-run Maven with the -e switch.
[ERROR] Re-run Maven using the -X switch to enable full debug logging.
[ERROR] 
[ERROR] For more information about the errors and possible solutions, please read the following articles:
[ERROR] [Help 1] http://cwiki.apache.org/confluence/display/MAVEN/MojoFailureException
