[INFO] Scanning for projects...
[INFO]                                                                         
[INFO] ------------------------------------------------------------------------
[INFO] Building Joda-Time 2.8.1
[INFO] ------------------------------------------------------------------------
[INFO] 
[INFO] --- maven-resources-plugin:2.7:resources (default-resources) @ joda-time ---
[INFO] Using 'UTF-8' encoding to copy filtered resources.
[INFO] Copying 2 resources to META-INF
[INFO] Copying 10 resources
[INFO] 
[INFO] --- maven-compiler-plugin:3.3:compile (default-compile) @ joda-time ---
[INFO] Changes detected - recompiling the module!
[INFO] Compiling 166 source files to /home/perham/Study/LittleDarwin/Cases/joda-time-2.8.1/target/classes
[INFO] 
[INFO] --- exec-maven-plugin:1.4.0:java (compile-tzdb) @ joda-time ---
Writing zoneinfo files
Writing ZoneInfoMap
[INFO] 
[INFO] --- maven-resources-plugin:2.7:testResources (default-testResources) @ joda-time ---
[INFO] Using 'UTF-8' encoding to copy filtered resources.
[INFO] Copying 34 resources
[INFO] 
[INFO] --- maven-compiler-plugin:3.3:testCompile (default-testCompile) @ joda-time ---
[INFO] Nothing to compile - all classes are up to date
[INFO] 
[INFO] --- maven-surefire-plugin:2.18.1:test (default-test) @ joda-time ---
[INFO] Surefire report directory: /home/perham/Study/LittleDarwin/Cases/joda-time-2.8.1/target/surefire-reports

-------------------------------------------------------
 T E S T S
-------------------------------------------------------
Running org.joda.time.TestAllPackages

TestBuddhistChronology.testCalendar

TestCopticChronology.testCalendar

TestEthiopicChronology.testCalendar

TestIslamicChronology.testCalendar

Testing Gregorian chronology over 1000 iterations
100% complete (i=1000)

Testing Julian chronology over 1000 iterations
100% complete (i=1000)
Writing zoneinfo files
Writing ZoneInfoMap
Tests run: 4157, Failures: 0, Errors: 6, Skipped: 0, Time elapsed: 5.464 sec <<< FAILURE! - in org.joda.time.TestAllPackages
testFormatParse_zoneId_noColon(org.joda.time.format.TestDateTimeFormat)  Time elapsed: 0.006 sec  <<< ERROR!
java.lang.NullPointerException
	at org.joda.time.format.DateTimeFormatterBuilder$TimeZoneOffset.estimatePrintedLength(DateTimeFormatterBuilder.java:504)
	at org.joda.time.format.DateTimeFormatterBuilder$Composite.<init>(DateTimeFormatterBuilder.java:653)
	at org.joda.time.format.DateTimeFormatterBuilder.getFormatter(DateTimeFormatterBuilder.java:164)
	at org.joda.time.format.DateTimeFormatterBuilder.toFormatter(DateTimeFormatterBuilder.java:31)
	at org.joda.time.format.DateTimeFormat.createFormatterForPattern(DateTimeFormat.java:688)
	at org.joda.time.format.DateTimeFormat.forPattern(DateTimeFormat.java:177)
	at org.joda.time.format.TestDateTimeFormat.testFormatParse_zoneId_noColon(TestDateTimeFormat.java:1140)

testFormatParse_zoneId_noColon_parseZ(org.joda.time.format.TestDateTimeFormat)  Time elapsed: 0 sec  <<< ERROR!
java.lang.NullPointerException
	at org.joda.time.format.DateTimeFormatterBuilder$TimeZoneOffset.estimatePrintedLength(DateTimeFormatterBuilder.java:504)
	at org.joda.time.format.DateTimeFormatterBuilder$Composite.<init>(DateTimeFormatterBuilder.java:653)
	at org.joda.time.format.DateTimeFormatterBuilder.getFormatter(DateTimeFormatterBuilder.java:164)
	at org.joda.time.format.DateTimeFormatterBuilder.toFormatter(DateTimeFormatterBuilder.java:31)
	at org.joda.time.format.DateTimeFormat.createFormatterForPattern(DateTimeFormat.java:688)
	at org.joda.time.format.DateTimeFormat.forPattern(DateTimeFormat.java:177)
	at org.joda.time.format.TestDateTimeFormat.testFormatParse_zoneId_noColon_parseZ(TestDateTimeFormat.java:1149)

testFormatParse_zoneId_colon(org.joda.time.format.TestDateTimeFormat)  Time elapsed: 0.002 sec  <<< ERROR!
java.lang.NullPointerException
	at org.joda.time.format.DateTimeFormatterBuilder$TimeZoneOffset.estimatePrintedLength(DateTimeFormatterBuilder.java:504)
	at org.joda.time.format.DateTimeFormatterBuilder$Composite.<init>(DateTimeFormatterBuilder.java:653)
	at org.joda.time.format.DateTimeFormatterBuilder.getFormatter(DateTimeFormatterBuilder.java:164)
	at org.joda.time.format.DateTimeFormatterBuilder.toFormatter(DateTimeFormatterBuilder.java:31)
	at org.joda.time.format.DateTimeFormat.createFormatterForPattern(DateTimeFormat.java:688)
	at org.joda.time.format.DateTimeFormat.forPattern(DateTimeFormat.java:177)
	at org.joda.time.format.TestDateTimeFormat.testFormatParse_zoneId_colon(TestDateTimeFormat.java:1156)

testFormatParse_zoneId_colon_parseZ(org.joda.time.format.TestDateTimeFormat)  Time elapsed: 0.001 sec  <<< ERROR!
java.lang.NullPointerException
	at org.joda.time.format.DateTimeFormatterBuilder$TimeZoneOffset.estimatePrintedLength(DateTimeFormatterBuilder.java:504)
	at org.joda.time.format.DateTimeFormatterBuilder$Composite.<init>(DateTimeFormatterBuilder.java:653)
	at org.joda.time.format.DateTimeFormatterBuilder.getFormatter(DateTimeFormatterBuilder.java:164)
	at org.joda.time.format.DateTimeFormatterBuilder.toFormatter(DateTimeFormatterBuilder.java:31)
	at org.joda.time.format.DateTimeFormat.createFormatterForPattern(DateTimeFormat.java:688)
	at org.joda.time.format.DateTimeFormat.forPattern(DateTimeFormat.java:177)
	at org.joda.time.format.TestDateTimeFormat.testFormatParse_zoneId_colon_parseZ(TestDateTimeFormat.java:1165)

testFormat_zoneAmount(org.joda.time.format.TestDateTimeFormat)  Time elapsed: 0.001 sec  <<< ERROR!
java.lang.NullPointerException
	at org.joda.time.format.DateTimeFormatterBuilder$TimeZoneOffset.estimatePrintedLength(DateTimeFormatterBuilder.java:504)
	at org.joda.time.format.DateTimeFormatter.print(DateTimeFormatter.java:623)
	at org.joda.time.format.TestDateTimeFormat.testFormat_zoneAmount(TestDateTimeFormat.java:782)

testFormat_zoneAmountColon(org.joda.time.format.TestDateTimeFormat)  Time elapsed: 0.001 sec  <<< ERROR!
java.lang.NullPointerException
	at org.joda.time.format.DateTimeFormatterBuilder$TimeZoneOffset.estimatePrintedLength(DateTimeFormatterBuilder.java:504)
	at org.joda.time.format.DateTimeFormatter.print(DateTimeFormatter.java:623)
	at org.joda.time.format.TestDateTimeFormat.testFormat_zoneAmountColon(TestDateTimeFormat.java:794)


Results :

Tests in error: 
  org.joda.time.format.TestDateTimeFormat#testFormatParse_zoneId_colon NullPointerException
  org.joda.time.format.TestDateTimeFormat#testFormatParse_zoneId_colon_parseZ NullPointerException
  org.joda.time.format.TestDateTimeFormat#testFormatParse_zoneId_noColon NullPointerException
  org.joda.time.format.TestDateTimeFormat#testFormatParse_zoneId_noColon_parseZ NullPointerException
  org.joda.time.format.TestDateTimeFormat#testFormat_zoneAmount NullPointerException
  org.joda.time.format.TestDateTimeFormat#testFormat_zoneAmountColon NullPointerException

Tests run: 4157, Failures: 0, Errors: 6, Skipped: 0

[INFO] ------------------------------------------------------------------------
[INFO] BUILD FAILURE
[INFO] ------------------------------------------------------------------------
[INFO] Total time: 16.221s
[INFO] Finished at: Thu Aug 06 08:20:26 BST 2015
[INFO] Final Memory: 9M/213M
[INFO] ------------------------------------------------------------------------
[ERROR] Failed to execute goal org.apache.maven.plugins:maven-surefire-plugin:2.18.1:test (default-test) on project joda-time: There are test failures.
[ERROR] 
[ERROR] Please refer to /home/perham/Study/LittleDarwin/Cases/joda-time-2.8.1/target/surefire-reports for the individual test results.
[ERROR] -> [Help 1]
[ERROR] 
[ERROR] To see the full stack trace of the errors, re-run Maven with the -e switch.
[ERROR] Re-run Maven using the -X switch to enable full debug logging.
[ERROR] 
[ERROR] For more information about the errors and possible solutions, please read the following articles:
[ERROR] [Help 1] http://cwiki.apache.org/confluence/display/MAVEN/MojoFailureException
