[INFO] Scanning for projects...
[INFO]                                                                         
[INFO] ------------------------------------------------------------------------
[INFO] Building Joda-Time 2.8.1
[INFO] ------------------------------------------------------------------------
[INFO] 
[INFO] --- maven-resources-plugin:2.7:resources (default-resources) @ joda-time ---
[INFO] Using 'UTF-8' encoding to copy filtered resources.
[INFO] Copying 2 resources to META-INF
[INFO] Copying 10 resources
[INFO] 
[INFO] --- maven-compiler-plugin:3.3:compile (default-compile) @ joda-time ---
[INFO] Changes detected - recompiling the module!
[INFO] Compiling 166 source files to /home/perham/Study/LittleDarwin/Cases/joda-time-2.8.1/target/classes
[INFO] 
[INFO] --- exec-maven-plugin:1.4.0:java (compile-tzdb) @ joda-time ---
Writing zoneinfo files
Writing ZoneInfoMap
[INFO] 
[INFO] --- maven-resources-plugin:2.7:testResources (default-testResources) @ joda-time ---
[INFO] Using 'UTF-8' encoding to copy filtered resources.
[INFO] Copying 34 resources
[INFO] 
[INFO] --- maven-compiler-plugin:3.3:testCompile (default-testCompile) @ joda-time ---
[INFO] Nothing to compile - all classes are up to date
[INFO] 
[INFO] --- maven-surefire-plugin:2.18.1:test (default-test) @ joda-time ---
[INFO] Surefire report directory: /home/perham/Study/LittleDarwin/Cases/joda-time-2.8.1/target/surefire-reports

-------------------------------------------------------
 T E S T S
-------------------------------------------------------
Running org.joda.time.TestAllPackages

TestBuddhistChronology.testCalendar

TestCopticChronology.testCalendar

TestEthiopicChronology.testCalendar

TestIslamicChronology.testCalendar

Testing Gregorian chronology over 1000 iterations
100% complete (i=1000)

Testing Julian chronology over 1000 iterations
100% complete (i=1000)
Writing zoneinfo files
Writing ZoneInfoMap
Tests run: 4157, Failures: 0, Errors: 13, Skipped: 0, Time elapsed: 5.374 sec <<< FAILURE! - in org.joda.time.TestAllPackages
testParse_noFormatter(org.joda.time.TestInstant_Constructors)  Time elapsed: 0.009 sec  <<< ERROR!
java.lang.ArrayIndexOutOfBoundsException: 3
	at org.joda.time.format.DateTimeFormatterBuilder$MatchingParser.parseInto(DateTimeFormatterBuilder.java:730)
	at org.joda.time.format.DateTimeFormatterBuilder$Composite.parseInto(DateTimeFormatterBuilder.java:688)
	at org.joda.time.format.InternalParserDateTimeParser.parseInto(InternalParserDateTimeParser.java:52)
	at org.joda.time.format.DateTimeFormatterBuilder$MatchingParser.parseInto(DateTimeFormatterBuilder.java:729)
	at org.joda.time.format.DateTimeFormatter.parseDateTime(DateTimeFormatter.java:879)
	at org.joda.time.Instant.parse(Instant.java:98)
	at org.joda.time.Instant.parse(Instant.java:87)
	at org.joda.time.TestInstant_Constructors.testParse_noFormatter(TestInstant_Constructors.java:101)

testConstructor_ObjectStringEx1(org.joda.time.TestDateTime_Constructors)  Time elapsed: 0.003 sec  <<< ERROR!
java.lang.ArrayIndexOutOfBoundsException: 2
	at org.joda.time.format.DateTimeFormatterBuilder$MatchingParser.parseInto(DateTimeFormatterBuilder.java:730)
	at org.joda.time.format.DateTimeParserBucket.doParseMillis(DateTimeParserBucket.java:179)
	at org.joda.time.format.DateTimeFormatter.parseMillis(DateTimeFormatter.java:780)
	at org.joda.time.convert.StringConverter.getInstantMillis(StringConverter.java:65)
	at org.joda.time.base.BaseDateTime.<init>(BaseDateTime.java:175)
	at org.joda.time.DateTime.<init>(DateTime.java:257)
	at org.joda.time.TestDateTime_Constructors.testConstructor_ObjectStringEx1(TestDateTime_Constructors.java:460)

testConstructor_ObjectStringEx2(org.joda.time.TestDateTime_Constructors)  Time elapsed: 0 sec  <<< ERROR!
java.lang.ArrayIndexOutOfBoundsException: 2
	at org.joda.time.format.DateTimeFormatterBuilder$MatchingParser.parseInto(DateTimeFormatterBuilder.java:730)
	at org.joda.time.format.DateTimeParserBucket.doParseMillis(DateTimeParserBucket.java:179)
	at org.joda.time.format.DateTimeFormatter.parseMillis(DateTimeFormatter.java:780)
	at org.joda.time.convert.StringConverter.getInstantMillis(StringConverter.java:65)
	at org.joda.time.base.BaseDateTime.<init>(BaseDateTime.java:175)
	at org.joda.time.DateTime.<init>(DateTime.java:257)
	at org.joda.time.TestDateTime_Constructors.testConstructor_ObjectStringEx2(TestDateTime_Constructors.java:469)

testParse_noFormatter(org.joda.time.TestDateTime_Constructors)  Time elapsed: 0.001 sec  <<< ERROR!
java.lang.ArrayIndexOutOfBoundsException: 3
	at org.joda.time.format.DateTimeFormatterBuilder$MatchingParser.parseInto(DateTimeFormatterBuilder.java:730)
	at org.joda.time.format.DateTimeFormatterBuilder$Composite.parseInto(DateTimeFormatterBuilder.java:688)
	at org.joda.time.format.InternalParserDateTimeParser.parseInto(InternalParserDateTimeParser.java:52)
	at org.joda.time.format.DateTimeFormatterBuilder$MatchingParser.parseInto(DateTimeFormatterBuilder.java:729)
	at org.joda.time.format.DateTimeFormatter.parseDateTime(DateTimeFormatter.java:879)
	at org.joda.time.DateTime.parse(DateTime.java:160)
	at org.joda.time.DateTime.parse(DateTime.java:149)
	at org.joda.time.TestDateTime_Constructors.testParse_noFormatter(TestDateTime_Constructors.java:158)

testParse_noFormatter(org.joda.time.TestMutableDateTime_Constructors)  Time elapsed: 0 sec  <<< ERROR!
java.lang.ArrayIndexOutOfBoundsException: 3
	at org.joda.time.format.DateTimeFormatterBuilder$MatchingParser.parseInto(DateTimeFormatterBuilder.java:730)
	at org.joda.time.format.DateTimeFormatterBuilder$Composite.parseInto(DateTimeFormatterBuilder.java:688)
	at org.joda.time.format.InternalParserDateTimeParser.parseInto(InternalParserDateTimeParser.java:52)
	at org.joda.time.format.DateTimeFormatterBuilder$MatchingParser.parseInto(DateTimeFormatterBuilder.java:729)
	at org.joda.time.format.DateTimeFormatter.parseDateTime(DateTimeFormatter.java:879)
	at org.joda.time.MutableDateTime.parse(MutableDateTime.java:160)
	at org.joda.time.MutableDateTime.parse(MutableDateTime.java:149)
	at org.joda.time.TestMutableDateTime_Constructors.testParse_noFormatter(TestMutableDateTime_Constructors.java:158)

testParse_noFormatter(org.joda.time.TestLocalDateTime_Constructors)  Time elapsed: 0.001 sec  <<< ERROR!
java.lang.ArrayIndexOutOfBoundsException: 3
	at org.joda.time.format.DateTimeFormatterBuilder$MatchingParser.parseInto(DateTimeFormatterBuilder.java:730)
	at org.joda.time.format.DateTimeFormatterBuilder$Composite.parseInto(DateTimeFormatterBuilder.java:688)
	at org.joda.time.format.DateTimeFormatter.parseLocalDateTime(DateTimeFormatter.java:838)
	at org.joda.time.LocalDateTime.parse(LocalDateTime.java:168)
	at org.joda.time.LocalDateTime.parse(LocalDateTime.java:157)
	at org.joda.time.TestLocalDateTime_Constructors.testParse_noFormatter(TestLocalDateTime_Constructors.java:96)

testGetInstantMillis_Object(org.joda.time.convert.TestStringConverter)  Time elapsed: 0.001 sec  <<< ERROR!
java.lang.ArrayIndexOutOfBoundsException: 3
	at org.joda.time.format.DateTimeFormatterBuilder$MatchingParser.parseInto(DateTimeFormatterBuilder.java:730)
	at org.joda.time.format.DateTimeFormatterBuilder$Composite.parseInto(DateTimeFormatterBuilder.java:688)
	at org.joda.time.format.InternalParserDateTimeParser.parseInto(InternalParserDateTimeParser.java:52)
	at org.joda.time.format.DateTimeFormatterBuilder$MatchingParser.parseInto(DateTimeFormatterBuilder.java:729)
	at org.joda.time.format.DateTimeParserBucket.doParseMillis(DateTimeParserBucket.java:179)
	at org.joda.time.format.DateTimeFormatter.parseMillis(DateTimeFormatter.java:780)
	at org.joda.time.convert.StringConverter.getInstantMillis(StringConverter.java:65)
	at org.joda.time.convert.TestStringConverter.testGetInstantMillis_Object(TestStringConverter.java:126)

test_dateParser(org.joda.time.format.TestISODateTimeFormatParsing)  Time elapsed: 0.002 sec  <<< ERROR!
java.lang.ArrayIndexOutOfBoundsException: 3
	at org.joda.time.format.DateTimeFormatterBuilder$MatchingParser.parseInto(DateTimeFormatterBuilder.java:730)
	at org.joda.time.format.DateTimeFormatterBuilder$Composite.parseInto(DateTimeFormatterBuilder.java:688)
	at org.joda.time.format.DateTimeParserBucket.doParseMillis(DateTimeParserBucket.java:179)
	at org.joda.time.format.DateTimeFormatter.parseMillis(DateTimeFormatter.java:780)
	at org.joda.time.format.TestISODateTimeFormatParsing.assertParse(TestISODateTimeFormatParsing.java:828)
	at org.joda.time.format.TestISODateTimeFormatParsing.test_dateParser(TestISODateTimeFormatParsing.java:76)

test_localDateParser(org.joda.time.format.TestISODateTimeFormatParsing)  Time elapsed: 0.001 sec  <<< ERROR!
java.lang.ArrayIndexOutOfBoundsException: 3
	at org.joda.time.format.DateTimeFormatterBuilder$MatchingParser.parseInto(DateTimeFormatterBuilder.java:730)
	at org.joda.time.format.DateTimeParserBucket.doParseMillis(DateTimeParserBucket.java:179)
	at org.joda.time.format.DateTimeFormatter.parseMillis(DateTimeFormatter.java:780)
	at org.joda.time.format.TestISODateTimeFormatParsing.assertParse(TestISODateTimeFormatParsing.java:831)
	at org.joda.time.format.TestISODateTimeFormatParsing.test_localDateParser(TestISODateTimeFormatParsing.java:107)

test_dateElementParser(org.joda.time.format.TestISODateTimeFormatParsing)  Time elapsed: 0.001 sec  <<< ERROR!
java.lang.ArrayIndexOutOfBoundsException: 3
	at org.joda.time.format.DateTimeFormatterBuilder$MatchingParser.parseInto(DateTimeFormatterBuilder.java:730)
	at org.joda.time.format.DateTimeParserBucket.doParseMillis(DateTimeParserBucket.java:179)
	at org.joda.time.format.DateTimeFormatter.parseMillis(DateTimeFormatter.java:780)
	at org.joda.time.format.TestISODateTimeFormatParsing.assertParse(TestISODateTimeFormatParsing.java:831)
	at org.joda.time.format.TestISODateTimeFormatParsing.test_dateElementParser(TestISODateTimeFormatParsing.java:140)

test_dateTimeParser(org.joda.time.format.TestISODateTimeFormatParsing)  Time elapsed: 0.002 sec  <<< ERROR!
java.lang.ArrayIndexOutOfBoundsException: 3
	at org.joda.time.format.DateTimeFormatterBuilder$MatchingParser.parseInto(DateTimeFormatterBuilder.java:730)
	at org.joda.time.format.DateTimeFormatterBuilder$Composite.parseInto(DateTimeFormatterBuilder.java:688)
	at org.joda.time.format.InternalParserDateTimeParser.parseInto(InternalParserDateTimeParser.java:52)
	at org.joda.time.format.DateTimeFormatterBuilder$MatchingParser.parseInto(DateTimeFormatterBuilder.java:729)
	at org.joda.time.format.DateTimeParserBucket.doParseMillis(DateTimeParserBucket.java:179)
	at org.joda.time.format.DateTimeFormatter.parseMillis(DateTimeFormatter.java:780)
	at org.joda.time.format.TestISODateTimeFormatParsing.assertParse(TestISODateTimeFormatParsing.java:828)
	at org.joda.time.format.TestISODateTimeFormatParsing.test_dateTimeParser(TestISODateTimeFormatParsing.java:272)

test_dateOptionalTimeParser(org.joda.time.format.TestISODateTimeFormatParsing)  Time elapsed: 0.001 sec  <<< ERROR!
java.lang.ArrayIndexOutOfBoundsException: 3
	at org.joda.time.format.DateTimeFormatterBuilder$MatchingParser.parseInto(DateTimeFormatterBuilder.java:730)
	at org.joda.time.format.DateTimeFormatterBuilder$Composite.parseInto(DateTimeFormatterBuilder.java:688)
	at org.joda.time.format.DateTimeParserBucket.doParseMillis(DateTimeParserBucket.java:179)
	at org.joda.time.format.DateTimeFormatter.parseMillis(DateTimeFormatter.java:780)
	at org.joda.time.format.TestISODateTimeFormatParsing.assertParse(TestISODateTimeFormatParsing.java:828)
	at org.joda.time.format.TestISODateTimeFormatParsing.test_dateOptionalTimeParser(TestISODateTimeFormatParsing.java:302)

test_localDateOptionalTimeParser(org.joda.time.format.TestISODateTimeFormatParsing)  Time elapsed: 0.001 sec  <<< ERROR!
java.lang.ArrayIndexOutOfBoundsException: 3
	at org.joda.time.format.DateTimeFormatterBuilder$MatchingParser.parseInto(DateTimeFormatterBuilder.java:730)
	at org.joda.time.format.DateTimeFormatterBuilder$Composite.parseInto(DateTimeFormatterBuilder.java:688)
	at org.joda.time.format.DateTimeParserBucket.doParseMillis(DateTimeParserBucket.java:179)
	at org.joda.time.format.DateTimeFormatter.parseMillis(DateTimeFormatter.java:780)
	at org.joda.time.format.TestISODateTimeFormatParsing.assertParse(TestISODateTimeFormatParsing.java:831)
	at org.joda.time.format.TestISODateTimeFormatParsing.test_localDateOptionalTimeParser(TestISODateTimeFormatParsing.java:333)


Results :

Tests in error: 
  org.joda.time.TestDateTime_Constructors#testConstructor_ObjectStringEx1 ArrayIndexOutOfBoundsException
  org.joda.time.TestDateTime_Constructors#testConstructor_ObjectStringEx2 ArrayIndexOutOfBoundsException
  org.joda.time.TestDateTime_Constructors#testParse_noFormatter ArrayIndexOutOfBoundsException
  org.joda.time.TestInstant_Constructors#testParse_noFormatter ArrayIndexOutOfBoundsException
  org.joda.time.TestLocalDateTime_Constructors#testParse_noFormatter ArrayIndexOutOfBoundsException
  org.joda.time.TestMutableDateTime_Constructors#testParse_noFormatter ArrayIndexOutOfBoundsException
  org.joda.time.convert.TestStringConverter#testGetInstantMillis_Object ArrayIndexOutOfBoundsException
  org.joda.time.format.TestISODateTimeFormatParsing#test_dateElementParser ArrayIndexOutOfBoundsException
  org.joda.time.format.TestISODateTimeFormatParsing#test_dateOptionalTimeParser ArrayIndexOutOfBoundsException
  org.joda.time.format.TestISODateTimeFormatParsing#test_dateParser ArrayIndexOutOfBoundsException
  org.joda.time.format.TestISODateTimeFormatParsing#test_dateTimeParser ArrayIndexOutOfBoundsException
  org.joda.time.format.TestISODateTimeFormatParsing#test_localDateOptionalTimeParser ArrayIndexOutOfBoundsException
  org.joda.time.format.TestISODateTimeFormatParsing#test_localDateParser ArrayIndexOutOfBoundsException

Tests run: 4157, Failures: 0, Errors: 13, Skipped: 0

[INFO] ------------------------------------------------------------------------
[INFO] BUILD FAILURE
[INFO] ------------------------------------------------------------------------
[INFO] Total time: 16.135s
[INFO] Finished at: Thu Aug 06 08:15:19 BST 2015
[INFO] Final Memory: 8M/215M
[INFO] ------------------------------------------------------------------------
[ERROR] Failed to execute goal org.apache.maven.plugins:maven-surefire-plugin:2.18.1:test (default-test) on project joda-time: There are test failures.
[ERROR] 
[ERROR] Please refer to /home/perham/Study/LittleDarwin/Cases/joda-time-2.8.1/target/surefire-reports for the individual test results.
[ERROR] -> [Help 1]
[ERROR] 
[ERROR] To see the full stack trace of the errors, re-run Maven with the -e switch.
[ERROR] Re-run Maven using the -X switch to enable full debug logging.
[ERROR] 
[ERROR] For more information about the errors and possible solutions, please read the following articles:
[ERROR] [Help 1] http://cwiki.apache.org/confluence/display/MAVEN/MojoFailureException
