[INFO] Scanning for projects...
[INFO]                                                                         
[INFO] ------------------------------------------------------------------------
[INFO] Building Joda-Time 2.8.1
[INFO] ------------------------------------------------------------------------
[INFO] 
[INFO] --- maven-resources-plugin:2.7:resources (default-resources) @ joda-time ---
[INFO] Using 'UTF-8' encoding to copy filtered resources.
[INFO] Copying 2 resources to META-INF
[INFO] Copying 10 resources
[INFO] 
[INFO] --- maven-compiler-plugin:3.3:compile (default-compile) @ joda-time ---
[INFO] Changes detected - recompiling the module!
[INFO] Compiling 166 source files to /home/perham/Study/LittleDarwin/Cases/joda-time-2.8.1/target/classes
[INFO] 
[INFO] --- exec-maven-plugin:1.4.0:java (compile-tzdb) @ joda-time ---
Writing zoneinfo files
Writing ZoneInfoMap
[INFO] 
[INFO] --- maven-resources-plugin:2.7:testResources (default-testResources) @ joda-time ---
[INFO] Using 'UTF-8' encoding to copy filtered resources.
[INFO] Copying 34 resources
[INFO] 
[INFO] --- maven-compiler-plugin:3.3:testCompile (default-testCompile) @ joda-time ---
[INFO] Nothing to compile - all classes are up to date
[INFO] 
[INFO] --- maven-surefire-plugin:2.18.1:test (default-test) @ joda-time ---
[INFO] Surefire report directory: /home/perham/Study/LittleDarwin/Cases/joda-time-2.8.1/target/surefire-reports

-------------------------------------------------------
 T E S T S
-------------------------------------------------------
Running org.joda.time.TestAllPackages

TestBuddhistChronology.testCalendar

TestCopticChronology.testCalendar

TestEthiopicChronology.testCalendar

TestIslamicChronology.testCalendar

Testing Gregorian chronology over 1000 iterations
100% complete (i=1000)

Testing Julian chronology over 1000 iterations
100% complete (i=1000)
Writing zoneinfo files
Writing ZoneInfoMap
Tests run: 4157, Failures: 0, Errors: 102, Skipped: 0, Time elapsed: 5.525 sec <<< FAILURE! - in org.joda.time.TestAllPackages
testToString_String_Locale(org.joda.time.TestDateTime_Basics)  Time elapsed: 0.005 sec  <<< ERROR!
java.lang.IllegalArgumentException: Field type must not be null
	at org.joda.time.format.DateTimeFormatterBuilder.appendShortText(DateTimeFormatterBuilder.java:108)
	at org.joda.time.format.DateTimeFormatterBuilder.appendDayOfWeekShortText(DateTimeFormatterBuilder.java:144)
	at org.joda.time.format.DateTimeFormat.parsePatternTo(DateTimeFormat.java:530)
	at org.joda.time.format.DateTimeFormat.createFormatterForPattern(DateTimeFormat.java:687)
	at org.joda.time.format.DateTimeFormat.forPattern(DateTimeFormat.java:177)
	at org.joda.time.base.AbstractDateTime.toString(AbstractDateTime.java:343)
	at org.joda.time.TestDateTime_Basics.testToString_String_Locale(TestDateTime_Basics.java:518)

testToString_String_String(org.joda.time.TestMutableDateTime_Basics)  Time elapsed: 0.003 sec  <<< ERROR!
java.lang.IllegalArgumentException: Field type must not be null
	at org.joda.time.format.DateTimeFormatterBuilder.appendShortText(DateTimeFormatterBuilder.java:108)
	at org.joda.time.format.DateTimeFormatterBuilder.appendDayOfWeekShortText(DateTimeFormatterBuilder.java:144)
	at org.joda.time.format.DateTimeFormat.parsePatternTo(DateTimeFormat.java:530)
	at org.joda.time.format.DateTimeFormat.createFormatterForPattern(DateTimeFormat.java:687)
	at org.joda.time.format.DateTimeFormat.forPattern(DateTimeFormat.java:177)
	at org.joda.time.base.AbstractDateTime.toString(AbstractDateTime.java:343)
	at org.joda.time.TestMutableDateTime_Basics.testToString_String_String(TestMutableDateTime_Basics.java:422)

testToString_String_String(org.joda.time.TestDateMidnight_Basics)  Time elapsed: 0 sec  <<< ERROR!
java.lang.IllegalArgumentException: Field type must not be null
	at org.joda.time.format.DateTimeFormatterBuilder.appendShortText(DateTimeFormatterBuilder.java:108)
	at org.joda.time.format.DateTimeFormatterBuilder.appendDayOfWeekShortText(DateTimeFormatterBuilder.java:144)
	at org.joda.time.format.DateTimeFormat.parsePatternTo(DateTimeFormat.java:530)
	at org.joda.time.format.DateTimeFormat.createFormatterForPattern(DateTimeFormat.java:687)
	at org.joda.time.format.DateTimeFormat.forPattern(DateTimeFormat.java:177)
	at org.joda.time.base.AbstractDateTime.toString(AbstractDateTime.java:343)
	at org.joda.time.TestDateMidnight_Basics.testToString_String_String(TestDateMidnight_Basics.java:456)

testToString_String_Locale(org.joda.time.TestLocalDateTime_Basics)  Time elapsed: 0 sec  <<< ERROR!
java.lang.IllegalArgumentException: Field type must not be null
	at org.joda.time.format.DateTimeFormatterBuilder.appendShortText(DateTimeFormatterBuilder.java:108)
	at org.joda.time.format.DateTimeFormatterBuilder.appendDayOfWeekShortText(DateTimeFormatterBuilder.java:144)
	at org.joda.time.format.DateTimeFormat.parsePatternTo(DateTimeFormat.java:530)
	at org.joda.time.format.DateTimeFormat.createFormatterForPattern(DateTimeFormat.java:687)
	at org.joda.time.format.DateTimeFormat.forPattern(DateTimeFormat.java:177)
	at org.joda.time.LocalDateTime.toString(LocalDateTime.java:2114)
	at org.joda.time.TestLocalDateTime_Basics.testToString_String_Locale(TestLocalDateTime_Basics.java:1085)

testToString_String_Locale(org.joda.time.TestLocalDate_Basics)  Time elapsed: 0.001 sec  <<< ERROR!
java.lang.IllegalArgumentException: Field type must not be null
	at org.joda.time.format.DateTimeFormatterBuilder.appendShortText(DateTimeFormatterBuilder.java:108)
	at org.joda.time.format.DateTimeFormatterBuilder.appendDayOfWeekShortText(DateTimeFormatterBuilder.java:144)
	at org.joda.time.format.DateTimeFormat.parsePatternTo(DateTimeFormat.java:530)
	at org.joda.time.format.DateTimeFormat.createFormatterForPattern(DateTimeFormat.java:687)
	at org.joda.time.format.DateTimeFormat.forPattern(DateTimeFormat.java:177)
	at org.joda.time.LocalDate.toString(LocalDate.java:1859)
	at org.joda.time.TestLocalDate_Basics.testToString_String_Locale(TestLocalDate_Basics.java:1139)

testToString_String_Locale(org.joda.time.TestYearMonthDay_Basics)  Time elapsed: 0.001 sec  <<< ERROR!
java.lang.IllegalArgumentException: Field type must not be null
	at org.joda.time.format.DateTimeFormatterBuilder.appendShortText(DateTimeFormatterBuilder.java:108)
	at org.joda.time.format.DateTimeFormatterBuilder.appendDayOfWeekShortText(DateTimeFormatterBuilder.java:144)
	at org.joda.time.format.DateTimeFormat.parsePatternTo(DateTimeFormat.java:530)
	at org.joda.time.format.DateTimeFormat.createFormatterForPattern(DateTimeFormat.java:687)
	at org.joda.time.format.DateTimeFormat.forPattern(DateTimeFormat.java:177)
	at org.joda.time.base.BasePartial.toString(BasePartial.java:309)
	at org.joda.time.TestYearMonthDay_Basics.testToString_String_Locale(TestYearMonthDay_Basics.java:812)

testToString_String_Locale(org.joda.time.TestYearMonth_Basics)  Time elapsed: 0.001 sec  <<< ERROR!
java.lang.IllegalArgumentException: Field type must not be null
	at org.joda.time.format.DateTimeFormatterBuilder.appendShortText(DateTimeFormatterBuilder.java:108)
	at org.joda.time.format.DateTimeFormatterBuilder.appendDayOfWeekShortText(DateTimeFormatterBuilder.java:144)
	at org.joda.time.format.DateTimeFormat.parsePatternTo(DateTimeFormat.java:530)
	at org.joda.time.format.DateTimeFormat.createFormatterForPattern(DateTimeFormat.java:687)
	at org.joda.time.format.DateTimeFormat.forPattern(DateTimeFormat.java:177)
	at org.joda.time.YearMonth.toString(YearMonth.java:824)
	at org.joda.time.TestYearMonth_Basics.testToString_String_Locale(TestYearMonth_Basics.java:636)

testToString_String_Locale(org.joda.time.TestMonthDay_Basics)  Time elapsed: 0 sec  <<< ERROR!
java.lang.IllegalArgumentException: Field type must not be null
	at org.joda.time.format.DateTimeFormatterBuilder.appendShortText(DateTimeFormatterBuilder.java:108)
	at org.joda.time.format.DateTimeFormatterBuilder.appendDayOfWeekShortText(DateTimeFormatterBuilder.java:144)
	at org.joda.time.format.DateTimeFormat.parsePatternTo(DateTimeFormat.java:530)
	at org.joda.time.format.DateTimeFormat.createFormatterForPattern(DateTimeFormat.java:687)
	at org.joda.time.format.DateTimeFormat.forPattern(DateTimeFormat.java:177)
	at org.joda.time.MonthDay.toString(MonthDay.java:813)
	at org.joda.time.TestMonthDay_Basics.testToString_String_Locale(TestMonthDay_Basics.java:802)

testParseDateTime_zone2(org.joda.time.format.TestDateTimeFormatter)  Time elapsed: 0.001 sec  <<< ERROR!
java.lang.IllegalArgumentException: Field type must not be null
	at org.joda.time.format.DateTimeFormatterBuilder.appendShortText(DateTimeFormatterBuilder.java:108)
	at org.joda.time.format.DateTimeFormatterBuilder.appendDayOfWeekShortText(DateTimeFormatterBuilder.java:144)
	at org.joda.time.format.TestDateTimeFormatter.setUp(TestDateTimeFormatter.java:89)
	at junit.framework.TestCase.runBare(TestCase.java:128)
	at junit.framework.TestResult$1.protect(TestResult.java:106)
	at junit.framework.TestResult.runProtected(TestResult.java:124)
	at junit.framework.TestResult.run(TestResult.java:109)
	at junit.framework.TestCase.run(TestCase.java:120)
	at junit.framework.TestSuite.runTest(TestSuite.java:230)
	at junit.framework.TestSuite.run(TestSuite.java:225)
	at junit.framework.TestSuite.runTest(TestSuite.java:230)
	at junit.framework.TestSuite.run(TestSuite.java:225)
	at junit.framework.TestSuite.runTest(TestSuite.java:230)
	at junit.framework.TestSuite.run(TestSuite.java:225)
	at sun.reflect.NativeMethodAccessorImpl.invoke0(Native Method)
	at sun.reflect.NativeMethodAccessorImpl.invoke(NativeMethodAccessorImpl.java:57)
	at sun.reflect.DelegatingMethodAccessorImpl.invoke(DelegatingMethodAccessorImpl.java:43)
	at java.lang.reflect.Method.invoke(Method.java:606)
	at org.apache.maven.surefire.junit.JUnitTestSet.execute(JUnitTestSet.java:99)
	at org.apache.maven.surefire.junit.JUnit3Provider.executeTestSet(JUnit3Provider.java:130)
	at org.apache.maven.surefire.junit.JUnit3Provider.invoke(JUnit3Provider.java:107)
	at org.apache.maven.surefire.booter.ForkedBooter.invokeProviderInSameClassLoader(ForkedBooter.java:203)
	at org.apache.maven.surefire.booter.ForkedBooter.runSuitesInProcess(ForkedBooter.java:155)
	at org.apache.maven.surefire.booter.ForkedBooter.main(ForkedBooter.java:103)

testParseDateTime_zone3(org.joda.time.format.TestDateTimeFormatter)  Time elapsed: 0 sec  <<< ERROR!
java.lang.IllegalArgumentException: Field type must not be null
	at org.joda.time.format.DateTimeFormatterBuilder.appendShortText(DateTimeFormatterBuilder.java:108)
	at org.joda.time.format.DateTimeFormatterBuilder.appendDayOfWeekShortText(DateTimeFormatterBuilder.java:144)
	at org.joda.time.format.TestDateTimeFormatter.setUp(TestDateTimeFormatter.java:89)
	at junit.framework.TestCase.runBare(TestCase.java:128)
	at junit.framework.TestResult$1.protect(TestResult.java:106)
	at junit.framework.TestResult.runProtected(TestResult.java:124)
	at junit.framework.TestResult.run(TestResult.java:109)
	at junit.framework.TestCase.run(TestCase.java:120)
	at junit.framework.TestSuite.runTest(TestSuite.java:230)
	at junit.framework.TestSuite.run(TestSuite.java:225)
	at junit.framework.TestSuite.runTest(TestSuite.java:230)
	at junit.framework.TestSuite.run(TestSuite.java:225)
	at junit.framework.TestSuite.runTest(TestSuite.java:230)
	at junit.framework.TestSuite.run(TestSuite.java:225)
	at sun.reflect.NativeMethodAccessorImpl.invoke0(Native Method)
	at sun.reflect.NativeMethodAccessorImpl.invoke(NativeMethodAccessorImpl.java:57)
	at sun.reflect.DelegatingMethodAccessorImpl.invoke(DelegatingMethodAccessorImpl.java:43)
	at java.lang.reflect.Method.invoke(Method.java:606)
	at org.apache.maven.surefire.junit.JUnitTestSet.execute(JUnitTestSet.java:99)
	at org.apache.maven.surefire.junit.JUnit3Provider.executeTestSet(JUnit3Provider.java:130)
	at org.apache.maven.surefire.junit.JUnit3Provider.invoke(JUnit3Provider.java:107)
	at org.apache.maven.surefire.booter.ForkedBooter.invokeProviderInSameClassLoader(ForkedBooter.java:203)
	at org.apache.maven.surefire.booter.ForkedBooter.runSuitesInProcess(ForkedBooter.java:155)
	at org.apache.maven.surefire.booter.ForkedBooter.main(ForkedBooter.java:103)

testParseDateTime_simple_precedence(org.joda.time.format.TestDateTimeFormatter)  Time elapsed: 0.011 sec  <<< ERROR!
java.lang.IllegalArgumentException: Field type must not be null
	at org.joda.time.format.DateTimeFormatterBuilder.appendShortText(DateTimeFormatterBuilder.java:108)
	at org.joda.time.format.DateTimeFormatterBuilder.appendDayOfWeekShortText(DateTimeFormatterBuilder.java:144)
	at org.joda.time.format.TestDateTimeFormatter.setUp(TestDateTimeFormatter.java:89)
	at junit.framework.TestCase.runBare(TestCase.java:128)
	at junit.framework.TestResult$1.protect(TestResult.java:106)
	at junit.framework.TestResult.runProtected(TestResult.java:124)
	at junit.framework.TestResult.run(TestResult.java:109)
	at junit.framework.TestCase.run(TestCase.java:120)
	at junit.framework.TestSuite.runTest(TestSuite.java:230)
	at junit.framework.TestSuite.run(TestSuite.java:225)
	at junit.framework.TestSuite.runTest(TestSuite.java:230)
	at junit.framework.TestSuite.run(TestSuite.java:225)
	at junit.framework.TestSuite.runTest(TestSuite.java:230)
	at junit.framework.TestSuite.run(TestSuite.java:225)
	at sun.reflect.NativeMethodAccessorImpl.invoke0(Native Method)
	at sun.reflect.NativeMethodAccessorImpl.invoke(NativeMethodAccessorImpl.java:57)
	at sun.reflect.DelegatingMethodAccessorImpl.invoke(DelegatingMethodAccessorImpl.java:43)
	at java.lang.reflect.Method.invoke(Method.java:606)
	at org.apache.maven.surefire.junit.JUnitTestSet.execute(JUnitTestSet.java:99)
	at org.apache.maven.surefire.junit.JUnit3Provider.executeTestSet(JUnit3Provider.java:130)
	at org.apache.maven.surefire.junit.JUnit3Provider.invoke(JUnit3Provider.java:107)
	at org.apache.maven.surefire.booter.ForkedBooter.invokeProviderInSameClassLoader(ForkedBooter.java:203)
	at org.apache.maven.surefire.booter.ForkedBooter.runSuitesInProcess(ForkedBooter.java:155)
	at org.apache.maven.surefire.booter.ForkedBooter.main(ForkedBooter.java:103)

testParseDateTime_offsetParsed(org.joda.time.format.TestDateTimeFormatter)  Time elapsed: 0 sec  <<< ERROR!
java.lang.IllegalArgumentException: Field type must not be null
	at org.joda.time.format.DateTimeFormatterBuilder.appendShortText(DateTimeFormatterBuilder.java:108)
	at org.joda.time.format.DateTimeFormatterBuilder.appendDayOfWeekShortText(DateTimeFormatterBuilder.java:144)
	at org.joda.time.format.TestDateTimeFormatter.setUp(TestDateTimeFormatter.java:89)
	at junit.framework.TestCase.runBare(TestCase.java:128)
	at junit.framework.TestResult$1.protect(TestResult.java:106)
	at junit.framework.TestResult.runProtected(TestResult.java:124)
	at junit.framework.TestResult.run(TestResult.java:109)
	at junit.framework.TestCase.run(TestCase.java:120)
	at junit.framework.TestSuite.runTest(TestSuite.java:230)
	at junit.framework.TestSuite.run(TestSuite.java:225)
	at junit.framework.TestSuite.runTest(TestSuite.java:230)
	at junit.framework.TestSuite.run(TestSuite.java:225)
	at junit.framework.TestSuite.runTest(TestSuite.java:230)
	at junit.framework.TestSuite.run(TestSuite.java:225)
	at sun.reflect.NativeMethodAccessorImpl.invoke0(Native Method)
	at sun.reflect.NativeMethodAccessorImpl.invoke(NativeMethodAccessorImpl.java:57)
	at sun.reflect.DelegatingMethodAccessorImpl.invoke(DelegatingMethodAccessorImpl.java:43)
	at java.lang.reflect.Method.invoke(Method.java:606)
	at org.apache.maven.surefire.junit.JUnitTestSet.execute(JUnitTestSet.java:99)
	at org.apache.maven.surefire.junit.JUnit3Provider.executeTestSet(JUnit3Provider.java:130)
	at org.apache.maven.surefire.junit.JUnit3Provider.invoke(JUnit3Provider.java:107)
	at org.apache.maven.surefire.booter.ForkedBooter.invokeProviderInSameClassLoader(ForkedBooter.java:203)
	at org.apache.maven.surefire.booter.ForkedBooter.runSuitesInProcess(ForkedBooter.java:155)
	at org.apache.maven.surefire.booter.ForkedBooter.main(ForkedBooter.java:103)

testParseDateTime_chrono(org.joda.time.format.TestDateTimeFormatter)  Time elapsed: 0 sec  <<< ERROR!
java.lang.IllegalArgumentException: Field type must not be null
	at org.joda.time.format.DateTimeFormatterBuilder.appendShortText(DateTimeFormatterBuilder.java:108)
	at org.joda.time.format.DateTimeFormatterBuilder.appendDayOfWeekShortText(DateTimeFormatterBuilder.java:144)
	at org.joda.time.format.TestDateTimeFormatter.setUp(TestDateTimeFormatter.java:89)
	at junit.framework.TestCase.runBare(TestCase.java:128)
	at junit.framework.TestResult$1.protect(TestResult.java:106)
	at junit.framework.TestResult.runProtected(TestResult.java:124)
	at junit.framework.TestResult.run(TestResult.java:109)
	at junit.framework.TestCase.run(TestCase.java:120)
	at junit.framework.TestSuite.runTest(TestSuite.java:230)
	at junit.framework.TestSuite.run(TestSuite.java:225)
	at junit.framework.TestSuite.runTest(TestSuite.java:230)
	at junit.framework.TestSuite.run(TestSuite.java:225)
	at junit.framework.TestSuite.runTest(TestSuite.java:230)
	at junit.framework.TestSuite.run(TestSuite.java:225)
	at sun.reflect.NativeMethodAccessorImpl.invoke0(Native Method)
	at sun.reflect.NativeMethodAccessorImpl.invoke(NativeMethodAccessorImpl.java:57)
	at sun.reflect.DelegatingMethodAccessorImpl.invoke(DelegatingMethodAccessorImpl.java:43)
	at java.lang.reflect.Method.invoke(Method.java:606)
	at org.apache.maven.surefire.junit.JUnitTestSet.execute(JUnitTestSet.java:99)
	at org.apache.maven.surefire.junit.JUnit3Provider.executeTestSet(JUnit3Provider.java:130)
	at org.apache.maven.surefire.junit.JUnit3Provider.invoke(JUnit3Provider.java:107)
	at org.apache.maven.surefire.booter.ForkedBooter.invokeProviderInSameClassLoader(ForkedBooter.java:203)
	at org.apache.maven.surefire.booter.ForkedBooter.runSuitesInProcess(ForkedBooter.java:155)
	at org.apache.maven.surefire.booter.ForkedBooter.main(ForkedBooter.java:103)

testParseMutableDateTime_simple(org.joda.time.format.TestDateTimeFormatter)  Time elapsed: 0 sec  <<< ERROR!
java.lang.IllegalArgumentException: Field type must not be null
	at org.joda.time.format.DateTimeFormatterBuilder.appendShortText(DateTimeFormatterBuilder.java:108)
	at org.joda.time.format.DateTimeFormatterBuilder.appendDayOfWeekShortText(DateTimeFormatterBuilder.java:144)
	at org.joda.time.format.TestDateTimeFormatter.setUp(TestDateTimeFormatter.java:89)
	at junit.framework.TestCase.runBare(TestCase.java:128)
	at junit.framework.TestResult$1.protect(TestResult.java:106)
	at junit.framework.TestResult.runProtected(TestResult.java:124)
	at junit.framework.TestResult.run(TestResult.java:109)
	at junit.framework.TestCase.run(TestCase.java:120)
	at junit.framework.TestSuite.runTest(TestSuite.java:230)
	at junit.framework.TestSuite.run(TestSuite.java:225)
	at junit.framework.TestSuite.runTest(TestSuite.java:230)
	at junit.framework.TestSuite.run(TestSuite.java:225)
	at junit.framework.TestSuite.runTest(TestSuite.java:230)
	at junit.framework.TestSuite.run(TestSuite.java:225)
	at sun.reflect.NativeMethodAccessorImpl.invoke0(Native Method)
	at sun.reflect.NativeMethodAccessorImpl.invoke(NativeMethodAccessorImpl.java:57)
	at sun.reflect.DelegatingMethodAccessorImpl.invoke(DelegatingMethodAccessorImpl.java:43)
	at java.lang.reflect.Method.invoke(Method.java:606)
	at org.apache.maven.surefire.junit.JUnitTestSet.execute(JUnitTestSet.java:99)
	at org.apache.maven.surefire.junit.JUnit3Provider.executeTestSet(JUnit3Provider.java:130)
	at org.apache.maven.surefire.junit.JUnit3Provider.invoke(JUnit3Provider.java:107)
	at org.apache.maven.surefire.booter.ForkedBooter.invokeProviderInSameClassLoader(ForkedBooter.java:203)
	at org.apache.maven.surefire.booter.ForkedBooter.runSuitesInProcess(ForkedBooter.java:155)
	at org.apache.maven.surefire.booter.ForkedBooter.main(ForkedBooter.java:103)

testParseMutableDateTime_zone(org.joda.time.format.TestDateTimeFormatter)  Time elapsed: 0 sec  <<< ERROR!
java.lang.IllegalArgumentException: Field type must not be null
	at org.joda.time.format.DateTimeFormatterBuilder.appendShortText(DateTimeFormatterBuilder.java:108)
	at org.joda.time.format.DateTimeFormatterBuilder.appendDayOfWeekShortText(DateTimeFormatterBuilder.java:144)
	at org.joda.time.format.TestDateTimeFormatter.setUp(TestDateTimeFormatter.java:89)
	at junit.framework.TestCase.runBare(TestCase.java:128)
	at junit.framework.TestResult$1.protect(TestResult.java:106)
	at junit.framework.TestResult.runProtected(TestResult.java:124)
	at junit.framework.TestResult.run(TestResult.java:109)
	at junit.framework.TestCase.run(TestCase.java:120)
	at junit.framework.TestSuite.runTest(TestSuite.java:230)
	at junit.framework.TestSuite.run(TestSuite.java:225)
	at junit.framework.TestSuite.runTest(TestSuite.java:230)
	at junit.framework.TestSuite.run(TestSuite.java:225)
	at junit.framework.TestSuite.runTest(TestSuite.java:230)
	at junit.framework.TestSuite.run(TestSuite.java:225)
	at sun.reflect.NativeMethodAccessorImpl.invoke0(Native Method)
	at sun.reflect.NativeMethodAccessorImpl.invoke(NativeMethodAccessorImpl.java:57)
	at sun.reflect.DelegatingMethodAccessorImpl.invoke(DelegatingMethodAccessorImpl.java:43)
	at java.lang.reflect.Method.invoke(Method.java:606)
	at org.apache.maven.surefire.junit.JUnitTestSet.execute(JUnitTestSet.java:99)
	at org.apache.maven.surefire.junit.JUnit3Provider.executeTestSet(JUnit3Provider.java:130)
	at org.apache.maven.surefire.junit.JUnit3Provider.invoke(JUnit3Provider.java:107)
	at org.apache.maven.surefire.booter.ForkedBooter.invokeProviderInSameClassLoader(ForkedBooter.java:203)
	at org.apache.maven.surefire.booter.ForkedBooter.runSuitesInProcess(ForkedBooter.java:155)
	at org.apache.maven.surefire.booter.ForkedBooter.main(ForkedBooter.java:103)

testParseMutableDateTime_zone2(org.joda.time.format.TestDateTimeFormatter)  Time elapsed: 0 sec  <<< ERROR!
java.lang.IllegalArgumentException: Field type must not be null
	at org.joda.time.format.DateTimeFormatterBuilder.appendShortText(DateTimeFormatterBuilder.java:108)
	at org.joda.time.format.DateTimeFormatterBuilder.appendDayOfWeekShortText(DateTimeFormatterBuilder.java:144)
	at org.joda.time.format.TestDateTimeFormatter.setUp(TestDateTimeFormatter.java:89)
	at junit.framework.TestCase.runBare(TestCase.java:128)
	at junit.framework.TestResult$1.protect(TestResult.java:106)
	at junit.framework.TestResult.runProtected(TestResult.java:124)
	at junit.framework.TestResult.run(TestResult.java:109)
	at junit.framework.TestCase.run(TestCase.java:120)
	at junit.framework.TestSuite.runTest(TestSuite.java:230)
	at junit.framework.TestSuite.run(TestSuite.java:225)
	at junit.framework.TestSuite.runTest(TestSuite.java:230)
	at junit.framework.TestSuite.run(TestSuite.java:225)
	at junit.framework.TestSuite.runTest(TestSuite.java:230)
	at junit.framework.TestSuite.run(TestSuite.java:225)
	at sun.reflect.NativeMethodAccessorImpl.invoke0(Native Method)
	at sun.reflect.NativeMethodAccessorImpl.invoke(NativeMethodAccessorImpl.java:57)
	at sun.reflect.DelegatingMethodAccessorImpl.invoke(DelegatingMethodAccessorImpl.java:43)
	at java.lang.reflect.Method.invoke(Method.java:606)
	at org.apache.maven.surefire.junit.JUnitTestSet.execute(JUnitTestSet.java:99)
	at org.apache.maven.surefire.junit.JUnit3Provider.executeTestSet(JUnit3Provider.java:130)
	at org.apache.maven.surefire.junit.JUnit3Provider.invoke(JUnit3Provider.java:107)
	at org.apache.maven.surefire.booter.ForkedBooter.invokeProviderInSameClassLoader(ForkedBooter.java:203)
	at org.apache.maven.surefire.booter.ForkedBooter.runSuitesInProcess(ForkedBooter.java:155)
	at org.apache.maven.surefire.booter.ForkedBooter.main(ForkedBooter.java:103)

testParseMutableDateTime_zone3(org.joda.time.format.TestDateTimeFormatter)  Time elapsed: 0 sec  <<< ERROR!
java.lang.IllegalArgumentException: Field type must not be null
	at org.joda.time.format.DateTimeFormatterBuilder.appendShortText(DateTimeFormatterBuilder.java:108)
	at org.joda.time.format.DateTimeFormatterBuilder.appendDayOfWeekShortText(DateTimeFormatterBuilder.java:144)
	at org.joda.time.format.TestDateTimeFormatter.setUp(TestDateTimeFormatter.java:89)
	at junit.framework.TestCase.runBare(TestCase.java:128)
	at junit.framework.TestResult$1.protect(TestResult.java:106)
	at junit.framework.TestResult.runProtected(TestResult.java:124)
	at junit.framework.TestResult.run(TestResult.java:109)
	at junit.framework.TestCase.run(TestCase.java:120)
	at junit.framework.TestSuite.runTest(TestSuite.java:230)
	at junit.framework.TestSuite.run(TestSuite.java:225)
	at junit.framework.TestSuite.runTest(TestSuite.java:230)
	at junit.framework.TestSuite.run(TestSuite.java:225)
	at junit.framework.TestSuite.runTest(TestSuite.java:230)
	at junit.framework.TestSuite.run(TestSuite.java:225)
	at sun.reflect.NativeMethodAccessorImpl.invoke0(Native Method)
	at sun.reflect.NativeMethodAccessorImpl.invoke(NativeMethodAccessorImpl.java:57)
	at sun.reflect.DelegatingMethodAccessorImpl.invoke(DelegatingMethodAccessorImpl.java:43)
	at java.lang.reflect.Method.invoke(Method.java:606)
	at org.apache.maven.surefire.junit.JUnitTestSet.execute(JUnitTestSet.java:99)
	at org.apache.maven.surefire.junit.JUnit3Provider.executeTestSet(JUnit3Provider.java:130)
	at org.apache.maven.surefire.junit.JUnit3Provider.invoke(JUnit3Provider.java:107)
	at org.apache.maven.surefire.booter.ForkedBooter.invokeProviderInSameClassLoader(ForkedBooter.java:203)
	at org.apache.maven.surefire.booter.ForkedBooter.runSuitesInProcess(ForkedBooter.java:155)
	at org.apache.maven.surefire.booter.ForkedBooter.main(ForkedBooter.java:103)

testParseMutableDateTime_simple_precedence(org.joda.time.format.TestDateTimeFormatter)  Time elapsed: 0 sec  <<< ERROR!
java.lang.IllegalArgumentException: Field type must not be null
	at org.joda.time.format.DateTimeFormatterBuilder.appendShortText(DateTimeFormatterBuilder.java:108)
	at org.joda.time.format.DateTimeFormatterBuilder.appendDayOfWeekShortText(DateTimeFormatterBuilder.java:144)
	at org.joda.time.format.TestDateTimeFormatter.setUp(TestDateTimeFormatter.java:89)
	at junit.framework.TestCase.runBare(TestCase.java:128)
	at junit.framework.TestResult$1.protect(TestResult.java:106)
	at junit.framework.TestResult.runProtected(TestResult.java:124)
	at junit.framework.TestResult.run(TestResult.java:109)
	at junit.framework.TestCase.run(TestCase.java:120)
	at junit.framework.TestSuite.runTest(TestSuite.java:230)
	at junit.framework.TestSuite.run(TestSuite.java:225)
	at junit.framework.TestSuite.runTest(TestSuite.java:230)
	at junit.framework.TestSuite.run(TestSuite.java:225)
	at junit.framework.TestSuite.runTest(TestSuite.java:230)
	at junit.framework.TestSuite.run(TestSuite.java:225)
	at sun.reflect.NativeMethodAccessorImpl.invoke0(Native Method)
	at sun.reflect.NativeMethodAccessorImpl.invoke(NativeMethodAccessorImpl.java:57)
	at sun.reflect.DelegatingMethodAccessorImpl.invoke(DelegatingMethodAccessorImpl.java:43)
	at java.lang.reflect.Method.invoke(Method.java:606)
	at org.apache.maven.surefire.junit.JUnitTestSet.execute(JUnitTestSet.java:99)
	at org.apache.maven.surefire.junit.JUnit3Provider.executeTestSet(JUnit3Provider.java:130)
	at org.apache.maven.surefire.junit.JUnit3Provider.invoke(JUnit3Provider.java:107)
	at org.apache.maven.surefire.booter.ForkedBooter.invokeProviderInSameClassLoader(ForkedBooter.java:203)
	at org.apache.maven.surefire.booter.ForkedBooter.runSuitesInProcess(ForkedBooter.java:155)
	at org.apache.maven.surefire.booter.ForkedBooter.main(ForkedBooter.java:103)

testParseMutableDateTime_offsetParsed(org.joda.time.format.TestDateTimeFormatter)  Time elapsed: 0 sec  <<< ERROR!
java.lang.IllegalArgumentException: Field type must not be null
	at org.joda.time.format.DateTimeFormatterBuilder.appendShortText(DateTimeFormatterBuilder.java:108)
	at org.joda.time.format.DateTimeFormatterBuilder.appendDayOfWeekShortText(DateTimeFormatterBuilder.java:144)
	at org.joda.time.format.TestDateTimeFormatter.setUp(TestDateTimeFormatter.java:89)
	at junit.framework.TestCase.runBare(TestCase.java:128)
	at junit.framework.TestResult$1.protect(TestResult.java:106)
	at junit.framework.TestResult.runProtected(TestResult.java:124)
	at junit.framework.TestResult.run(TestResult.java:109)
	at junit.framework.TestCase.run(TestCase.java:120)
	at junit.framework.TestSuite.runTest(TestSuite.java:230)
	at junit.framework.TestSuite.run(TestSuite.java:225)
	at junit.framework.TestSuite.runTest(TestSuite.java:230)
	at junit.framework.TestSuite.run(TestSuite.java:225)
	at junit.framework.TestSuite.runTest(TestSuite.java:230)
	at junit.framework.TestSuite.run(TestSuite.java:225)
	at sun.reflect.NativeMethodAccessorImpl.invoke0(Native Method)
	at sun.reflect.NativeMethodAccessorImpl.invoke(NativeMethodAccessorImpl.java:57)
	at sun.reflect.DelegatingMethodAccessorImpl.invoke(DelegatingMethodAccessorImpl.java:43)
	at java.lang.reflect.Method.invoke(Method.java:606)
	at org.apache.maven.surefire.junit.JUnitTestSet.execute(JUnitTestSet.java:99)
	at org.apache.maven.surefire.junit.JUnit3Provider.executeTestSet(JUnit3Provider.java:130)
	at org.apache.maven.surefire.junit.JUnit3Provider.invoke(JUnit3Provider.java:107)
	at org.apache.maven.surefire.booter.ForkedBooter.invokeProviderInSameClassLoader(ForkedBooter.java:203)
	at org.apache.maven.surefire.booter.ForkedBooter.runSuitesInProcess(ForkedBooter.java:155)
	at org.apache.maven.surefire.booter.ForkedBooter.main(ForkedBooter.java:103)

testParseMutableDateTime_chrono(org.joda.time.format.TestDateTimeFormatter)  Time elapsed: 0 sec  <<< ERROR!
java.lang.IllegalArgumentException: Field type must not be null
	at org.joda.time.format.DateTimeFormatterBuilder.appendShortText(DateTimeFormatterBuilder.java:108)
	at org.joda.time.format.DateTimeFormatterBuilder.appendDayOfWeekShortText(DateTimeFormatterBuilder.java:144)
	at org.joda.time.format.TestDateTimeFormatter.setUp(TestDateTimeFormatter.java:89)
	at junit.framework.TestCase.runBare(TestCase.java:128)
	at junit.framework.TestResult$1.protect(TestResult.java:106)
	at junit.framework.TestResult.runProtected(TestResult.java:124)
	at junit.framework.TestResult.run(TestResult.java:109)
	at junit.framework.TestCase.run(TestCase.java:120)
	at junit.framework.TestSuite.runTest(TestSuite.java:230)
	at junit.framework.TestSuite.run(TestSuite.java:225)
	at junit.framework.TestSuite.runTest(TestSuite.java:230)
	at junit.framework.TestSuite.run(TestSuite.java:225)
	at junit.framework.TestSuite.runTest(TestSuite.java:230)
	at junit.framework.TestSuite.run(TestSuite.java:225)
	at sun.reflect.NativeMethodAccessorImpl.invoke0(Native Method)
	at sun.reflect.NativeMethodAccessorImpl.invoke(NativeMethodAccessorImpl.java:57)
	at sun.reflect.DelegatingMethodAccessorImpl.invoke(DelegatingMethodAccessorImpl.java:43)
	at java.lang.reflect.Method.invoke(Method.java:606)
	at org.apache.maven.surefire.junit.JUnitTestSet.execute(JUnitTestSet.java:99)
	at org.apache.maven.surefire.junit.JUnit3Provider.executeTestSet(JUnit3Provider.java:130)
	at org.apache.maven.surefire.junit.JUnit3Provider.invoke(JUnit3Provider.java:107)
	at org.apache.maven.surefire.booter.ForkedBooter.invokeProviderInSameClassLoader(ForkedBooter.java:203)
	at org.apache.maven.surefire.booter.ForkedBooter.runSuitesInProcess(ForkedBooter.java:155)
	at org.apache.maven.surefire.booter.ForkedBooter.main(ForkedBooter.java:103)

testParseInto_simple(org.joda.time.format.TestDateTimeFormatter)  Time elapsed: 0 sec  <<< ERROR!
java.lang.IllegalArgumentException: Field type must not be null
	at org.joda.time.format.DateTimeFormatterBuilder.appendShortText(DateTimeFormatterBuilder.java:108)
	at org.joda.time.format.DateTimeFormatterBuilder.appendDayOfWeekShortText(DateTimeFormatterBuilder.java:144)
	at org.joda.time.format.TestDateTimeFormatter.setUp(TestDateTimeFormatter.java:89)
	at junit.framework.TestCase.runBare(TestCase.java:128)
	at junit.framework.TestResult$1.protect(TestResult.java:106)
	at junit.framework.TestResult.runProtected(TestResult.java:124)
	at junit.framework.TestResult.run(TestResult.java:109)
	at junit.framework.TestCase.run(TestCase.java:120)
	at junit.framework.TestSuite.runTest(TestSuite.java:230)
	at junit.framework.TestSuite.run(TestSuite.java:225)
	at junit.framework.TestSuite.runTest(TestSuite.java:230)
	at junit.framework.TestSuite.run(TestSuite.java:225)
	at junit.framework.TestSuite.runTest(TestSuite.java:230)
	at junit.framework.TestSuite.run(TestSuite.java:225)
	at sun.reflect.NativeMethodAccessorImpl.invoke0(Native Method)
	at sun.reflect.NativeMethodAccessorImpl.invoke(NativeMethodAccessorImpl.java:57)
	at sun.reflect.DelegatingMethodAccessorImpl.invoke(DelegatingMethodAccessorImpl.java:43)
	at java.lang.reflect.Method.invoke(Method.java:606)
	at org.apache.maven.surefire.junit.JUnitTestSet.execute(JUnitTestSet.java:99)
	at org.apache.maven.surefire.junit.JUnit3Provider.executeTestSet(JUnit3Provider.java:130)
	at org.apache.maven.surefire.junit.JUnit3Provider.invoke(JUnit3Provider.java:107)
	at org.apache.maven.surefire.booter.ForkedBooter.invokeProviderInSameClassLoader(ForkedBooter.java:203)
	at org.apache.maven.surefire.booter.ForkedBooter.runSuitesInProcess(ForkedBooter.java:155)
	at org.apache.maven.surefire.booter.ForkedBooter.main(ForkedBooter.java:103)

testParseInto_zone(org.joda.time.format.TestDateTimeFormatter)  Time elapsed: 0 sec  <<< ERROR!
java.lang.IllegalArgumentException: Field type must not be null
	at org.joda.time.format.DateTimeFormatterBuilder.appendShortText(DateTimeFormatterBuilder.java:108)
	at org.joda.time.format.DateTimeFormatterBuilder.appendDayOfWeekShortText(DateTimeFormatterBuilder.java:144)
	at org.joda.time.format.TestDateTimeFormatter.setUp(TestDateTimeFormatter.java:89)
	at junit.framework.TestCase.runBare(TestCase.java:128)
	at junit.framework.TestResult$1.protect(TestResult.java:106)
	at junit.framework.TestResult.runProtected(TestResult.java:124)
	at junit.framework.TestResult.run(TestResult.java:109)
	at junit.framework.TestCase.run(TestCase.java:120)
	at junit.framework.TestSuite.runTest(TestSuite.java:230)
	at junit.framework.TestSuite.run(TestSuite.java:225)
	at junit.framework.TestSuite.runTest(TestSuite.java:230)
	at junit.framework.TestSuite.run(TestSuite.java:225)
	at junit.framework.TestSuite.runTest(TestSuite.java:230)
	at junit.framework.TestSuite.run(TestSuite.java:225)
	at sun.reflect.NativeMethodAccessorImpl.invoke0(Native Method)
	at sun.reflect.NativeMethodAccessorImpl.invoke(NativeMethodAccessorImpl.java:57)
	at sun.reflect.DelegatingMethodAccessorImpl.invoke(DelegatingMethodAccessorImpl.java:43)
	at java.lang.reflect.Method.invoke(Method.java:606)
	at org.apache.maven.surefire.junit.JUnitTestSet.execute(JUnitTestSet.java:99)
	at org.apache.maven.surefire.junit.JUnit3Provider.executeTestSet(JUnit3Provider.java:130)
	at org.apache.maven.surefire.junit.JUnit3Provider.invoke(JUnit3Provider.java:107)
	at org.apache.maven.surefire.booter.ForkedBooter.invokeProviderInSameClassLoader(ForkedBooter.java:203)
	at org.apache.maven.surefire.booter.ForkedBooter.runSuitesInProcess(ForkedBooter.java:155)
	at org.apache.maven.surefire.booter.ForkedBooter.main(ForkedBooter.java:103)

testParseInto_zone2(org.joda.time.format.TestDateTimeFormatter)  Time elapsed: 0 sec  <<< ERROR!
java.lang.IllegalArgumentException: Field type must not be null
	at org.joda.time.format.DateTimeFormatterBuilder.appendShortText(DateTimeFormatterBuilder.java:108)
	at org.joda.time.format.DateTimeFormatterBuilder.appendDayOfWeekShortText(DateTimeFormatterBuilder.java:144)
	at org.joda.time.format.TestDateTimeFormatter.setUp(TestDateTimeFormatter.java:89)
	at junit.framework.TestCase.runBare(TestCase.java:128)
	at junit.framework.TestResult$1.protect(TestResult.java:106)
	at junit.framework.TestResult.runProtected(TestResult.java:124)
	at junit.framework.TestResult.run(TestResult.java:109)
	at junit.framework.TestCase.run(TestCase.java:120)
	at junit.framework.TestSuite.runTest(TestSuite.java:230)
	at junit.framework.TestSuite.run(TestSuite.java:225)
	at junit.framework.TestSuite.runTest(TestSuite.java:230)
	at junit.framework.TestSuite.run(TestSuite.java:225)
	at junit.framework.TestSuite.runTest(TestSuite.java:230)
	at junit.framework.TestSuite.run(TestSuite.java:225)
	at sun.reflect.NativeMethodAccessorImpl.invoke0(Native Method)
	at sun.reflect.NativeMethodAccessorImpl.invoke(NativeMethodAccessorImpl.java:57)
	at sun.reflect.DelegatingMethodAccessorImpl.invoke(DelegatingMethodAccessorImpl.java:43)
	at java.lang.reflect.Method.invoke(Method.java:606)
	at org.apache.maven.surefire.junit.JUnitTestSet.execute(JUnitTestSet.java:99)
	at org.apache.maven.surefire.junit.JUnit3Provider.executeTestSet(JUnit3Provider.java:130)
	at org.apache.maven.surefire.junit.JUnit3Provider.invoke(JUnit3Provider.java:107)
	at org.apache.maven.surefire.booter.ForkedBooter.invokeProviderInSameClassLoader(ForkedBooter.java:203)
	at org.apache.maven.surefire.booter.ForkedBooter.runSuitesInProcess(ForkedBooter.java:155)
	at org.apache.maven.surefire.booter.ForkedBooter.main(ForkedBooter.java:103)

testParseInto_zone3(org.joda.time.format.TestDateTimeFormatter)  Time elapsed: 0 sec  <<< ERROR!
java.lang.IllegalArgumentException: Field type must not be null
	at org.joda.time.format.DateTimeFormatterBuilder.appendShortText(DateTimeFormatterBuilder.java:108)
	at org.joda.time.format.DateTimeFormatterBuilder.appendDayOfWeekShortText(DateTimeFormatterBuilder.java:144)
	at org.joda.time.format.TestDateTimeFormatter.setUp(TestDateTimeFormatter.java:89)
	at junit.framework.TestCase.runBare(TestCase.java:128)
	at junit.framework.TestResult$1.protect(TestResult.java:106)
	at junit.framework.TestResult.runProtected(TestResult.java:124)
	at junit.framework.TestResult.run(TestResult.java:109)
	at junit.framework.TestCase.run(TestCase.java:120)
	at junit.framework.TestSuite.runTest(TestSuite.java:230)
	at junit.framework.TestSuite.run(TestSuite.java:225)
	at junit.framework.TestSuite.runTest(TestSuite.java:230)
	at junit.framework.TestSuite.run(TestSuite.java:225)
	at junit.framework.TestSuite.runTest(TestSuite.java:230)
	at junit.framework.TestSuite.run(TestSuite.java:225)
	at sun.reflect.NativeMethodAccessorImpl.invoke0(Native Method)
	at sun.reflect.NativeMethodAccessorImpl.invoke(NativeMethodAccessorImpl.java:57)
	at sun.reflect.DelegatingMethodAccessorImpl.invoke(DelegatingMethodAccessorImpl.java:43)
	at java.lang.reflect.Method.invoke(Method.java:606)
	at org.apache.maven.surefire.junit.JUnitTestSet.execute(JUnitTestSet.java:99)
	at org.apache.maven.surefire.junit.JUnit3Provider.executeTestSet(JUnit3Provider.java:130)
	at org.apache.maven.surefire.junit.JUnit3Provider.invoke(JUnit3Provider.java:107)
	at org.apache.maven.surefire.booter.ForkedBooter.invokeProviderInSameClassLoader(ForkedBooter.java:203)
	at org.apache.maven.surefire.booter.ForkedBooter.runSuitesInProcess(ForkedBooter.java:155)
	at org.apache.maven.surefire.booter.ForkedBooter.main(ForkedBooter.java:103)

testParseInto_simple_precedence(org.joda.time.format.TestDateTimeFormatter)  Time elapsed: 0 sec  <<< ERROR!
java.lang.IllegalArgumentException: Field type must not be null
	at org.joda.time.format.DateTimeFormatterBuilder.appendShortText(DateTimeFormatterBuilder.java:108)
	at org.joda.time.format.DateTimeFormatterBuilder.appendDayOfWeekShortText(DateTimeFormatterBuilder.java:144)
	at org.joda.time.format.TestDateTimeFormatter.setUp(TestDateTimeFormatter.java:89)
	at junit.framework.TestCase.runBare(TestCase.java:128)
	at junit.framework.TestResult$1.protect(TestResult.java:106)
	at junit.framework.TestResult.runProtected(TestResult.java:124)
	at junit.framework.TestResult.run(TestResult.java:109)
	at junit.framework.TestCase.run(TestCase.java:120)
	at junit.framework.TestSuite.runTest(TestSuite.java:230)
	at junit.framework.TestSuite.run(TestSuite.java:225)
	at junit.framework.TestSuite.runTest(TestSuite.java:230)
	at junit.framework.TestSuite.run(TestSuite.java:225)
	at junit.framework.TestSuite.runTest(TestSuite.java:230)
	at junit.framework.TestSuite.run(TestSuite.java:225)
	at sun.reflect.NativeMethodAccessorImpl.invoke0(Native Method)
	at sun.reflect.NativeMethodAccessorImpl.invoke(NativeMethodAccessorImpl.java:57)
	at sun.reflect.DelegatingMethodAccessorImpl.invoke(DelegatingMethodAccessorImpl.java:43)
	at java.lang.reflect.Method.invoke(Method.java:606)
	at org.apache.maven.surefire.junit.JUnitTestSet.execute(JUnitTestSet.java:99)
	at org.apache.maven.surefire.junit.JUnit3Provider.executeTestSet(JUnit3Provider.java:130)
	at org.apache.maven.surefire.junit.JUnit3Provider.invoke(JUnit3Provider.java:107)
	at org.apache.maven.surefire.booter.ForkedBooter.invokeProviderInSameClassLoader(ForkedBooter.java:203)
	at org.apache.maven.surefire.booter.ForkedBooter.runSuitesInProcess(ForkedBooter.java:155)
	at org.apache.maven.surefire.booter.ForkedBooter.main(ForkedBooter.java:103)

testParseInto_offsetParsed(org.joda.time.format.TestDateTimeFormatter)  Time elapsed: 0 sec  <<< ERROR!
java.lang.IllegalArgumentException: Field type must not be null
	at org.joda.time.format.DateTimeFormatterBuilder.appendShortText(DateTimeFormatterBuilder.java:108)
	at org.joda.time.format.DateTimeFormatterBuilder.appendDayOfWeekShortText(DateTimeFormatterBuilder.java:144)
	at org.joda.time.format.TestDateTimeFormatter.setUp(TestDateTimeFormatter.java:89)
	at junit.framework.TestCase.runBare(TestCase.java:128)
	at junit.framework.TestResult$1.protect(TestResult.java:106)
	at junit.framework.TestResult.runProtected(TestResult.java:124)
	at junit.framework.TestResult.run(TestResult.java:109)
	at junit.framework.TestCase.run(TestCase.java:120)
	at junit.framework.TestSuite.runTest(TestSuite.java:230)
	at junit.framework.TestSuite.run(TestSuite.java:225)
	at junit.framework.TestSuite.runTest(TestSuite.java:230)
	at junit.framework.TestSuite.run(TestSuite.java:225)
	at junit.framework.TestSuite.runTest(TestSuite.java:230)
	at junit.framework.TestSuite.run(TestSuite.java:225)
	at sun.reflect.NativeMethodAccessorImpl.invoke0(Native Method)
	at sun.reflect.NativeMethodAccessorImpl.invoke(NativeMethodAccessorImpl.java:57)
	at sun.reflect.DelegatingMethodAccessorImpl.invoke(DelegatingMethodAccessorImpl.java:43)
	at java.lang.reflect.Method.invoke(Method.java:606)
	at org.apache.maven.surefire.junit.JUnitTestSet.execute(JUnitTestSet.java:99)
	at org.apache.maven.surefire.junit.JUnit3Provider.executeTestSet(JUnit3Provider.java:130)
	at org.apache.maven.surefire.junit.JUnit3Provider.invoke(JUnit3Provider.java:107)
	at org.apache.maven.surefire.booter.ForkedBooter.invokeProviderInSameClassLoader(ForkedBooter.java:203)
	at org.apache.maven.surefire.booter.ForkedBooter.runSuitesInProcess(ForkedBooter.java:155)
	at org.apache.maven.surefire.booter.ForkedBooter.main(ForkedBooter.java:103)

testParseInto_chrono(org.joda.time.format.TestDateTimeFormatter)  Time elapsed: 0 sec  <<< ERROR!
java.lang.IllegalArgumentException: Field type must not be null
	at org.joda.time.format.DateTimeFormatterBuilder.appendShortText(DateTimeFormatterBuilder.java:108)
	at org.joda.time.format.DateTimeFormatterBuilder.appendDayOfWeekShortText(DateTimeFormatterBuilder.java:144)
	at org.joda.time.format.TestDateTimeFormatter.setUp(TestDateTimeFormatter.java:89)
	at junit.framework.TestCase.runBare(TestCase.java:128)
	at junit.framework.TestResult$1.protect(TestResult.java:106)
	at junit.framework.TestResult.runProtected(TestResult.java:124)
	at junit.framework.TestResult.run(TestResult.java:109)
	at junit.framework.TestCase.run(TestCase.java:120)
	at junit.framework.TestSuite.runTest(TestSuite.java:230)
	at junit.framework.TestSuite.run(TestSuite.java:225)
	at junit.framework.TestSuite.runTest(TestSuite.java:230)
	at junit.framework.TestSuite.run(TestSuite.java:225)
	at junit.framework.TestSuite.runTest(TestSuite.java:230)
	at junit.framework.TestSuite.run(TestSuite.java:225)
	at sun.reflect.NativeMethodAccessorImpl.invoke0(Native Method)
	at sun.reflect.NativeMethodAccessorImpl.invoke(NativeMethodAccessorImpl.java:57)
	at sun.reflect.DelegatingMethodAccessorImpl.invoke(DelegatingMethodAccessorImpl.java:43)
	at java.lang.reflect.Method.invoke(Method.java:606)
	at org.apache.maven.surefire.junit.JUnitTestSet.execute(JUnitTestSet.java:99)
	at org.apache.maven.surefire.junit.JUnit3Provider.executeTestSet(JUnit3Provider.java:130)
	at org.apache.maven.surefire.junit.JUnit3Provider.invoke(JUnit3Provider.java:107)
	at org.apache.maven.surefire.booter.ForkedBooter.invokeProviderInSameClassLoader(ForkedBooter.java:203)
	at org.apache.maven.surefire.booter.ForkedBooter.runSuitesInProcess(ForkedBooter.java:155)
	at org.apache.maven.surefire.booter.ForkedBooter.main(ForkedBooter.java:103)

testParseInto_monthOnly(org.joda.time.format.TestDateTimeFormatter)  Time elapsed: 0.001 sec  <<< ERROR!
java.lang.IllegalArgumentException: Field type must not be null
	at org.joda.time.format.DateTimeFormatterBuilder.appendShortText(DateTimeFormatterBuilder.java:108)
	at org.joda.time.format.DateTimeFormatterBuilder.appendDayOfWeekShortText(DateTimeFormatterBuilder.java:144)
	at org.joda.time.format.TestDateTimeFormatter.setUp(TestDateTimeFormatter.java:89)
	at junit.framework.TestCase.runBare(TestCase.java:128)
	at junit.framework.TestResult$1.protect(TestResult.java:106)
	at junit.framework.TestResult.runProtected(TestResult.java:124)
	at junit.framework.TestResult.run(TestResult.java:109)
	at junit.framework.TestCase.run(TestCase.java:120)
	at junit.framework.TestSuite.runTest(TestSuite.java:230)
	at junit.framework.TestSuite.run(TestSuite.java:225)
	at junit.framework.TestSuite.runTest(TestSuite.java:230)
	at junit.framework.TestSuite.run(TestSuite.java:225)
	at junit.framework.TestSuite.runTest(TestSuite.java:230)
	at junit.framework.TestSuite.run(TestSuite.java:225)
	at sun.reflect.NativeMethodAccessorImpl.invoke0(Native Method)
	at sun.reflect.NativeMethodAccessorImpl.invoke(NativeMethodAccessorImpl.java:57)
	at sun.reflect.DelegatingMethodAccessorImpl.invoke(DelegatingMethodAccessorImpl.java:43)
	at java.lang.reflect.Method.invoke(Method.java:606)
	at org.apache.maven.surefire.junit.JUnitTestSet.execute(JUnitTestSet.java:99)
	at org.apache.maven.surefire.junit.JUnit3Provider.executeTestSet(JUnit3Provider.java:130)
	at org.apache.maven.surefire.junit.JUnit3Provider.invoke(JUnit3Provider.java:107)
	at org.apache.maven.surefire.booter.ForkedBooter.invokeProviderInSameClassLoader(ForkedBooter.java:203)
	at org.apache.maven.surefire.booter.ForkedBooter.runSuitesInProcess(ForkedBooter.java:155)
	at org.apache.maven.surefire.booter.ForkedBooter.main(ForkedBooter.java:103)

testParseInto_monthOnly_baseStartYear(org.joda.time.format.TestDateTimeFormatter)  Time elapsed: 0.001 sec  <<< ERROR!
java.lang.IllegalArgumentException: Field type must not be null
	at org.joda.time.format.DateTimeFormatterBuilder.appendShortText(DateTimeFormatterBuilder.java:108)
	at org.joda.time.format.DateTimeFormatterBuilder.appendDayOfWeekShortText(DateTimeFormatterBuilder.java:144)
	at org.joda.time.format.TestDateTimeFormatter.setUp(TestDateTimeFormatter.java:89)
	at junit.framework.TestCase.runBare(TestCase.java:128)
	at junit.framework.TestResult$1.protect(TestResult.java:106)
	at junit.framework.TestResult.runProtected(TestResult.java:124)
	at junit.framework.TestResult.run(TestResult.java:109)
	at junit.framework.TestCase.run(TestCase.java:120)
	at junit.framework.TestSuite.runTest(TestSuite.java:230)
	at junit.framework.TestSuite.run(TestSuite.java:225)
	at junit.framework.TestSuite.runTest(TestSuite.java:230)
	at junit.framework.TestSuite.run(TestSuite.java:225)
	at junit.framework.TestSuite.runTest(TestSuite.java:230)
	at junit.framework.TestSuite.run(TestSuite.java:225)
	at sun.reflect.NativeMethodAccessorImpl.invoke0(Native Method)
	at sun.reflect.NativeMethodAccessorImpl.invoke(NativeMethodAccessorImpl.java:57)
	at sun.reflect.DelegatingMethodAccessorImpl.invoke(DelegatingMethodAccessorImpl.java:43)
	at java.lang.reflect.Method.invoke(Method.java:606)
	at org.apache.maven.surefire.junit.JUnitTestSet.execute(JUnitTestSet.java:99)
	at org.apache.maven.surefire.junit.JUnit3Provider.executeTestSet(JUnit3Provider.java:130)
	at org.apache.maven.surefire.junit.JUnit3Provider.invoke(JUnit3Provider.java:107)
	at org.apache.maven.surefire.booter.ForkedBooter.invokeProviderInSameClassLoader(ForkedBooter.java:203)
	at org.apache.maven.surefire.booter.ForkedBooter.runSuitesInProcess(ForkedBooter.java:155)
	at org.apache.maven.surefire.booter.ForkedBooter.main(ForkedBooter.java:103)

testParseInto_monthOnly_parseStartYear(org.joda.time.format.TestDateTimeFormatter)  Time elapsed: 0 sec  <<< ERROR!
java.lang.IllegalArgumentException: Field type must not be null
	at org.joda.time.format.DateTimeFormatterBuilder.appendShortText(DateTimeFormatterBuilder.java:108)
	at org.joda.time.format.DateTimeFormatterBuilder.appendDayOfWeekShortText(DateTimeFormatterBuilder.java:144)
	at org.joda.time.format.TestDateTimeFormatter.setUp(TestDateTimeFormatter.java:89)
	at junit.framework.TestCase.runBare(TestCase.java:128)
	at junit.framework.TestResult$1.protect(TestResult.java:106)
	at junit.framework.TestResult.runProtected(TestResult.java:124)
	at junit.framework.TestResult.run(TestResult.java:109)
	at junit.framework.TestCase.run(TestCase.java:120)
	at junit.framework.TestSuite.runTest(TestSuite.java:230)
	at junit.framework.TestSuite.run(TestSuite.java:225)
	at junit.framework.TestSuite.runTest(TestSuite.java:230)
	at junit.framework.TestSuite.run(TestSuite.java:225)
	at junit.framework.TestSuite.runTest(TestSuite.java:230)
	at junit.framework.TestSuite.run(TestSuite.java:225)
	at sun.reflect.NativeMethodAccessorImpl.invoke0(Native Method)
	at sun.reflect.NativeMethodAccessorImpl.invoke(NativeMethodAccessorImpl.java:57)
	at sun.reflect.DelegatingMethodAccessorImpl.invoke(DelegatingMethodAccessorImpl.java:43)
	at java.lang.reflect.Method.invoke(Method.java:606)
	at org.apache.maven.surefire.junit.JUnitTestSet.execute(JUnitTestSet.java:99)
	at org.apache.maven.surefire.junit.JUnit3Provider.executeTestSet(JUnit3Provider.java:130)
	at org.apache.maven.surefire.junit.JUnit3Provider.invoke(JUnit3Provider.java:107)
	at org.apache.maven.surefire.booter.ForkedBooter.invokeProviderInSameClassLoader(ForkedBooter.java:203)
	at org.apache.maven.surefire.booter.ForkedBooter.runSuitesInProcess(ForkedBooter.java:155)
	at org.apache.maven.surefire.booter.ForkedBooter.main(ForkedBooter.java:103)

testParseInto_monthOnly_baseEndYear(org.joda.time.format.TestDateTimeFormatter)  Time elapsed: 0.001 sec  <<< ERROR!
java.lang.IllegalArgumentException: Field type must not be null
	at org.joda.time.format.DateTimeFormatterBuilder.appendShortText(DateTimeFormatterBuilder.java:108)
	at org.joda.time.format.DateTimeFormatterBuilder.appendDayOfWeekShortText(DateTimeFormatterBuilder.java:144)
	at org.joda.time.format.TestDateTimeFormatter.setUp(TestDateTimeFormatter.java:89)
	at junit.framework.TestCase.runBare(TestCase.java:128)
	at junit.framework.TestResult$1.protect(TestResult.java:106)
	at junit.framework.TestResult.runProtected(TestResult.java:124)
	at junit.framework.TestResult.run(TestResult.java:109)
	at junit.framework.TestCase.run(TestCase.java:120)
	at junit.framework.TestSuite.runTest(TestSuite.java:230)
	at junit.framework.TestSuite.run(TestSuite.java:225)
	at junit.framework.TestSuite.runTest(TestSuite.java:230)
	at junit.framework.TestSuite.run(TestSuite.java:225)
	at junit.framework.TestSuite.runTest(TestSuite.java:230)
	at junit.framework.TestSuite.run(TestSuite.java:225)
	at sun.reflect.NativeMethodAccessorImpl.invoke0(Native Method)
	at sun.reflect.NativeMethodAccessorImpl.invoke(NativeMethodAccessorImpl.java:57)
	at sun.reflect.DelegatingMethodAccessorImpl.invoke(DelegatingMethodAccessorImpl.java:43)
	at java.lang.reflect.Method.invoke(Method.java:606)
	at org.apache.maven.surefire.junit.JUnitTestSet.execute(JUnitTestSet.java:99)
	at org.apache.maven.surefire.junit.JUnit3Provider.executeTestSet(JUnit3Provider.java:130)
	at org.apache.maven.surefire.junit.JUnit3Provider.invoke(JUnit3Provider.java:107)
	at org.apache.maven.surefire.booter.ForkedBooter.invokeProviderInSameClassLoader(ForkedBooter.java:203)
	at org.apache.maven.surefire.booter.ForkedBooter.runSuitesInProcess(ForkedBooter.java:155)
	at org.apache.maven.surefire.booter.ForkedBooter.main(ForkedBooter.java:103)

testParseInto_monthOnly_parseEndYear(org.joda.time.format.TestDateTimeFormatter)  Time elapsed: 0.001 sec  <<< ERROR!
java.lang.IllegalArgumentException: Field type must not be null
	at org.joda.time.format.DateTimeFormatterBuilder.appendShortText(DateTimeFormatterBuilder.java:108)
	at org.joda.time.format.DateTimeFormatterBuilder.appendDayOfWeekShortText(DateTimeFormatterBuilder.java:144)
	at org.joda.time.format.TestDateTimeFormatter.setUp(TestDateTimeFormatter.java:89)
	at junit.framework.TestCase.runBare(TestCase.java:128)
	at junit.framework.TestResult$1.protect(TestResult.java:106)
	at junit.framework.TestResult.runProtected(TestResult.java:124)
	at junit.framework.TestResult.run(TestResult.java:109)
	at junit.framework.TestCase.run(TestCase.java:120)
	at junit.framework.TestSuite.runTest(TestSuite.java:230)
	at junit.framework.TestSuite.run(TestSuite.java:225)
	at junit.framework.TestSuite.runTest(TestSuite.java:230)
	at junit.framework.TestSuite.run(TestSuite.java:225)
	at junit.framework.TestSuite.runTest(TestSuite.java:230)
	at junit.framework.TestSuite.run(TestSuite.java:225)
	at sun.reflect.NativeMethodAccessorImpl.invoke0(Native Method)
	at sun.reflect.NativeMethodAccessorImpl.invoke(NativeMethodAccessorImpl.java:57)
	at sun.reflect.DelegatingMethodAccessorImpl.invoke(DelegatingMethodAccessorImpl.java:43)
	at java.lang.reflect.Method.invoke(Method.java:606)
	at org.apache.maven.surefire.junit.JUnitTestSet.execute(JUnitTestSet.java:99)
	at org.apache.maven.surefire.junit.JUnit3Provider.executeTestSet(JUnit3Provider.java:130)
	at org.apache.maven.surefire.junit.JUnit3Provider.invoke(JUnit3Provider.java:107)
	at org.apache.maven.surefire.booter.ForkedBooter.invokeProviderInSameClassLoader(ForkedBooter.java:203)
	at org.apache.maven.surefire.booter.ForkedBooter.runSuitesInProcess(ForkedBooter.java:155)
	at org.apache.maven.surefire.booter.ForkedBooter.main(ForkedBooter.java:103)

testParseInto_monthDay_feb29(org.joda.time.format.TestDateTimeFormatter)  Time elapsed: 0.001 sec  <<< ERROR!
java.lang.IllegalArgumentException: Field type must not be null
	at org.joda.time.format.DateTimeFormatterBuilder.appendShortText(DateTimeFormatterBuilder.java:108)
	at org.joda.time.format.DateTimeFormatterBuilder.appendDayOfWeekShortText(DateTimeFormatterBuilder.java:144)
	at org.joda.time.format.TestDateTimeFormatter.setUp(TestDateTimeFormatter.java:89)
	at junit.framework.TestCase.runBare(TestCase.java:128)
	at junit.framework.TestResult$1.protect(TestResult.java:106)
	at junit.framework.TestResult.runProtected(TestResult.java:124)
	at junit.framework.TestResult.run(TestResult.java:109)
	at junit.framework.TestCase.run(TestCase.java:120)
	at junit.framework.TestSuite.runTest(TestSuite.java:230)
	at junit.framework.TestSuite.run(TestSuite.java:225)
	at junit.framework.TestSuite.runTest(TestSuite.java:230)
	at junit.framework.TestSuite.run(TestSuite.java:225)
	at junit.framework.TestSuite.runTest(TestSuite.java:230)
	at junit.framework.TestSuite.run(TestSuite.java:225)
	at sun.reflect.NativeMethodAccessorImpl.invoke0(Native Method)
	at sun.reflect.NativeMethodAccessorImpl.invoke(NativeMethodAccessorImpl.java:57)
	at sun.reflect.DelegatingMethodAccessorImpl.invoke(DelegatingMethodAccessorImpl.java:43)
	at java.lang.reflect.Method.invoke(Method.java:606)
	at org.apache.maven.surefire.junit.JUnitTestSet.execute(JUnitTestSet.java:99)
	at org.apache.maven.surefire.junit.JUnit3Provider.executeTestSet(JUnit3Provider.java:130)
	at org.apache.maven.surefire.junit.JUnit3Provider.invoke(JUnit3Provider.java:107)
	at org.apache.maven.surefire.booter.ForkedBooter.invokeProviderInSameClassLoader(ForkedBooter.java:203)
	at org.apache.maven.surefire.booter.ForkedBooter.runSuitesInProcess(ForkedBooter.java:155)
	at org.apache.maven.surefire.booter.ForkedBooter.main(ForkedBooter.java:103)

testParseInto_monthDay_feb29_startOfYear(org.joda.time.format.TestDateTimeFormatter)  Time elapsed: 0.001 sec  <<< ERROR!
java.lang.IllegalArgumentException: Field type must not be null
	at org.joda.time.format.DateTimeFormatterBuilder.appendShortText(DateTimeFormatterBuilder.java:108)
	at org.joda.time.format.DateTimeFormatterBuilder.appendDayOfWeekShortText(DateTimeFormatterBuilder.java:144)
	at org.joda.time.format.TestDateTimeFormatter.setUp(TestDateTimeFormatter.java:89)
	at junit.framework.TestCase.runBare(TestCase.java:128)
	at junit.framework.TestResult$1.protect(TestResult.java:106)
	at junit.framework.TestResult.runProtected(TestResult.java:124)
	at junit.framework.TestResult.run(TestResult.java:109)
	at junit.framework.TestCase.run(TestCase.java:120)
	at junit.framework.TestSuite.runTest(TestSuite.java:230)
	at junit.framework.TestSuite.run(TestSuite.java:225)
	at junit.framework.TestSuite.runTest(TestSuite.java:230)
	at junit.framework.TestSuite.run(TestSuite.java:225)
	at junit.framework.TestSuite.runTest(TestSuite.java:230)
	at junit.framework.TestSuite.run(TestSuite.java:225)
	at sun.reflect.NativeMethodAccessorImpl.invoke0(Native Method)
	at sun.reflect.NativeMethodAccessorImpl.invoke(NativeMethodAccessorImpl.java:57)
	at sun.reflect.DelegatingMethodAccessorImpl.invoke(DelegatingMethodAccessorImpl.java:43)
	at java.lang.reflect.Method.invoke(Method.java:606)
	at org.apache.maven.surefire.junit.JUnitTestSet.execute(JUnitTestSet.java:99)
	at org.apache.maven.surefire.junit.JUnit3Provider.executeTestSet(JUnit3Provider.java:130)
	at org.apache.maven.surefire.junit.JUnit3Provider.invoke(JUnit3Provider.java:107)
	at org.apache.maven.surefire.booter.ForkedBooter.invokeProviderInSameClassLoader(ForkedBooter.java:203)
	at org.apache.maven.surefire.booter.ForkedBooter.runSuitesInProcess(ForkedBooter.java:155)
	at org.apache.maven.surefire.booter.ForkedBooter.main(ForkedBooter.java:103)

testParseInto_monthDay_feb29_OfYear(org.joda.time.format.TestDateTimeFormatter)  Time elapsed: 0.001 sec  <<< ERROR!
java.lang.IllegalArgumentException: Field type must not be null
	at org.joda.time.format.DateTimeFormatterBuilder.appendShortText(DateTimeFormatterBuilder.java:108)
	at org.joda.time.format.DateTimeFormatterBuilder.appendDayOfWeekShortText(DateTimeFormatterBuilder.java:144)
	at org.joda.time.format.TestDateTimeFormatter.setUp(TestDateTimeFormatter.java:89)
	at junit.framework.TestCase.runBare(TestCase.java:128)
	at junit.framework.TestResult$1.protect(TestResult.java:106)
	at junit.framework.TestResult.runProtected(TestResult.java:124)
	at junit.framework.TestResult.run(TestResult.java:109)
	at junit.framework.TestCase.run(TestCase.java:120)
	at junit.framework.TestSuite.runTest(TestSuite.java:230)
	at junit.framework.TestSuite.run(TestSuite.java:225)
	at junit.framework.TestSuite.runTest(TestSuite.java:230)
	at junit.framework.TestSuite.run(TestSuite.java:225)
	at junit.framework.TestSuite.runTest(TestSuite.java:230)
	at junit.framework.TestSuite.run(TestSuite.java:225)
	at sun.reflect.NativeMethodAccessorImpl.invoke0(Native Method)
	at sun.reflect.NativeMethodAccessorImpl.invoke(NativeMethodAccessorImpl.java:57)
	at sun.reflect.DelegatingMethodAccessorImpl.invoke(DelegatingMethodAccessorImpl.java:43)
	at java.lang.reflect.Method.invoke(Method.java:606)
	at org.apache.maven.surefire.junit.JUnitTestSet.execute(JUnitTestSet.java:99)
	at org.apache.maven.surefire.junit.JUnit3Provider.executeTestSet(JUnit3Provider.java:130)
	at org.apache.maven.surefire.junit.JUnit3Provider.invoke(JUnit3Provider.java:107)
	at org.apache.maven.surefire.booter.ForkedBooter.invokeProviderInSameClassLoader(ForkedBooter.java:203)
	at org.apache.maven.surefire.booter.ForkedBooter.runSuitesInProcess(ForkedBooter.java:155)
	at org.apache.maven.surefire.booter.ForkedBooter.main(ForkedBooter.java:103)

testParseInto_monthDay_feb29_newYork(org.joda.time.format.TestDateTimeFormatter)  Time elapsed: 0.001 sec  <<< ERROR!
java.lang.IllegalArgumentException: Field type must not be null
	at org.joda.time.format.DateTimeFormatterBuilder.appendShortText(DateTimeFormatterBuilder.java:108)
	at org.joda.time.format.DateTimeFormatterBuilder.appendDayOfWeekShortText(DateTimeFormatterBuilder.java:144)
	at org.joda.time.format.TestDateTimeFormatter.setUp(TestDateTimeFormatter.java:89)
	at junit.framework.TestCase.runBare(TestCase.java:128)
	at junit.framework.TestResult$1.protect(TestResult.java:106)
	at junit.framework.TestResult.runProtected(TestResult.java:124)
	at junit.framework.TestResult.run(TestResult.java:109)
	at junit.framework.TestCase.run(TestCase.java:120)
	at junit.framework.TestSuite.runTest(TestSuite.java:230)
	at junit.framework.TestSuite.run(TestSuite.java:225)
	at junit.framework.TestSuite.runTest(TestSuite.java:230)
	at junit.framework.TestSuite.run(TestSuite.java:225)
	at junit.framework.TestSuite.runTest(TestSuite.java:230)
	at junit.framework.TestSuite.run(TestSuite.java:225)
	at sun.reflect.NativeMethodAccessorImpl.invoke0(Native Method)
	at sun.reflect.NativeMethodAccessorImpl.invoke(NativeMethodAccessorImpl.java:57)
	at sun.reflect.DelegatingMethodAccessorImpl.invoke(DelegatingMethodAccessorImpl.java:43)
	at java.lang.reflect.Method.invoke(Method.java:606)
	at org.apache.maven.surefire.junit.JUnitTestSet.execute(JUnitTestSet.java:99)
	at org.apache.maven.surefire.junit.JUnit3Provider.executeTestSet(JUnit3Provider.java:130)
	at org.apache.maven.surefire.junit.JUnit3Provider.invoke(JUnit3Provider.java:107)
	at org.apache.maven.surefire.booter.ForkedBooter.invokeProviderInSameClassLoader(ForkedBooter.java:203)
	at org.apache.maven.surefire.booter.ForkedBooter.runSuitesInProcess(ForkedBooter.java:155)
	at org.apache.maven.surefire.booter.ForkedBooter.main(ForkedBooter.java:103)

testParseInto_monthDay_feb29_newYork_startOfYear(org.joda.time.format.TestDateTimeFormatter)  Time elapsed: 0.001 sec  <<< ERROR!
java.lang.IllegalArgumentException: Field type must not be null
	at org.joda.time.format.DateTimeFormatterBuilder.appendShortText(DateTimeFormatterBuilder.java:108)
	at org.joda.time.format.DateTimeFormatterBuilder.appendDayOfWeekShortText(DateTimeFormatterBuilder.java:144)
	at org.joda.time.format.TestDateTimeFormatter.setUp(TestDateTimeFormatter.java:89)
	at junit.framework.TestCase.runBare(TestCase.java:128)
	at junit.framework.TestResult$1.protect(TestResult.java:106)
	at junit.framework.TestResult.runProtected(TestResult.java:124)
	at junit.framework.TestResult.run(TestResult.java:109)
	at junit.framework.TestCase.run(TestCase.java:120)
	at junit.framework.TestSuite.runTest(TestSuite.java:230)
	at junit.framework.TestSuite.run(TestSuite.java:225)
	at junit.framework.TestSuite.runTest(TestSuite.java:230)
	at junit.framework.TestSuite.run(TestSuite.java:225)
	at junit.framework.TestSuite.runTest(TestSuite.java:230)
	at junit.framework.TestSuite.run(TestSuite.java:225)
	at sun.reflect.NativeMethodAccessorImpl.invoke0(Native Method)
	at sun.reflect.NativeMethodAccessorImpl.invoke(NativeMethodAccessorImpl.java:57)
	at sun.reflect.DelegatingMethodAccessorImpl.invoke(DelegatingMethodAccessorImpl.java:43)
	at java.lang.reflect.Method.invoke(Method.java:606)
	at org.apache.maven.surefire.junit.JUnitTestSet.execute(JUnitTestSet.java:99)
	at org.apache.maven.surefire.junit.JUnit3Provider.executeTestSet(JUnit3Provider.java:130)
	at org.apache.maven.surefire.junit.JUnit3Provider.invoke(JUnit3Provider.java:107)
	at org.apache.maven.surefire.booter.ForkedBooter.invokeProviderInSameClassLoader(ForkedBooter.java:203)
	at org.apache.maven.surefire.booter.ForkedBooter.runSuitesInProcess(ForkedBooter.java:155)
	at org.apache.maven.surefire.booter.ForkedBooter.main(ForkedBooter.java:103)

testParseInto_monthDay_feb29_newYork_endOfYear(org.joda.time.format.TestDateTimeFormatter)  Time elapsed: 0.001 sec  <<< ERROR!
java.lang.IllegalArgumentException: Field type must not be null
	at org.joda.time.format.DateTimeFormatterBuilder.appendShortText(DateTimeFormatterBuilder.java:108)
	at org.joda.time.format.DateTimeFormatterBuilder.appendDayOfWeekShortText(DateTimeFormatterBuilder.java:144)
	at org.joda.time.format.TestDateTimeFormatter.setUp(TestDateTimeFormatter.java:89)
	at junit.framework.TestCase.runBare(TestCase.java:128)
	at junit.framework.TestResult$1.protect(TestResult.java:106)
	at junit.framework.TestResult.runProtected(TestResult.java:124)
	at junit.framework.TestResult.run(TestResult.java:109)
	at junit.framework.TestCase.run(TestCase.java:120)
	at junit.framework.TestSuite.runTest(TestSuite.java:230)
	at junit.framework.TestSuite.run(TestSuite.java:225)
	at junit.framework.TestSuite.runTest(TestSuite.java:230)
	at junit.framework.TestSuite.run(TestSuite.java:225)
	at junit.framework.TestSuite.runTest(TestSuite.java:230)
	at junit.framework.TestSuite.run(TestSuite.java:225)
	at sun.reflect.NativeMethodAccessorImpl.invoke0(Native Method)
	at sun.reflect.NativeMethodAccessorImpl.invoke(NativeMethodAccessorImpl.java:57)
	at sun.reflect.DelegatingMethodAccessorImpl.invoke(DelegatingMethodAccessorImpl.java:43)
	at java.lang.reflect.Method.invoke(Method.java:606)
	at org.apache.maven.surefire.junit.JUnitTestSet.execute(JUnitTestSet.java:99)
	at org.apache.maven.surefire.junit.JUnit3Provider.executeTestSet(JUnit3Provider.java:130)
	at org.apache.maven.surefire.junit.JUnit3Provider.invoke(JUnit3Provider.java:107)
	at org.apache.maven.surefire.booter.ForkedBooter.invokeProviderInSameClassLoader(ForkedBooter.java:203)
	at org.apache.maven.surefire.booter.ForkedBooter.runSuitesInProcess(ForkedBooter.java:155)
	at org.apache.maven.surefire.booter.ForkedBooter.main(ForkedBooter.java:103)

testParseInto_monthDay_feb29_tokyo(org.joda.time.format.TestDateTimeFormatter)  Time elapsed: 0.001 sec  <<< ERROR!
java.lang.IllegalArgumentException: Field type must not be null
	at org.joda.time.format.DateTimeFormatterBuilder.appendShortText(DateTimeFormatterBuilder.java:108)
	at org.joda.time.format.DateTimeFormatterBuilder.appendDayOfWeekShortText(DateTimeFormatterBuilder.java:144)
	at org.joda.time.format.TestDateTimeFormatter.setUp(TestDateTimeFormatter.java:89)
	at junit.framework.TestCase.runBare(TestCase.java:128)
	at junit.framework.TestResult$1.protect(TestResult.java:106)
	at junit.framework.TestResult.runProtected(TestResult.java:124)
	at junit.framework.TestResult.run(TestResult.java:109)
	at junit.framework.TestCase.run(TestCase.java:120)
	at junit.framework.TestSuite.runTest(TestSuite.java:230)
	at junit.framework.TestSuite.run(TestSuite.java:225)
	at junit.framework.TestSuite.runTest(TestSuite.java:230)
	at junit.framework.TestSuite.run(TestSuite.java:225)
	at junit.framework.TestSuite.runTest(TestSuite.java:230)
	at junit.framework.TestSuite.run(TestSuite.java:225)
	at sun.reflect.NativeMethodAccessorImpl.invoke0(Native Method)
	at sun.reflect.NativeMethodAccessorImpl.invoke(NativeMethodAccessorImpl.java:57)
	at sun.reflect.DelegatingMethodAccessorImpl.invoke(DelegatingMethodAccessorImpl.java:43)
	at java.lang.reflect.Method.invoke(Method.java:606)
	at org.apache.maven.surefire.junit.JUnitTestSet.execute(JUnitTestSet.java:99)
	at org.apache.maven.surefire.junit.JUnit3Provider.executeTestSet(JUnit3Provider.java:130)
	at org.apache.maven.surefire.junit.JUnit3Provider.invoke(JUnit3Provider.java:107)
	at org.apache.maven.surefire.booter.ForkedBooter.invokeProviderInSameClassLoader(ForkedBooter.java:203)
	at org.apache.maven.surefire.booter.ForkedBooter.runSuitesInProcess(ForkedBooter.java:155)
	at org.apache.maven.surefire.booter.ForkedBooter.main(ForkedBooter.java:103)

testParseInto_monthDay_feb29_tokyo_startOfYear(org.joda.time.format.TestDateTimeFormatter)  Time elapsed: 0.001 sec  <<< ERROR!
java.lang.IllegalArgumentException: Field type must not be null
	at org.joda.time.format.DateTimeFormatterBuilder.appendShortText(DateTimeFormatterBuilder.java:108)
	at org.joda.time.format.DateTimeFormatterBuilder.appendDayOfWeekShortText(DateTimeFormatterBuilder.java:144)
	at org.joda.time.format.TestDateTimeFormatter.setUp(TestDateTimeFormatter.java:89)
	at junit.framework.TestCase.runBare(TestCase.java:128)
	at junit.framework.TestResult$1.protect(TestResult.java:106)
	at junit.framework.TestResult.runProtected(TestResult.java:124)
	at junit.framework.TestResult.run(TestResult.java:109)
	at junit.framework.TestCase.run(TestCase.java:120)
	at junit.framework.TestSuite.runTest(TestSuite.java:230)
	at junit.framework.TestSuite.run(TestSuite.java:225)
	at junit.framework.TestSuite.runTest(TestSuite.java:230)
	at junit.framework.TestSuite.run(TestSuite.java:225)
	at junit.framework.TestSuite.runTest(TestSuite.java:230)
	at junit.framework.TestSuite.run(TestSuite.java:225)
	at sun.reflect.NativeMethodAccessorImpl.invoke0(Native Method)
	at sun.reflect.NativeMethodAccessorImpl.invoke(NativeMethodAccessorImpl.java:57)
	at sun.reflect.DelegatingMethodAccessorImpl.invoke(DelegatingMethodAccessorImpl.java:43)
	at java.lang.reflect.Method.invoke(Method.java:606)
	at org.apache.maven.surefire.junit.JUnitTestSet.execute(JUnitTestSet.java:99)
	at org.apache.maven.surefire.junit.JUnit3Provider.executeTestSet(JUnit3Provider.java:130)
	at org.apache.maven.surefire.junit.JUnit3Provider.invoke(JUnit3Provider.java:107)
	at org.apache.maven.surefire.booter.ForkedBooter.invokeProviderInSameClassLoader(ForkedBooter.java:203)
	at org.apache.maven.surefire.booter.ForkedBooter.runSuitesInProcess(ForkedBooter.java:155)
	at org.apache.maven.surefire.booter.ForkedBooter.main(ForkedBooter.java:103)

testParseInto_monthDay_feb29_tokyo_endOfYear(org.joda.time.format.TestDateTimeFormatter)  Time elapsed: 0.001 sec  <<< ERROR!
java.lang.IllegalArgumentException: Field type must not be null
	at org.joda.time.format.DateTimeFormatterBuilder.appendShortText(DateTimeFormatterBuilder.java:108)
	at org.joda.time.format.DateTimeFormatterBuilder.appendDayOfWeekShortText(DateTimeFormatterBuilder.java:144)
	at org.joda.time.format.TestDateTimeFormatter.setUp(TestDateTimeFormatter.java:89)
	at junit.framework.TestCase.runBare(TestCase.java:128)
	at junit.framework.TestResult$1.protect(TestResult.java:106)
	at junit.framework.TestResult.runProtected(TestResult.java:124)
	at junit.framework.TestResult.run(TestResult.java:109)
	at junit.framework.TestCase.run(TestCase.java:120)
	at junit.framework.TestSuite.runTest(TestSuite.java:230)
	at junit.framework.TestSuite.run(TestSuite.java:225)
	at junit.framework.TestSuite.runTest(TestSuite.java:230)
	at junit.framework.TestSuite.run(TestSuite.java:225)
	at junit.framework.TestSuite.runTest(TestSuite.java:230)
	at junit.framework.TestSuite.run(TestSuite.java:225)
	at sun.reflect.NativeMethodAccessorImpl.invoke0(Native Method)
	at sun.reflect.NativeMethodAccessorImpl.invoke(NativeMethodAccessorImpl.java:57)
	at sun.reflect.DelegatingMethodAccessorImpl.invoke(DelegatingMethodAccessorImpl.java:43)
	at java.lang.reflect.Method.invoke(Method.java:606)
	at org.apache.maven.surefire.junit.JUnitTestSet.execute(JUnitTestSet.java:99)
	at org.apache.maven.surefire.junit.JUnit3Provider.executeTestSet(JUnit3Provider.java:130)
	at org.apache.maven.surefire.junit.JUnit3Provider.invoke(JUnit3Provider.java:107)
	at org.apache.maven.surefire.booter.ForkedBooter.invokeProviderInSameClassLoader(ForkedBooter.java:203)
	at org.apache.maven.surefire.booter.ForkedBooter.runSuitesInProcess(ForkedBooter.java:155)
	at org.apache.maven.surefire.booter.ForkedBooter.main(ForkedBooter.java:103)

testParseInto_monthDay_withDefaultYear_feb29(org.joda.time.format.TestDateTimeFormatter)  Time elapsed: 0.001 sec  <<< ERROR!
java.lang.IllegalArgumentException: Field type must not be null
	at org.joda.time.format.DateTimeFormatterBuilder.appendShortText(DateTimeFormatterBuilder.java:108)
	at org.joda.time.format.DateTimeFormatterBuilder.appendDayOfWeekShortText(DateTimeFormatterBuilder.java:144)
	at org.joda.time.format.TestDateTimeFormatter.setUp(TestDateTimeFormatter.java:89)
	at junit.framework.TestCase.runBare(TestCase.java:128)
	at junit.framework.TestResult$1.protect(TestResult.java:106)
	at junit.framework.TestResult.runProtected(TestResult.java:124)
	at junit.framework.TestResult.run(TestResult.java:109)
	at junit.framework.TestCase.run(TestCase.java:120)
	at junit.framework.TestSuite.runTest(TestSuite.java:230)
	at junit.framework.TestSuite.run(TestSuite.java:225)
	at junit.framework.TestSuite.runTest(TestSuite.java:230)
	at junit.framework.TestSuite.run(TestSuite.java:225)
	at junit.framework.TestSuite.runTest(TestSuite.java:230)
	at junit.framework.TestSuite.run(TestSuite.java:225)
	at sun.reflect.NativeMethodAccessorImpl.invoke0(Native Method)
	at sun.reflect.NativeMethodAccessorImpl.invoke(NativeMethodAccessorImpl.java:57)
	at sun.reflect.DelegatingMethodAccessorImpl.invoke(DelegatingMethodAccessorImpl.java:43)
	at java.lang.reflect.Method.invoke(Method.java:606)
	at org.apache.maven.surefire.junit.JUnitTestSet.execute(JUnitTestSet.java:99)
	at org.apache.maven.surefire.junit.JUnit3Provider.executeTestSet(JUnit3Provider.java:130)
	at org.apache.maven.surefire.junit.JUnit3Provider.invoke(JUnit3Provider.java:107)
	at org.apache.maven.surefire.booter.ForkedBooter.invokeProviderInSameClassLoader(ForkedBooter.java:203)
	at org.apache.maven.surefire.booter.ForkedBooter.runSuitesInProcess(ForkedBooter.java:155)
	at org.apache.maven.surefire.booter.ForkedBooter.main(ForkedBooter.java:103)

testParseInto_monthDay_withDefaultYear_feb29_newYork(org.joda.time.format.TestDateTimeFormatter)  Time elapsed: 0.001 sec  <<< ERROR!
java.lang.IllegalArgumentException: Field type must not be null
	at org.joda.time.format.DateTimeFormatterBuilder.appendShortText(DateTimeFormatterBuilder.java:108)
	at org.joda.time.format.DateTimeFormatterBuilder.appendDayOfWeekShortText(DateTimeFormatterBuilder.java:144)
	at org.joda.time.format.TestDateTimeFormatter.setUp(TestDateTimeFormatter.java:89)
	at junit.framework.TestCase.runBare(TestCase.java:128)
	at junit.framework.TestResult$1.protect(TestResult.java:106)
	at junit.framework.TestResult.runProtected(TestResult.java:124)
	at junit.framework.TestResult.run(TestResult.java:109)
	at junit.framework.TestCase.run(TestCase.java:120)
	at junit.framework.TestSuite.runTest(TestSuite.java:230)
	at junit.framework.TestSuite.run(TestSuite.java:225)
	at junit.framework.TestSuite.runTest(TestSuite.java:230)
	at junit.framework.TestSuite.run(TestSuite.java:225)
	at junit.framework.TestSuite.runTest(TestSuite.java:230)
	at junit.framework.TestSuite.run(TestSuite.java:225)
	at sun.reflect.NativeMethodAccessorImpl.invoke0(Native Method)
	at sun.reflect.NativeMethodAccessorImpl.invoke(NativeMethodAccessorImpl.java:57)
	at sun.reflect.DelegatingMethodAccessorImpl.invoke(DelegatingMethodAccessorImpl.java:43)
	at java.lang.reflect.Method.invoke(Method.java:606)
	at org.apache.maven.surefire.junit.JUnitTestSet.execute(JUnitTestSet.java:99)
	at org.apache.maven.surefire.junit.JUnit3Provider.executeTestSet(JUnit3Provider.java:130)
	at org.apache.maven.surefire.junit.JUnit3Provider.invoke(JUnit3Provider.java:107)
	at org.apache.maven.surefire.booter.ForkedBooter.invokeProviderInSameClassLoader(ForkedBooter.java:203)
	at org.apache.maven.surefire.booter.ForkedBooter.runSuitesInProcess(ForkedBooter.java:155)
	at org.apache.maven.surefire.booter.ForkedBooter.main(ForkedBooter.java:103)

testParseInto_monthDay_withDefaultYear_feb29_newYork_endOfYear(org.joda.time.format.TestDateTimeFormatter)  Time elapsed: 0.001 sec  <<< ERROR!
java.lang.IllegalArgumentException: Field type must not be null
	at org.joda.time.format.DateTimeFormatterBuilder.appendShortText(DateTimeFormatterBuilder.java:108)
	at org.joda.time.format.DateTimeFormatterBuilder.appendDayOfWeekShortText(DateTimeFormatterBuilder.java:144)
	at org.joda.time.format.TestDateTimeFormatter.setUp(TestDateTimeFormatter.java:89)
	at junit.framework.TestCase.runBare(TestCase.java:128)
	at junit.framework.TestResult$1.protect(TestResult.java:106)
	at junit.framework.TestResult.runProtected(TestResult.java:124)
	at junit.framework.TestResult.run(TestResult.java:109)
	at junit.framework.TestCase.run(TestCase.java:120)
	at junit.framework.TestSuite.runTest(TestSuite.java:230)
	at junit.framework.TestSuite.run(TestSuite.java:225)
	at junit.framework.TestSuite.runTest(TestSuite.java:230)
	at junit.framework.TestSuite.run(TestSuite.java:225)
	at junit.framework.TestSuite.runTest(TestSuite.java:230)
	at junit.framework.TestSuite.run(TestSuite.java:225)
	at sun.reflect.NativeMethodAccessorImpl.invoke0(Native Method)
	at sun.reflect.NativeMethodAccessorImpl.invoke(NativeMethodAccessorImpl.java:57)
	at sun.reflect.DelegatingMethodAccessorImpl.invoke(DelegatingMethodAccessorImpl.java:43)
	at java.lang.reflect.Method.invoke(Method.java:606)
	at org.apache.maven.surefire.junit.JUnitTestSet.execute(JUnitTestSet.java:99)
	at org.apache.maven.surefire.junit.JUnit3Provider.executeTestSet(JUnit3Provider.java:130)
	at org.apache.maven.surefire.junit.JUnit3Provider.invoke(JUnit3Provider.java:107)
	at org.apache.maven.surefire.booter.ForkedBooter.invokeProviderInSameClassLoader(ForkedBooter.java:203)
	at org.apache.maven.surefire.booter.ForkedBooter.runSuitesInProcess(ForkedBooter.java:155)
	at org.apache.maven.surefire.booter.ForkedBooter.main(ForkedBooter.java:103)

testParseMillis_fractionOfSecondLong(org.joda.time.format.TestDateTimeFormatter)  Time elapsed: 0 sec  <<< ERROR!
java.lang.IllegalArgumentException: Field type must not be null
	at org.joda.time.format.DateTimeFormatterBuilder.appendShortText(DateTimeFormatterBuilder.java:108)
	at org.joda.time.format.DateTimeFormatterBuilder.appendDayOfWeekShortText(DateTimeFormatterBuilder.java:144)
	at org.joda.time.format.TestDateTimeFormatter.setUp(TestDateTimeFormatter.java:89)
	at junit.framework.TestCase.runBare(TestCase.java:128)
	at junit.framework.TestResult$1.protect(TestResult.java:106)
	at junit.framework.TestResult.runProtected(TestResult.java:124)
	at junit.framework.TestResult.run(TestResult.java:109)
	at junit.framework.TestCase.run(TestCase.java:120)
	at junit.framework.TestSuite.runTest(TestSuite.java:230)
	at junit.framework.TestSuite.run(TestSuite.java:225)
	at junit.framework.TestSuite.runTest(TestSuite.java:230)
	at junit.framework.TestSuite.run(TestSuite.java:225)
	at junit.framework.TestSuite.runTest(TestSuite.java:230)
	at junit.framework.TestSuite.run(TestSuite.java:225)
	at sun.reflect.NativeMethodAccessorImpl.invoke0(Native Method)
	at sun.reflect.NativeMethodAccessorImpl.invoke(NativeMethodAccessorImpl.java:57)
	at sun.reflect.DelegatingMethodAccessorImpl.invoke(DelegatingMethodAccessorImpl.java:43)
	at java.lang.reflect.Method.invoke(Method.java:606)
	at org.apache.maven.surefire.junit.JUnitTestSet.execute(JUnitTestSet.java:99)
	at org.apache.maven.surefire.junit.JUnit3Provider.executeTestSet(JUnit3Provider.java:130)
	at org.apache.maven.surefire.junit.JUnit3Provider.invoke(JUnit3Provider.java:107)
	at org.apache.maven.surefire.booter.ForkedBooter.invokeProviderInSameClassLoader(ForkedBooter.java:203)
	at org.apache.maven.surefire.booter.ForkedBooter.runSuitesInProcess(ForkedBooter.java:155)
	at org.apache.maven.surefire.booter.ForkedBooter.main(ForkedBooter.java:103)

testZoneNameNearTransition(org.joda.time.format.TestDateTimeFormatter)  Time elapsed: 0.001 sec  <<< ERROR!
java.lang.IllegalArgumentException: Field type must not be null
	at org.joda.time.format.DateTimeFormatterBuilder.appendShortText(DateTimeFormatterBuilder.java:108)
	at org.joda.time.format.DateTimeFormatterBuilder.appendDayOfWeekShortText(DateTimeFormatterBuilder.java:144)
	at org.joda.time.format.TestDateTimeFormatter.setUp(TestDateTimeFormatter.java:89)
	at junit.framework.TestCase.runBare(TestCase.java:128)
	at junit.framework.TestResult$1.protect(TestResult.java:106)
	at junit.framework.TestResult.runProtected(TestResult.java:124)
	at junit.framework.TestResult.run(TestResult.java:109)
	at junit.framework.TestCase.run(TestCase.java:120)
	at junit.framework.TestSuite.runTest(TestSuite.java:230)
	at junit.framework.TestSuite.run(TestSuite.java:225)
	at junit.framework.TestSuite.runTest(TestSuite.java:230)
	at junit.framework.TestSuite.run(TestSuite.java:225)
	at junit.framework.TestSuite.runTest(TestSuite.java:230)
	at junit.framework.TestSuite.run(TestSuite.java:225)
	at sun.reflect.NativeMethodAccessorImpl.invoke0(Native Method)
	at sun.reflect.NativeMethodAccessorImpl.invoke(NativeMethodAccessorImpl.java:57)
	at sun.reflect.DelegatingMethodAccessorImpl.invoke(DelegatingMethodAccessorImpl.java:43)
	at java.lang.reflect.Method.invoke(Method.java:606)
	at org.apache.maven.surefire.junit.JUnitTestSet.execute(JUnitTestSet.java:99)
	at org.apache.maven.surefire.junit.JUnit3Provider.executeTestSet(JUnit3Provider.java:130)
	at org.apache.maven.surefire.junit.JUnit3Provider.invoke(JUnit3Provider.java:107)
	at org.apache.maven.surefire.booter.ForkedBooter.invokeProviderInSameClassLoader(ForkedBooter.java:203)
	at org.apache.maven.surefire.booter.ForkedBooter.runSuitesInProcess(ForkedBooter.java:155)
	at org.apache.maven.surefire.booter.ForkedBooter.main(ForkedBooter.java:103)

testZoneShortNameNearTransition(org.joda.time.format.TestDateTimeFormatter)  Time elapsed: 0.001 sec  <<< ERROR!
java.lang.IllegalArgumentException: Field type must not be null
	at org.joda.time.format.DateTimeFormatterBuilder.appendShortText(DateTimeFormatterBuilder.java:108)
	at org.joda.time.format.DateTimeFormatterBuilder.appendDayOfWeekShortText(DateTimeFormatterBuilder.java:144)
	at org.joda.time.format.TestDateTimeFormatter.setUp(TestDateTimeFormatter.java:89)
	at junit.framework.TestCase.runBare(TestCase.java:128)
	at junit.framework.TestResult$1.protect(TestResult.java:106)
	at junit.framework.TestResult.runProtected(TestResult.java:124)
	at junit.framework.TestResult.run(TestResult.java:109)
	at junit.framework.TestCase.run(TestCase.java:120)
	at junit.framework.TestSuite.runTest(TestSuite.java:230)
	at junit.framework.TestSuite.run(TestSuite.java:225)
	at junit.framework.TestSuite.runTest(TestSuite.java:230)
	at junit.framework.TestSuite.run(TestSuite.java:225)
	at junit.framework.TestSuite.runTest(TestSuite.java:230)
	at junit.framework.TestSuite.run(TestSuite.java:225)
	at sun.reflect.NativeMethodAccessorImpl.invoke0(Native Method)
	at sun.reflect.NativeMethodAccessorImpl.invoke(NativeMethodAccessorImpl.java:57)
	at sun.reflect.DelegatingMethodAccessorImpl.invoke(DelegatingMethodAccessorImpl.java:43)
	at java.lang.reflect.Method.invoke(Method.java:606)
	at org.apache.maven.surefire.junit.JUnitTestSet.execute(JUnitTestSet.java:99)
	at org.apache.maven.surefire.junit.JUnit3Provider.executeTestSet(JUnit3Provider.java:130)
	at org.apache.maven.surefire.junit.JUnit3Provider.invoke(JUnit3Provider.java:107)
	at org.apache.maven.surefire.booter.ForkedBooter.invokeProviderInSameClassLoader(ForkedBooter.java:203)
	at org.apache.maven.surefire.booter.ForkedBooter.runSuitesInProcess(ForkedBooter.java:155)
	at org.apache.maven.surefire.booter.ForkedBooter.main(ForkedBooter.java:103)

testPrint_locale(org.joda.time.format.TestDateTimeFormatter)  Time elapsed: 0.001 sec  <<< ERROR!
java.lang.IllegalArgumentException: Field type must not be null
	at org.joda.time.format.DateTimeFormatterBuilder.appendShortText(DateTimeFormatterBuilder.java:108)
	at org.joda.time.format.DateTimeFormatterBuilder.appendDayOfWeekShortText(DateTimeFormatterBuilder.java:144)
	at org.joda.time.format.TestDateTimeFormatter.setUp(TestDateTimeFormatter.java:89)
	at junit.framework.TestCase.runBare(TestCase.java:128)
	at junit.framework.TestResult$1.protect(TestResult.java:106)
	at junit.framework.TestResult.runProtected(TestResult.java:124)
	at junit.framework.TestResult.run(TestResult.java:109)
	at junit.framework.TestCase.run(TestCase.java:120)
	at junit.framework.TestSuite.runTest(TestSuite.java:230)
	at junit.framework.TestSuite.run(TestSuite.java:225)
	at junit.framework.TestSuite.runTest(TestSuite.java:230)
	at junit.framework.TestSuite.run(TestSuite.java:225)
	at junit.framework.TestSuite.runTest(TestSuite.java:230)
	at junit.framework.TestSuite.run(TestSuite.java:225)
	at sun.reflect.NativeMethodAccessorImpl.invoke0(Native Method)
	at sun.reflect.NativeMethodAccessorImpl.invoke(NativeMethodAccessorImpl.java:57)
	at sun.reflect.DelegatingMethodAccessorImpl.invoke(DelegatingMethodAccessorImpl.java:43)
	at java.lang.reflect.Method.invoke(Method.java:606)
	at org.apache.maven.surefire.junit.JUnitTestSet.execute(JUnitTestSet.java:99)
	at org.apache.maven.surefire.junit.JUnit3Provider.executeTestSet(JUnit3Provider.java:130)
	at org.apache.maven.surefire.junit.JUnit3Provider.invoke(JUnit3Provider.java:107)
	at org.apache.maven.surefire.booter.ForkedBooter.invokeProviderInSameClassLoader(ForkedBooter.java:203)
	at org.apache.maven.surefire.booter.ForkedBooter.runSuitesInProcess(ForkedBooter.java:155)
	at org.apache.maven.surefire.booter.ForkedBooter.main(ForkedBooter.java:103)

testPrint_zone(org.joda.time.format.TestDateTimeFormatter)  Time elapsed: 0.001 sec  <<< ERROR!
java.lang.IllegalArgumentException: Field type must not be null
	at org.joda.time.format.DateTimeFormatterBuilder.appendShortText(DateTimeFormatterBuilder.java:108)
	at org.joda.time.format.DateTimeFormatterBuilder.appendDayOfWeekShortText(DateTimeFormatterBuilder.java:144)
	at org.joda.time.format.TestDateTimeFormatter.setUp(TestDateTimeFormatter.java:89)
	at junit.framework.TestCase.runBare(TestCase.java:128)
	at junit.framework.TestResult$1.protect(TestResult.java:106)
	at junit.framework.TestResult.runProtected(TestResult.java:124)
	at junit.framework.TestResult.run(TestResult.java:109)
	at junit.framework.TestCase.run(TestCase.java:120)
	at junit.framework.TestSuite.runTest(TestSuite.java:230)
	at junit.framework.TestSuite.run(TestSuite.java:225)
	at junit.framework.TestSuite.runTest(TestSuite.java:230)
	at junit.framework.TestSuite.run(TestSuite.java:225)
	at junit.framework.TestSuite.runTest(TestSuite.java:230)
	at junit.framework.TestSuite.run(TestSuite.java:225)
	at sun.reflect.NativeMethodAccessorImpl.invoke0(Native Method)
	at sun.reflect.NativeMethodAccessorImpl.invoke(NativeMethodAccessorImpl.java:57)
	at sun.reflect.DelegatingMethodAccessorImpl.invoke(DelegatingMethodAccessorImpl.java:43)
	at java.lang.reflect.Method.invoke(Method.java:606)
	at org.apache.maven.surefire.junit.JUnitTestSet.execute(JUnitTestSet.java:99)
	at org.apache.maven.surefire.junit.JUnit3Provider.executeTestSet(JUnit3Provider.java:130)
	at org.apache.maven.surefire.junit.JUnit3Provider.invoke(JUnit3Provider.java:107)
	at org.apache.maven.surefire.booter.ForkedBooter.invokeProviderInSameClassLoader(ForkedBooter.java:203)
	at org.apache.maven.surefire.booter.ForkedBooter.runSuitesInProcess(ForkedBooter.java:155)
	at org.apache.maven.surefire.booter.ForkedBooter.main(ForkedBooter.java:103)

testPrint_chrono(org.joda.time.format.TestDateTimeFormatter)  Time elapsed: 0.001 sec  <<< ERROR!
java.lang.IllegalArgumentException: Field type must not be null
	at org.joda.time.format.DateTimeFormatterBuilder.appendShortText(DateTimeFormatterBuilder.java:108)
	at org.joda.time.format.DateTimeFormatterBuilder.appendDayOfWeekShortText(DateTimeFormatterBuilder.java:144)
	at org.joda.time.format.TestDateTimeFormatter.setUp(TestDateTimeFormatter.java:89)
	at junit.framework.TestCase.runBare(TestCase.java:128)
	at junit.framework.TestResult$1.protect(TestResult.java:106)
	at junit.framework.TestResult.runProtected(TestResult.java:124)
	at junit.framework.TestResult.run(TestResult.java:109)
	at junit.framework.TestCase.run(TestCase.java:120)
	at junit.framework.TestSuite.runTest(TestSuite.java:230)
	at junit.framework.TestSuite.run(TestSuite.java:225)
	at junit.framework.TestSuite.runTest(TestSuite.java:230)
	at junit.framework.TestSuite.run(TestSuite.java:225)
	at junit.framework.TestSuite.runTest(TestSuite.java:230)
	at junit.framework.TestSuite.run(TestSuite.java:225)
	at sun.reflect.NativeMethodAccessorImpl.invoke0(Native Method)
	at sun.reflect.NativeMethodAccessorImpl.invoke(NativeMethodAccessorImpl.java:57)
	at sun.reflect.DelegatingMethodAccessorImpl.invoke(DelegatingMethodAccessorImpl.java:43)
	at java.lang.reflect.Method.invoke(Method.java:606)
	at org.apache.maven.surefire.junit.JUnitTestSet.execute(JUnitTestSet.java:99)
	at org.apache.maven.surefire.junit.JUnit3Provider.executeTestSet(JUnit3Provider.java:130)
	at org.apache.maven.surefire.junit.JUnit3Provider.invoke(JUnit3Provider.java:107)
	at org.apache.maven.surefire.booter.ForkedBooter.invokeProviderInSameClassLoader(ForkedBooter.java:203)
	at org.apache.maven.surefire.booter.ForkedBooter.runSuitesInProcess(ForkedBooter.java:155)
	at org.apache.maven.surefire.booter.ForkedBooter.main(ForkedBooter.java:103)

testPrint_bufferMethods(org.joda.time.format.TestDateTimeFormatter)  Time elapsed: 0.001 sec  <<< ERROR!
java.lang.IllegalArgumentException: Field type must not be null
	at org.joda.time.format.DateTimeFormatterBuilder.appendShortText(DateTimeFormatterBuilder.java:108)
	at org.joda.time.format.DateTimeFormatterBuilder.appendDayOfWeekShortText(DateTimeFormatterBuilder.java:144)
	at org.joda.time.format.TestDateTimeFormatter.setUp(TestDateTimeFormatter.java:89)
	at junit.framework.TestCase.runBare(TestCase.java:128)
	at junit.framework.TestResult$1.protect(TestResult.java:106)
	at junit.framework.TestResult.runProtected(TestResult.java:124)
	at junit.framework.TestResult.run(TestResult.java:109)
	at junit.framework.TestCase.run(TestCase.java:120)
	at junit.framework.TestSuite.runTest(TestSuite.java:230)
	at junit.framework.TestSuite.run(TestSuite.java:225)
	at junit.framework.TestSuite.runTest(TestSuite.java:230)
	at junit.framework.TestSuite.run(TestSuite.java:225)
	at junit.framework.TestSuite.runTest(TestSuite.java:230)
	at junit.framework.TestSuite.run(TestSuite.java:225)
	at sun.reflect.NativeMethodAccessorImpl.invoke0(Native Method)
	at sun.reflect.NativeMethodAccessorImpl.invoke(NativeMethodAccessorImpl.java:57)
	at sun.reflect.DelegatingMethodAccessorImpl.invoke(DelegatingMethodAccessorImpl.java:43)
	at java.lang.reflect.Method.invoke(Method.java:606)
	at org.apache.maven.surefire.junit.JUnitTestSet.execute(JUnitTestSet.java:99)
	at org.apache.maven.surefire.junit.JUnit3Provider.executeTestSet(JUnit3Provider.java:130)
	at org.apache.maven.surefire.junit.JUnit3Provider.invoke(JUnit3Provider.java:107)
	at org.apache.maven.surefire.booter.ForkedBooter.invokeProviderInSameClassLoader(ForkedBooter.java:203)
	at org.apache.maven.surefire.booter.ForkedBooter.runSuitesInProcess(ForkedBooter.java:155)
	at org.apache.maven.surefire.booter.ForkedBooter.main(ForkedBooter.java:103)

testPrint_writerMethods(org.joda.time.format.TestDateTimeFormatter)  Time elapsed: 0.001 sec  <<< ERROR!
java.lang.IllegalArgumentException: Field type must not be null
	at org.joda.time.format.DateTimeFormatterBuilder.appendShortText(DateTimeFormatterBuilder.java:108)
	at org.joda.time.format.DateTimeFormatterBuilder.appendDayOfWeekShortText(DateTimeFormatterBuilder.java:144)
	at org.joda.time.format.TestDateTimeFormatter.setUp(TestDateTimeFormatter.java:89)
	at junit.framework.TestCase.runBare(TestCase.java:128)
	at junit.framework.TestResult$1.protect(TestResult.java:106)
	at junit.framework.TestResult.runProtected(TestResult.java:124)
	at junit.framework.TestResult.run(TestResult.java:109)
	at junit.framework.TestCase.run(TestCase.java:120)
	at junit.framework.TestSuite.runTest(TestSuite.java:230)
	at junit.framework.TestSuite.run(TestSuite.java:225)
	at junit.framework.TestSuite.runTest(TestSuite.java:230)
	at junit.framework.TestSuite.run(TestSuite.java:225)
	at junit.framework.TestSuite.runTest(TestSuite.java:230)
	at junit.framework.TestSuite.run(TestSuite.java:225)
	at sun.reflect.NativeMethodAccessorImpl.invoke0(Native Method)
	at sun.reflect.NativeMethodAccessorImpl.invoke(NativeMethodAccessorImpl.java:57)
	at sun.reflect.DelegatingMethodAccessorImpl.invoke(DelegatingMethodAccessorImpl.java:43)
	at java.lang.reflect.Method.invoke(Method.java:606)
	at org.apache.maven.surefire.junit.JUnitTestSet.execute(JUnitTestSet.java:99)
	at org.apache.maven.surefire.junit.JUnit3Provider.executeTestSet(JUnit3Provider.java:130)
	at org.apache.maven.surefire.junit.JUnit3Provider.invoke(JUnit3Provider.java:107)
	at org.apache.maven.surefire.booter.ForkedBooter.invokeProviderInSameClassLoader(ForkedBooter.java:203)
	at org.apache.maven.surefire.booter.ForkedBooter.runSuitesInProcess(ForkedBooter.java:155)
	at org.apache.maven.surefire.booter.ForkedBooter.main(ForkedBooter.java:103)

testPrint_simple(org.joda.time.format.TestDateTimeFormatter)  Time elapsed: 0.001 sec  <<< ERROR!
java.lang.IllegalArgumentException: Field type must not be null
	at org.joda.time.format.DateTimeFormatterBuilder.appendShortText(DateTimeFormatterBuilder.java:108)
	at org.joda.time.format.DateTimeFormatterBuilder.appendDayOfWeekShortText(DateTimeFormatterBuilder.java:144)
	at org.joda.time.format.TestDateTimeFormatter.setUp(TestDateTimeFormatter.java:89)
	at junit.framework.TestCase.runBare(TestCase.java:128)
	at junit.framework.TestResult$1.protect(TestResult.java:106)
	at junit.framework.TestResult.runProtected(TestResult.java:124)
	at junit.framework.TestResult.run(TestResult.java:109)
	at junit.framework.TestCase.run(TestCase.java:120)
	at junit.framework.TestSuite.runTest(TestSuite.java:230)
	at junit.framework.TestSuite.run(TestSuite.java:225)
	at junit.framework.TestSuite.runTest(TestSuite.java:230)
	at junit.framework.TestSuite.run(TestSuite.java:225)
	at junit.framework.TestSuite.runTest(TestSuite.java:230)
	at junit.framework.TestSuite.run(TestSuite.java:225)
	at sun.reflect.NativeMethodAccessorImpl.invoke0(Native Method)
	at sun.reflect.NativeMethodAccessorImpl.invoke(NativeMethodAccessorImpl.java:57)
	at sun.reflect.DelegatingMethodAccessorImpl.invoke(DelegatingMethodAccessorImpl.java:43)
	at java.lang.reflect.Method.invoke(Method.java:606)
	at org.apache.maven.surefire.junit.JUnitTestSet.execute(JUnitTestSet.java:99)
	at org.apache.maven.surefire.junit.JUnit3Provider.executeTestSet(JUnit3Provider.java:130)
	at org.apache.maven.surefire.junit.JUnit3Provider.invoke(JUnit3Provider.java:107)
	at org.apache.maven.surefire.booter.ForkedBooter.invokeProviderInSameClassLoader(ForkedBooter.java:203)
	at org.apache.maven.surefire.booter.ForkedBooter.runSuitesInProcess(ForkedBooter.java:155)
	at org.apache.maven.surefire.booter.ForkedBooter.main(ForkedBooter.java:103)

testPrint_appendableMethods(org.joda.time.format.TestDateTimeFormatter)  Time elapsed: 0.001 sec  <<< ERROR!
java.lang.IllegalArgumentException: Field type must not be null
	at org.joda.time.format.DateTimeFormatterBuilder.appendShortText(DateTimeFormatterBuilder.java:108)
	at org.joda.time.format.DateTimeFormatterBuilder.appendDayOfWeekShortText(DateTimeFormatterBuilder.java:144)
	at org.joda.time.format.TestDateTimeFormatter.setUp(TestDateTimeFormatter.java:89)
	at junit.framework.TestCase.runBare(TestCase.java:128)
	at junit.framework.TestResult$1.protect(TestResult.java:106)
	at junit.framework.TestResult.runProtected(TestResult.java:124)
	at junit.framework.TestResult.run(TestResult.java:109)
	at junit.framework.TestCase.run(TestCase.java:120)
	at junit.framework.TestSuite.runTest(TestSuite.java:230)
	at junit.framework.TestSuite.run(TestSuite.java:225)
	at junit.framework.TestSuite.runTest(TestSuite.java:230)
	at junit.framework.TestSuite.run(TestSuite.java:225)
	at junit.framework.TestSuite.runTest(TestSuite.java:230)
	at junit.framework.TestSuite.run(TestSuite.java:225)
	at sun.reflect.NativeMethodAccessorImpl.invoke0(Native Method)
	at sun.reflect.NativeMethodAccessorImpl.invoke(NativeMethodAccessorImpl.java:57)
	at sun.reflect.DelegatingMethodAccessorImpl.invoke(DelegatingMethodAccessorImpl.java:43)
	at java.lang.reflect.Method.invoke(Method.java:606)
	at org.apache.maven.surefire.junit.JUnitTestSet.execute(JUnitTestSet.java:99)
	at org.apache.maven.surefire.junit.JUnit3Provider.executeTestSet(JUnit3Provider.java:130)
	at org.apache.maven.surefire.junit.JUnit3Provider.invoke(JUnit3Provider.java:107)
	at org.apache.maven.surefire.booter.ForkedBooter.invokeProviderInSameClassLoader(ForkedBooter.java:203)
	at org.apache.maven.surefire.booter.ForkedBooter.runSuitesInProcess(ForkedBooter.java:155)
	at org.apache.maven.surefire.booter.ForkedBooter.main(ForkedBooter.java:103)

testPrint_chrono_and_zone(org.joda.time.format.TestDateTimeFormatter)  Time elapsed: 0.001 sec  <<< ERROR!
java.lang.IllegalArgumentException: Field type must not be null
	at org.joda.time.format.DateTimeFormatterBuilder.appendShortText(DateTimeFormatterBuilder.java:108)
	at org.joda.time.format.DateTimeFormatterBuilder.appendDayOfWeekShortText(DateTimeFormatterBuilder.java:144)
	at org.joda.time.format.TestDateTimeFormatter.setUp(TestDateTimeFormatter.java:89)
	at junit.framework.TestCase.runBare(TestCase.java:128)
	at junit.framework.TestResult$1.protect(TestResult.java:106)
	at junit.framework.TestResult.runProtected(TestResult.java:124)
	at junit.framework.TestResult.run(TestResult.java:109)
	at junit.framework.TestCase.run(TestCase.java:120)
	at junit.framework.TestSuite.runTest(TestSuite.java:230)
	at junit.framework.TestSuite.run(TestSuite.java:225)
	at junit.framework.TestSuite.runTest(TestSuite.java:230)
	at junit.framework.TestSuite.run(TestSuite.java:225)
	at junit.framework.TestSuite.runTest(TestSuite.java:230)
	at junit.framework.TestSuite.run(TestSuite.java:225)
	at sun.reflect.NativeMethodAccessorImpl.invoke0(Native Method)
	at sun.reflect.NativeMethodAccessorImpl.invoke(NativeMethodAccessorImpl.java:57)
	at sun.reflect.DelegatingMethodAccessorImpl.invoke(DelegatingMethodAccessorImpl.java:43)
	at java.lang.reflect.Method.invoke(Method.java:606)
	at org.apache.maven.surefire.junit.JUnitTestSet.execute(JUnitTestSet.java:99)
	at org.apache.maven.surefire.junit.JUnit3Provider.executeTestSet(JUnit3Provider.java:130)
	at org.apache.maven.surefire.junit.JUnit3Provider.invoke(JUnit3Provider.java:107)
	at org.apache.maven.surefire.booter.ForkedBooter.invokeProviderInSameClassLoader(ForkedBooter.java:203)
	at org.apache.maven.surefire.booter.ForkedBooter.runSuitesInProcess(ForkedBooter.java:155)
	at org.apache.maven.surefire.booter.ForkedBooter.main(ForkedBooter.java:103)

testWithGetLocale(org.joda.time.format.TestDateTimeFormatter)  Time elapsed: 0.001 sec  <<< ERROR!
java.lang.IllegalArgumentException: Field type must not be null
	at org.joda.time.format.DateTimeFormatterBuilder.appendShortText(DateTimeFormatterBuilder.java:108)
	at org.joda.time.format.DateTimeFormatterBuilder.appendDayOfWeekShortText(DateTimeFormatterBuilder.java:144)
	at org.joda.time.format.TestDateTimeFormatter.setUp(TestDateTimeFormatter.java:89)
	at junit.framework.TestCase.runBare(TestCase.java:128)
	at junit.framework.TestResult$1.protect(TestResult.java:106)
	at junit.framework.TestResult.runProtected(TestResult.java:124)
	at junit.framework.TestResult.run(TestResult.java:109)
	at junit.framework.TestCase.run(TestCase.java:120)
	at junit.framework.TestSuite.runTest(TestSuite.java:230)
	at junit.framework.TestSuite.run(TestSuite.java:225)
	at junit.framework.TestSuite.runTest(TestSuite.java:230)
	at junit.framework.TestSuite.run(TestSuite.java:225)
	at junit.framework.TestSuite.runTest(TestSuite.java:230)
	at junit.framework.TestSuite.run(TestSuite.java:225)
	at sun.reflect.NativeMethodAccessorImpl.invoke0(Native Method)
	at sun.reflect.NativeMethodAccessorImpl.invoke(NativeMethodAccessorImpl.java:57)
	at sun.reflect.DelegatingMethodAccessorImpl.invoke(DelegatingMethodAccessorImpl.java:43)
	at java.lang.reflect.Method.invoke(Method.java:606)
	at org.apache.maven.surefire.junit.JUnitTestSet.execute(JUnitTestSet.java:99)
	at org.apache.maven.surefire.junit.JUnit3Provider.executeTestSet(JUnit3Provider.java:130)
	at org.apache.maven.surefire.junit.JUnit3Provider.invoke(JUnit3Provider.java:107)
	at org.apache.maven.surefire.booter.ForkedBooter.invokeProviderInSameClassLoader(ForkedBooter.java:203)
	at org.apache.maven.surefire.booter.ForkedBooter.runSuitesInProcess(ForkedBooter.java:155)
	at org.apache.maven.surefire.booter.ForkedBooter.main(ForkedBooter.java:103)

testWithGetZone(org.joda.time.format.TestDateTimeFormatter)  Time elapsed: 0.001 sec  <<< ERROR!
java.lang.IllegalArgumentException: Field type must not be null
	at org.joda.time.format.DateTimeFormatterBuilder.appendShortText(DateTimeFormatterBuilder.java:108)
	at org.joda.time.format.DateTimeFormatterBuilder.appendDayOfWeekShortText(DateTimeFormatterBuilder.java:144)
	at org.joda.time.format.TestDateTimeFormatter.setUp(TestDateTimeFormatter.java:89)
	at junit.framework.TestCase.runBare(TestCase.java:128)
	at junit.framework.TestResult$1.protect(TestResult.java:106)
	at junit.framework.TestResult.runProtected(TestResult.java:124)
	at junit.framework.TestResult.run(TestResult.java:109)
	at junit.framework.TestCase.run(TestCase.java:120)
	at junit.framework.TestSuite.runTest(TestSuite.java:230)
	at junit.framework.TestSuite.run(TestSuite.java:225)
	at junit.framework.TestSuite.runTest(TestSuite.java:230)
	at junit.framework.TestSuite.run(TestSuite.java:225)
	at junit.framework.TestSuite.runTest(TestSuite.java:230)
	at junit.framework.TestSuite.run(TestSuite.java:225)
	at sun.reflect.NativeMethodAccessorImpl.invoke0(Native Method)
	at sun.reflect.NativeMethodAccessorImpl.invoke(NativeMethodAccessorImpl.java:57)
	at sun.reflect.DelegatingMethodAccessorImpl.invoke(DelegatingMethodAccessorImpl.java:43)
	at java.lang.reflect.Method.invoke(Method.java:606)
	at org.apache.maven.surefire.junit.JUnitTestSet.execute(JUnitTestSet.java:99)
	at org.apache.maven.surefire.junit.JUnit3Provider.executeTestSet(JUnit3Provider.java:130)
	at org.apache.maven.surefire.junit.JUnit3Provider.invoke(JUnit3Provider.java:107)
	at org.apache.maven.surefire.booter.ForkedBooter.invokeProviderInSameClassLoader(ForkedBooter.java:203)
	at org.apache.maven.surefire.booter.ForkedBooter.runSuitesInProcess(ForkedBooter.java:155)
	at org.apache.maven.surefire.booter.ForkedBooter.main(ForkedBooter.java:103)

testWithGetChronology(org.joda.time.format.TestDateTimeFormatter)  Time elapsed: 0.001 sec  <<< ERROR!
java.lang.IllegalArgumentException: Field type must not be null
	at org.joda.time.format.DateTimeFormatterBuilder.appendShortText(DateTimeFormatterBuilder.java:108)
	at org.joda.time.format.DateTimeFormatterBuilder.appendDayOfWeekShortText(DateTimeFormatterBuilder.java:144)
	at org.joda.time.format.TestDateTimeFormatter.setUp(TestDateTimeFormatter.java:89)
	at junit.framework.TestCase.runBare(TestCase.java:128)
	at junit.framework.TestResult$1.protect(TestResult.java:106)
	at junit.framework.TestResult.runProtected(TestResult.java:124)
	at junit.framework.TestResult.run(TestResult.java:109)
	at junit.framework.TestCase.run(TestCase.java:120)
	at junit.framework.TestSuite.runTest(TestSuite.java:230)
	at junit.framework.TestSuite.run(TestSuite.java:225)
	at junit.framework.TestSuite.runTest(TestSuite.java:230)
	at junit.framework.TestSuite.run(TestSuite.java:225)
	at junit.framework.TestSuite.runTest(TestSuite.java:230)
	at junit.framework.TestSuite.run(TestSuite.java:225)
	at sun.reflect.NativeMethodAccessorImpl.invoke0(Native Method)
	at sun.reflect.NativeMethodAccessorImpl.invoke(NativeMethodAccessorImpl.java:57)
	at sun.reflect.DelegatingMethodAccessorImpl.invoke(DelegatingMethodAccessorImpl.java:43)
	at java.lang.reflect.Method.invoke(Method.java:606)
	at org.apache.maven.surefire.junit.JUnitTestSet.execute(JUnitTestSet.java:99)
	at org.apache.maven.surefire.junit.JUnit3Provider.executeTestSet(JUnit3Provider.java:130)
	at org.apache.maven.surefire.junit.JUnit3Provider.invoke(JUnit3Provider.java:107)
	at org.apache.maven.surefire.booter.ForkedBooter.invokeProviderInSameClassLoader(ForkedBooter.java:203)
	at org.apache.maven.surefire.booter.ForkedBooter.runSuitesInProcess(ForkedBooter.java:155)
	at org.apache.maven.surefire.booter.ForkedBooter.main(ForkedBooter.java:103)

testWithGetPivotYear(org.joda.time.format.TestDateTimeFormatter)  Time elapsed: 0.001 sec  <<< ERROR!
java.lang.IllegalArgumentException: Field type must not be null
	at org.joda.time.format.DateTimeFormatterBuilder.appendShortText(DateTimeFormatterBuilder.java:108)
	at org.joda.time.format.DateTimeFormatterBuilder.appendDayOfWeekShortText(DateTimeFormatterBuilder.java:144)
	at org.joda.time.format.TestDateTimeFormatter.setUp(TestDateTimeFormatter.java:89)
	at junit.framework.TestCase.runBare(TestCase.java:128)
	at junit.framework.TestResult$1.protect(TestResult.java:106)
	at junit.framework.TestResult.runProtected(TestResult.java:124)
	at junit.framework.TestResult.run(TestResult.java:109)
	at junit.framework.TestCase.run(TestCase.java:120)
	at junit.framework.TestSuite.runTest(TestSuite.java:230)
	at junit.framework.TestSuite.run(TestSuite.java:225)
	at junit.framework.TestSuite.runTest(TestSuite.java:230)
	at junit.framework.TestSuite.run(TestSuite.java:225)
	at junit.framework.TestSuite.runTest(TestSuite.java:230)
	at junit.framework.TestSuite.run(TestSuite.java:225)
	at sun.reflect.NativeMethodAccessorImpl.invoke0(Native Method)
	at sun.reflect.NativeMethodAccessorImpl.invoke(NativeMethodAccessorImpl.java:57)
	at sun.reflect.DelegatingMethodAccessorImpl.invoke(DelegatingMethodAccessorImpl.java:43)
	at java.lang.reflect.Method.invoke(Method.java:606)
	at org.apache.maven.surefire.junit.JUnitTestSet.execute(JUnitTestSet.java:99)
	at org.apache.maven.surefire.junit.JUnit3Provider.executeTestSet(JUnit3Provider.java:130)
	at org.apache.maven.surefire.junit.JUnit3Provider.invoke(JUnit3Provider.java:107)
	at org.apache.maven.surefire.booter.ForkedBooter.invokeProviderInSameClassLoader(ForkedBooter.java:203)
	at org.apache.maven.surefire.booter.ForkedBooter.runSuitesInProcess(ForkedBooter.java:155)
	at org.apache.maven.surefire.booter.ForkedBooter.main(ForkedBooter.java:103)

testWithGetOffsetParsedMethods(org.joda.time.format.TestDateTimeFormatter)  Time elapsed: 0.001 sec  <<< ERROR!
java.lang.IllegalArgumentException: Field type must not be null
	at org.joda.time.format.DateTimeFormatterBuilder.appendShortText(DateTimeFormatterBuilder.java:108)
	at org.joda.time.format.DateTimeFormatterBuilder.appendDayOfWeekShortText(DateTimeFormatterBuilder.java:144)
	at org.joda.time.format.TestDateTimeFormatter.setUp(TestDateTimeFormatter.java:89)
	at junit.framework.TestCase.runBare(TestCase.java:128)
	at junit.framework.TestResult$1.protect(TestResult.java:106)
	at junit.framework.TestResult.runProtected(TestResult.java:124)
	at junit.framework.TestResult.run(TestResult.java:109)
	at junit.framework.TestCase.run(TestCase.java:120)
	at junit.framework.TestSuite.runTest(TestSuite.java:230)
	at junit.framework.TestSuite.run(TestSuite.java:225)
	at junit.framework.TestSuite.runTest(TestSuite.java:230)
	at junit.framework.TestSuite.run(TestSuite.java:225)
	at junit.framework.TestSuite.runTest(TestSuite.java:230)
	at junit.framework.TestSuite.run(TestSuite.java:225)
	at sun.reflect.NativeMethodAccessorImpl.invoke0(Native Method)
	at sun.reflect.NativeMethodAccessorImpl.invoke(NativeMethodAccessorImpl.java:57)
	at sun.reflect.DelegatingMethodAccessorImpl.invoke(DelegatingMethodAccessorImpl.java:43)
	at java.lang.reflect.Method.invoke(Method.java:606)
	at org.apache.maven.surefire.junit.JUnitTestSet.execute(JUnitTestSet.java:99)
	at org.apache.maven.surefire.junit.JUnit3Provider.executeTestSet(JUnit3Provider.java:130)
	at org.apache.maven.surefire.junit.JUnit3Provider.invoke(JUnit3Provider.java:107)
	at org.apache.maven.surefire.booter.ForkedBooter.invokeProviderInSameClassLoader(ForkedBooter.java:203)
	at org.apache.maven.surefire.booter.ForkedBooter.runSuitesInProcess(ForkedBooter.java:155)
	at org.apache.maven.surefire.booter.ForkedBooter.main(ForkedBooter.java:103)

testPrinterParserMethods(org.joda.time.format.TestDateTimeFormatter)  Time elapsed: 0.001 sec  <<< ERROR!
java.lang.IllegalArgumentException: Field type must not be null
	at org.joda.time.format.DateTimeFormatterBuilder.appendShortText(DateTimeFormatterBuilder.java:108)
	at org.joda.time.format.DateTimeFormatterBuilder.appendDayOfWeekShortText(DateTimeFormatterBuilder.java:144)
	at org.joda.time.format.TestDateTimeFormatter.setUp(TestDateTimeFormatter.java:89)
	at junit.framework.TestCase.runBare(TestCase.java:128)
	at junit.framework.TestResult$1.protect(TestResult.java:106)
	at junit.framework.TestResult.runProtected(TestResult.java:124)
	at junit.framework.TestResult.run(TestResult.java:109)
	at junit.framework.TestCase.run(TestCase.java:120)
	at junit.framework.TestSuite.runTest(TestSuite.java:230)
	at junit.framework.TestSuite.run(TestSuite.java:225)
	at junit.framework.TestSuite.runTest(TestSuite.java:230)
	at junit.framework.TestSuite.run(TestSuite.java:225)
	at junit.framework.TestSuite.runTest(TestSuite.java:230)
	at junit.framework.TestSuite.run(TestSuite.java:225)
	at sun.reflect.NativeMethodAccessorImpl.invoke0(Native Method)
	at sun.reflect.NativeMethodAccessorImpl.invoke(NativeMethodAccessorImpl.java:57)
	at sun.reflect.DelegatingMethodAccessorImpl.invoke(DelegatingMethodAccessorImpl.java:43)
	at java.lang.reflect.Method.invoke(Method.java:606)
	at org.apache.maven.surefire.junit.JUnitTestSet.execute(JUnitTestSet.java:99)
	at org.apache.maven.surefire.junit.JUnit3Provider.executeTestSet(JUnit3Provider.java:130)
	at org.apache.maven.surefire.junit.JUnit3Provider.invoke(JUnit3Provider.java:107)
	at org.apache.maven.surefire.booter.ForkedBooter.invokeProviderInSameClassLoader(ForkedBooter.java:203)
	at org.apache.maven.surefire.booter.ForkedBooter.runSuitesInProcess(ForkedBooter.java:155)
	at org.apache.maven.surefire.booter.ForkedBooter.main(ForkedBooter.java:103)

testParseLocalDate_simple(org.joda.time.format.TestDateTimeFormatter)  Time elapsed: 0.001 sec  <<< ERROR!
java.lang.IllegalArgumentException: Field type must not be null
	at org.joda.time.format.DateTimeFormatterBuilder.appendShortText(DateTimeFormatterBuilder.java:108)
	at org.joda.time.format.DateTimeFormatterBuilder.appendDayOfWeekShortText(DateTimeFormatterBuilder.java:144)
	at org.joda.time.format.TestDateTimeFormatter.setUp(TestDateTimeFormatter.java:89)
	at junit.framework.TestCase.runBare(TestCase.java:128)
	at junit.framework.TestResult$1.protect(TestResult.java:106)
	at junit.framework.TestResult.runProtected(TestResult.java:124)
	at junit.framework.TestResult.run(TestResult.java:109)
	at junit.framework.TestCase.run(TestCase.java:120)
	at junit.framework.TestSuite.runTest(TestSuite.java:230)
	at junit.framework.TestSuite.run(TestSuite.java:225)
	at junit.framework.TestSuite.runTest(TestSuite.java:230)
	at junit.framework.TestSuite.run(TestSuite.java:225)
	at junit.framework.TestSuite.runTest(TestSuite.java:230)
	at junit.framework.TestSuite.run(TestSuite.java:225)
	at sun.reflect.NativeMethodAccessorImpl.invoke0(Native Method)
	at sun.reflect.NativeMethodAccessorImpl.invoke(NativeMethodAccessorImpl.java:57)
	at sun.reflect.DelegatingMethodAccessorImpl.invoke(DelegatingMethodAccessorImpl.java:43)
	at java.lang.reflect.Method.invoke(Method.java:606)
	at org.apache.maven.surefire.junit.JUnitTestSet.execute(JUnitTestSet.java:99)
	at org.apache.maven.surefire.junit.JUnit3Provider.executeTestSet(JUnit3Provider.java:130)
	at org.apache.maven.surefire.junit.JUnit3Provider.invoke(JUnit3Provider.java:107)
	at org.apache.maven.surefire.booter.ForkedBooter.invokeProviderInSameClassLoader(ForkedBooter.java:203)
	at org.apache.maven.surefire.booter.ForkedBooter.runSuitesInProcess(ForkedBooter.java:155)
	at org.apache.maven.surefire.booter.ForkedBooter.main(ForkedBooter.java:103)

testParseLocalDate_yearOfEra(org.joda.time.format.TestDateTimeFormatter)  Time elapsed: 0.001 sec  <<< ERROR!
java.lang.IllegalArgumentException: Field type must not be null
	at org.joda.time.format.DateTimeFormatterBuilder.appendShortText(DateTimeFormatterBuilder.java:108)
	at org.joda.time.format.DateTimeFormatterBuilder.appendDayOfWeekShortText(DateTimeFormatterBuilder.java:144)
	at org.joda.time.format.TestDateTimeFormatter.setUp(TestDateTimeFormatter.java:89)
	at junit.framework.TestCase.runBare(TestCase.java:128)
	at junit.framework.TestResult$1.protect(TestResult.java:106)
	at junit.framework.TestResult.runProtected(TestResult.java:124)
	at junit.framework.TestResult.run(TestResult.java:109)
	at junit.framework.TestCase.run(TestCase.java:120)
	at junit.framework.TestSuite.runTest(TestSuite.java:230)
	at junit.framework.TestSuite.run(TestSuite.java:225)
	at junit.framework.TestSuite.runTest(TestSuite.java:230)
	at junit.framework.TestSuite.run(TestSuite.java:225)
	at junit.framework.TestSuite.runTest(TestSuite.java:230)
	at junit.framework.TestSuite.run(TestSuite.java:225)
	at sun.reflect.NativeMethodAccessorImpl.invoke0(Native Method)
	at sun.reflect.NativeMethodAccessorImpl.invoke(NativeMethodAccessorImpl.java:57)
	at sun.reflect.DelegatingMethodAccessorImpl.invoke(DelegatingMethodAccessorImpl.java:43)
	at java.lang.reflect.Method.invoke(Method.java:606)
	at org.apache.maven.surefire.junit.JUnitTestSet.execute(JUnitTestSet.java:99)
	at org.apache.maven.surefire.junit.JUnit3Provider.executeTestSet(JUnit3Provider.java:130)
	at org.apache.maven.surefire.junit.JUnit3Provider.invoke(JUnit3Provider.java:107)
	at org.apache.maven.surefire.booter.ForkedBooter.invokeProviderInSameClassLoader(ForkedBooter.java:203)
	at org.apache.maven.surefire.booter.ForkedBooter.runSuitesInProcess(ForkedBooter.java:155)
	at org.apache.maven.surefire.booter.ForkedBooter.main(ForkedBooter.java:103)

testParseLocalDate_yearOfCentury(org.joda.time.format.TestDateTimeFormatter)  Time elapsed: 0.001 sec  <<< ERROR!
java.lang.IllegalArgumentException: Field type must not be null
	at org.joda.time.format.DateTimeFormatterBuilder.appendShortText(DateTimeFormatterBuilder.java:108)
	at org.joda.time.format.DateTimeFormatterBuilder.appendDayOfWeekShortText(DateTimeFormatterBuilder.java:144)
	at org.joda.time.format.TestDateTimeFormatter.setUp(TestDateTimeFormatter.java:89)
	at junit.framework.TestCase.runBare(TestCase.java:128)
	at junit.framework.TestResult$1.protect(TestResult.java:106)
	at junit.framework.TestResult.runProtected(TestResult.java:124)
	at junit.framework.TestResult.run(TestResult.java:109)
	at junit.framework.TestCase.run(TestCase.java:120)
	at junit.framework.TestSuite.runTest(TestSuite.java:230)
	at junit.framework.TestSuite.run(TestSuite.java:225)
	at junit.framework.TestSuite.runTest(TestSuite.java:230)
	at junit.framework.TestSuite.run(TestSuite.java:225)
	at junit.framework.TestSuite.runTest(TestSuite.java:230)
	at junit.framework.TestSuite.run(TestSuite.java:225)
	at sun.reflect.NativeMethodAccessorImpl.invoke0(Native Method)
	at sun.reflect.NativeMethodAccessorImpl.invoke(NativeMethodAccessorImpl.java:57)
	at sun.reflect.DelegatingMethodAccessorImpl.invoke(DelegatingMethodAccessorImpl.java:43)
	at java.lang.reflect.Method.invoke(Method.java:606)
	at org.apache.maven.surefire.junit.JUnitTestSet.execute(JUnitTestSet.java:99)
	at org.apache.maven.surefire.junit.JUnit3Provider.executeTestSet(JUnit3Provider.java:130)
	at org.apache.maven.surefire.junit.JUnit3Provider.invoke(JUnit3Provider.java:107)
	at org.apache.maven.surefire.booter.ForkedBooter.invokeProviderInSameClassLoader(ForkedBooter.java:203)
	at org.apache.maven.surefire.booter.ForkedBooter.runSuitesInProcess(ForkedBooter.java:155)
	at org.apache.maven.surefire.booter.ForkedBooter.main(ForkedBooter.java:103)

testParseLocalDate_monthDay_feb29(org.joda.time.format.TestDateTimeFormatter)  Time elapsed: 0.001 sec  <<< ERROR!
java.lang.IllegalArgumentException: Field type must not be null
	at org.joda.time.format.DateTimeFormatterBuilder.appendShortText(DateTimeFormatterBuilder.java:108)
	at org.joda.time.format.DateTimeFormatterBuilder.appendDayOfWeekShortText(DateTimeFormatterBuilder.java:144)
	at org.joda.time.format.TestDateTimeFormatter.setUp(TestDateTimeFormatter.java:89)
	at junit.framework.TestCase.runBare(TestCase.java:128)
	at junit.framework.TestResult$1.protect(TestResult.java:106)
	at junit.framework.TestResult.runProtected(TestResult.java:124)
	at junit.framework.TestResult.run(TestResult.java:109)
	at junit.framework.TestCase.run(TestCase.java:120)
	at junit.framework.TestSuite.runTest(TestSuite.java:230)
	at junit.framework.TestSuite.run(TestSuite.java:225)
	at junit.framework.TestSuite.runTest(TestSuite.java:230)
	at junit.framework.TestSuite.run(TestSuite.java:225)
	at junit.framework.TestSuite.runTest(TestSuite.java:230)
	at junit.framework.TestSuite.run(TestSuite.java:225)
	at sun.reflect.NativeMethodAccessorImpl.invoke0(Native Method)
	at sun.reflect.NativeMethodAccessorImpl.invoke(NativeMethodAccessorImpl.java:57)
	at sun.reflect.DelegatingMethodAccessorImpl.invoke(DelegatingMethodAccessorImpl.java:43)
	at java.lang.reflect.Method.invoke(Method.java:606)
	at org.apache.maven.surefire.junit.JUnitTestSet.execute(JUnitTestSet.java:99)
	at org.apache.maven.surefire.junit.JUnit3Provider.executeTestSet(JUnit3Provider.java:130)
	at org.apache.maven.surefire.junit.JUnit3Provider.invoke(JUnit3Provider.java:107)
	at org.apache.maven.surefire.booter.ForkedBooter.invokeProviderInSameClassLoader(ForkedBooter.java:203)
	at org.apache.maven.surefire.booter.ForkedBooter.runSuitesInProcess(ForkedBooter.java:155)
	at org.apache.maven.surefire.booter.ForkedBooter.main(ForkedBooter.java:103)

testParseLocalDate_monthDay_withDefaultYear_feb29(org.joda.time.format.TestDateTimeFormatter)  Time elapsed: 0.001 sec  <<< ERROR!
java.lang.IllegalArgumentException: Field type must not be null
	at org.joda.time.format.DateTimeFormatterBuilder.appendShortText(DateTimeFormatterBuilder.java:108)
	at org.joda.time.format.DateTimeFormatterBuilder.appendDayOfWeekShortText(DateTimeFormatterBuilder.java:144)
	at org.joda.time.format.TestDateTimeFormatter.setUp(TestDateTimeFormatter.java:89)
	at junit.framework.TestCase.runBare(TestCase.java:128)
	at junit.framework.TestResult$1.protect(TestResult.java:106)
	at junit.framework.TestResult.runProtected(TestResult.java:124)
	at junit.framework.TestResult.run(TestResult.java:109)
	at junit.framework.TestCase.run(TestCase.java:120)
	at junit.framework.TestSuite.runTest(TestSuite.java:230)
	at junit.framework.TestSuite.run(TestSuite.java:225)
	at junit.framework.TestSuite.runTest(TestSuite.java:230)
	at junit.framework.TestSuite.run(TestSuite.java:225)
	at junit.framework.TestSuite.runTest(TestSuite.java:230)
	at junit.framework.TestSuite.run(TestSuite.java:225)
	at sun.reflect.NativeMethodAccessorImpl.invoke0(Native Method)
	at sun.reflect.NativeMethodAccessorImpl.invoke(NativeMethodAccessorImpl.java:57)
	at sun.reflect.DelegatingMethodAccessorImpl.invoke(DelegatingMethodAccessorImpl.java:43)
	at java.lang.reflect.Method.invoke(Method.java:606)
	at org.apache.maven.surefire.junit.JUnitTestSet.execute(JUnitTestSet.java:99)
	at org.apache.maven.surefire.junit.JUnit3Provider.executeTestSet(JUnit3Provider.java:130)
	at org.apache.maven.surefire.junit.JUnit3Provider.invoke(JUnit3Provider.java:107)
	at org.apache.maven.surefire.booter.ForkedBooter.invokeProviderInSameClassLoader(ForkedBooter.java:203)
	at org.apache.maven.surefire.booter.ForkedBooter.runSuitesInProcess(ForkedBooter.java:155)
	at org.apache.maven.surefire.booter.ForkedBooter.main(ForkedBooter.java:103)

testParseLocalDate_weekyear_month_week_2010(org.joda.time.format.TestDateTimeFormatter)  Time elapsed: 0.001 sec  <<< ERROR!
java.lang.IllegalArgumentException: Field type must not be null
	at org.joda.time.format.DateTimeFormatterBuilder.appendShortText(DateTimeFormatterBuilder.java:108)
	at org.joda.time.format.DateTimeFormatterBuilder.appendDayOfWeekShortText(DateTimeFormatterBuilder.java:144)
	at org.joda.time.format.TestDateTimeFormatter.setUp(TestDateTimeFormatter.java:89)
	at junit.framework.TestCase.runBare(TestCase.java:128)
	at junit.framework.TestResult$1.protect(TestResult.java:106)
	at junit.framework.TestResult.runProtected(TestResult.java:124)
	at junit.framework.TestResult.run(TestResult.java:109)
	at junit.framework.TestCase.run(TestCase.java:120)
	at junit.framework.TestSuite.runTest(TestSuite.java:230)
	at junit.framework.TestSuite.run(TestSuite.java:225)
	at junit.framework.TestSuite.runTest(TestSuite.java:230)
	at junit.framework.TestSuite.run(TestSuite.java:225)
	at junit.framework.TestSuite.runTest(TestSuite.java:230)
	at junit.framework.TestSuite.run(TestSuite.java:225)
	at sun.reflect.NativeMethodAccessorImpl.invoke0(Native Method)
	at sun.reflect.NativeMethodAccessorImpl.invoke(NativeMethodAccessorImpl.java:57)
	at sun.reflect.DelegatingMethodAccessorImpl.invoke(DelegatingMethodAccessorImpl.java:43)
	at java.lang.reflect.Method.invoke(Method.java:606)
	at org.apache.maven.surefire.junit.JUnitTestSet.execute(JUnitTestSet.java:99)
	at org.apache.maven.surefire.junit.JUnit3Provider.executeTestSet(JUnit3Provider.java:130)
	at org.apache.maven.surefire.junit.JUnit3Provider.invoke(JUnit3Provider.java:107)
	at org.apache.maven.surefire.booter.ForkedBooter.invokeProviderInSameClassLoader(ForkedBooter.java:203)
	at org.apache.maven.surefire.booter.ForkedBooter.runSuitesInProcess(ForkedBooter.java:155)
	at org.apache.maven.surefire.booter.ForkedBooter.main(ForkedBooter.java:103)

testParseLocalDate_weekyear_month_week_2011(org.joda.time.format.TestDateTimeFormatter)  Time elapsed: 0.001 sec  <<< ERROR!
java.lang.IllegalArgumentException: Field type must not be null
	at org.joda.time.format.DateTimeFormatterBuilder.appendShortText(DateTimeFormatterBuilder.java:108)
	at org.joda.time.format.DateTimeFormatterBuilder.appendDayOfWeekShortText(DateTimeFormatterBuilder.java:144)
	at org.joda.time.format.TestDateTimeFormatter.setUp(TestDateTimeFormatter.java:89)
	at junit.framework.TestCase.runBare(TestCase.java:128)
	at junit.framework.TestResult$1.protect(TestResult.java:106)
	at junit.framework.TestResult.runProtected(TestResult.java:124)
	at junit.framework.TestResult.run(TestResult.java:109)
	at junit.framework.TestCase.run(TestCase.java:120)
	at junit.framework.TestSuite.runTest(TestSuite.java:230)
	at junit.framework.TestSuite.run(TestSuite.java:225)
	at junit.framework.TestSuite.runTest(TestSuite.java:230)
	at junit.framework.TestSuite.run(TestSuite.java:225)
	at junit.framework.TestSuite.runTest(TestSuite.java:230)
	at junit.framework.TestSuite.run(TestSuite.java:225)
	at sun.reflect.NativeMethodAccessorImpl.invoke0(Native Method)
	at sun.reflect.NativeMethodAccessorImpl.invoke(NativeMethodAccessorImpl.java:57)
	at sun.reflect.DelegatingMethodAccessorImpl.invoke(DelegatingMethodAccessorImpl.java:43)
	at java.lang.reflect.Method.invoke(Method.java:606)
	at org.apache.maven.surefire.junit.JUnitTestSet.execute(JUnitTestSet.java:99)
	at org.apache.maven.surefire.junit.JUnit3Provider.executeTestSet(JUnit3Provider.java:130)
	at org.apache.maven.surefire.junit.JUnit3Provider.invoke(JUnit3Provider.java:107)
	at org.apache.maven.surefire.booter.ForkedBooter.invokeProviderInSameClassLoader(ForkedBooter.java:203)
	at org.apache.maven.surefire.booter.ForkedBooter.runSuitesInProcess(ForkedBooter.java:155)
	at org.apache.maven.surefire.booter.ForkedBooter.main(ForkedBooter.java:103)

testParseLocalDate_weekyear_month_week_2012(org.joda.time.format.TestDateTimeFormatter)  Time elapsed: 0.001 sec  <<< ERROR!
java.lang.IllegalArgumentException: Field type must not be null
	at org.joda.time.format.DateTimeFormatterBuilder.appendShortText(DateTimeFormatterBuilder.java:108)
	at org.joda.time.format.DateTimeFormatterBuilder.appendDayOfWeekShortText(DateTimeFormatterBuilder.java:144)
	at org.joda.time.format.TestDateTimeFormatter.setUp(TestDateTimeFormatter.java:89)
	at junit.framework.TestCase.runBare(TestCase.java:128)
	at junit.framework.TestResult$1.protect(TestResult.java:106)
	at junit.framework.TestResult.runProtected(TestResult.java:124)
	at junit.framework.TestResult.run(TestResult.java:109)
	at junit.framework.TestCase.run(TestCase.java:120)
	at junit.framework.TestSuite.runTest(TestSuite.java:230)
	at junit.framework.TestSuite.run(TestSuite.java:225)
	at junit.framework.TestSuite.runTest(TestSuite.java:230)
	at junit.framework.TestSuite.run(TestSuite.java:225)
	at junit.framework.TestSuite.runTest(TestSuite.java:230)
	at junit.framework.TestSuite.run(TestSuite.java:225)
	at sun.reflect.NativeMethodAccessorImpl.invoke0(Native Method)
	at sun.reflect.NativeMethodAccessorImpl.invoke(NativeMethodAccessorImpl.java:57)
	at sun.reflect.DelegatingMethodAccessorImpl.invoke(DelegatingMethodAccessorImpl.java:43)
	at java.lang.reflect.Method.invoke(Method.java:606)
	at org.apache.maven.surefire.junit.JUnitTestSet.execute(JUnitTestSet.java:99)
	at org.apache.maven.surefire.junit.JUnit3Provider.executeTestSet(JUnit3Provider.java:130)
	at org.apache.maven.surefire.junit.JUnit3Provider.invoke(JUnit3Provider.java:107)
	at org.apache.maven.surefire.booter.ForkedBooter.invokeProviderInSameClassLoader(ForkedBooter.java:203)
	at org.apache.maven.surefire.booter.ForkedBooter.runSuitesInProcess(ForkedBooter.java:155)
	at org.apache.maven.surefire.booter.ForkedBooter.main(ForkedBooter.java:103)

testParseLocalDate_year_month_week_2010(org.joda.time.format.TestDateTimeFormatter)  Time elapsed: 0.001 sec  <<< ERROR!
java.lang.IllegalArgumentException: Field type must not be null
	at org.joda.time.format.DateTimeFormatterBuilder.appendShortText(DateTimeFormatterBuilder.java:108)
	at org.joda.time.format.DateTimeFormatterBuilder.appendDayOfWeekShortText(DateTimeFormatterBuilder.java:144)
	at org.joda.time.format.TestDateTimeFormatter.setUp(TestDateTimeFormatter.java:89)
	at junit.framework.TestCase.runBare(TestCase.java:128)
	at junit.framework.TestResult$1.protect(TestResult.java:106)
	at junit.framework.TestResult.runProtected(TestResult.java:124)
	at junit.framework.TestResult.run(TestResult.java:109)
	at junit.framework.TestCase.run(TestCase.java:120)
	at junit.framework.TestSuite.runTest(TestSuite.java:230)
	at junit.framework.TestSuite.run(TestSuite.java:225)
	at junit.framework.TestSuite.runTest(TestSuite.java:230)
	at junit.framework.TestSuite.run(TestSuite.java:225)
	at junit.framework.TestSuite.runTest(TestSuite.java:230)
	at junit.framework.TestSuite.run(TestSuite.java:225)
	at sun.reflect.NativeMethodAccessorImpl.invoke0(Native Method)
	at sun.reflect.NativeMethodAccessorImpl.invoke(NativeMethodAccessorImpl.java:57)
	at sun.reflect.DelegatingMethodAccessorImpl.invoke(DelegatingMethodAccessorImpl.java:43)
	at java.lang.reflect.Method.invoke(Method.java:606)
	at org.apache.maven.surefire.junit.JUnitTestSet.execute(JUnitTestSet.java:99)
	at org.apache.maven.surefire.junit.JUnit3Provider.executeTestSet(JUnit3Provider.java:130)
	at org.apache.maven.surefire.junit.JUnit3Provider.invoke(JUnit3Provider.java:107)
	at org.apache.maven.surefire.booter.ForkedBooter.invokeProviderInSameClassLoader(ForkedBooter.java:203)
	at org.apache.maven.surefire.booter.ForkedBooter.runSuitesInProcess(ForkedBooter.java:155)
	at org.apache.maven.surefire.booter.ForkedBooter.main(ForkedBooter.java:103)

testParseLocalDate_year_month_week_2011(org.joda.time.format.TestDateTimeFormatter)  Time elapsed: 0.001 sec  <<< ERROR!
java.lang.IllegalArgumentException: Field type must not be null
	at org.joda.time.format.DateTimeFormatterBuilder.appendShortText(DateTimeFormatterBuilder.java:108)
	at org.joda.time.format.DateTimeFormatterBuilder.appendDayOfWeekShortText(DateTimeFormatterBuilder.java:144)
	at org.joda.time.format.TestDateTimeFormatter.setUp(TestDateTimeFormatter.java:89)
	at junit.framework.TestCase.runBare(TestCase.java:128)
	at junit.framework.TestResult$1.protect(TestResult.java:106)
	at junit.framework.TestResult.runProtected(TestResult.java:124)
	at junit.framework.TestResult.run(TestResult.java:109)
	at junit.framework.TestCase.run(TestCase.java:120)
	at junit.framework.TestSuite.runTest(TestSuite.java:230)
	at junit.framework.TestSuite.run(TestSuite.java:225)
	at junit.framework.TestSuite.runTest(TestSuite.java:230)
	at junit.framework.TestSuite.run(TestSuite.java:225)
	at junit.framework.TestSuite.runTest(TestSuite.java:230)
	at junit.framework.TestSuite.run(TestSuite.java:225)
	at sun.reflect.NativeMethodAccessorImpl.invoke0(Native Method)
	at sun.reflect.NativeMethodAccessorImpl.invoke(NativeMethodAccessorImpl.java:57)
	at sun.reflect.DelegatingMethodAccessorImpl.invoke(DelegatingMethodAccessorImpl.java:43)
	at java.lang.reflect.Method.invoke(Method.java:606)
	at org.apache.maven.surefire.junit.JUnitTestSet.execute(JUnitTestSet.java:99)
	at org.apache.maven.surefire.junit.JUnit3Provider.executeTestSet(JUnit3Provider.java:130)
	at org.apache.maven.surefire.junit.JUnit3Provider.invoke(JUnit3Provider.java:107)
	at org.apache.maven.surefire.booter.ForkedBooter.invokeProviderInSameClassLoader(ForkedBooter.java:203)
	at org.apache.maven.surefire.booter.ForkedBooter.runSuitesInProcess(ForkedBooter.java:155)
	at org.apache.maven.surefire.booter.ForkedBooter.main(ForkedBooter.java:103)

testParseLocalDate_year_month_week_2012(org.joda.time.format.TestDateTimeFormatter)  Time elapsed: 0.001 sec  <<< ERROR!
java.lang.IllegalArgumentException: Field type must not be null
	at org.joda.time.format.DateTimeFormatterBuilder.appendShortText(DateTimeFormatterBuilder.java:108)
	at org.joda.time.format.DateTimeFormatterBuilder.appendDayOfWeekShortText(DateTimeFormatterBuilder.java:144)
	at org.joda.time.format.TestDateTimeFormatter.setUp(TestDateTimeFormatter.java:89)
	at junit.framework.TestCase.runBare(TestCase.java:128)
	at junit.framework.TestResult$1.protect(TestResult.java:106)
	at junit.framework.TestResult.runProtected(TestResult.java:124)
	at junit.framework.TestResult.run(TestResult.java:109)
	at junit.framework.TestCase.run(TestCase.java:120)
	at junit.framework.TestSuite.runTest(TestSuite.java:230)
	at junit.framework.TestSuite.run(TestSuite.java:225)
	at junit.framework.TestSuite.runTest(TestSuite.java:230)
	at junit.framework.TestSuite.run(TestSuite.java:225)
	at junit.framework.TestSuite.runTest(TestSuite.java:230)
	at junit.framework.TestSuite.run(TestSuite.java:225)
	at sun.reflect.NativeMethodAccessorImpl.invoke0(Native Method)
	at sun.reflect.NativeMethodAccessorImpl.invoke(NativeMethodAccessorImpl.java:57)
	at sun.reflect.DelegatingMethodAccessorImpl.invoke(DelegatingMethodAccessorImpl.java:43)
	at java.lang.reflect.Method.invoke(Method.java:606)
	at org.apache.maven.surefire.junit.JUnitTestSet.execute(JUnitTestSet.java:99)
	at org.apache.maven.surefire.junit.JUnit3Provider.executeTestSet(JUnit3Provider.java:130)
	at org.apache.maven.surefire.junit.JUnit3Provider.invoke(JUnit3Provider.java:107)
	at org.apache.maven.surefire.booter.ForkedBooter.invokeProviderInSameClassLoader(ForkedBooter.java:203)
	at org.apache.maven.surefire.booter.ForkedBooter.runSuitesInProcess(ForkedBooter.java:155)
	at org.apache.maven.surefire.booter.ForkedBooter.main(ForkedBooter.java:103)

testParseLocalDate_year_month_week_2013(org.joda.time.format.TestDateTimeFormatter)  Time elapsed: 0.006 sec  <<< ERROR!
java.lang.IllegalArgumentException: Field type must not be null
	at org.joda.time.format.DateTimeFormatterBuilder.appendShortText(DateTimeFormatterBuilder.java:108)
	at org.joda.time.format.DateTimeFormatterBuilder.appendDayOfWeekShortText(DateTimeFormatterBuilder.java:144)
	at org.joda.time.format.TestDateTimeFormatter.setUp(TestDateTimeFormatter.java:89)
	at junit.framework.TestCase.runBare(TestCase.java:128)
	at junit.framework.TestResult$1.protect(TestResult.java:106)
	at junit.framework.TestResult.runProtected(TestResult.java:124)
	at junit.framework.TestResult.run(TestResult.java:109)
	at junit.framework.TestCase.run(TestCase.java:120)
	at junit.framework.TestSuite.runTest(TestSuite.java:230)
	at junit.framework.TestSuite.run(TestSuite.java:225)
	at junit.framework.TestSuite.runTest(TestSuite.java:230)
	at junit.framework.TestSuite.run(TestSuite.java:225)
	at junit.framework.TestSuite.runTest(TestSuite.java:230)
	at junit.framework.TestSuite.run(TestSuite.java:225)
	at sun.reflect.NativeMethodAccessorImpl.invoke0(Native Method)
	at sun.reflect.NativeMethodAccessorImpl.invoke(NativeMethodAccessorImpl.java:57)
	at sun.reflect.DelegatingMethodAccessorImpl.invoke(DelegatingMethodAccessorImpl.java:43)
	at java.lang.reflect.Method.invoke(Method.java:606)
	at org.apache.maven.surefire.junit.JUnitTestSet.execute(JUnitTestSet.java:99)
	at org.apache.maven.surefire.junit.JUnit3Provider.executeTestSet(JUnit3Provider.java:130)
	at org.apache.maven.surefire.junit.JUnit3Provider.invoke(JUnit3Provider.java:107)
	at org.apache.maven.surefire.booter.ForkedBooter.invokeProviderInSameClassLoader(ForkedBooter.java:203)
	at org.apache.maven.surefire.booter.ForkedBooter.runSuitesInProcess(ForkedBooter.java:155)
	at org.apache.maven.surefire.booter.ForkedBooter.main(ForkedBooter.java:103)

testParseLocalDate_year_month_week_2014(org.joda.time.format.TestDateTimeFormatter)  Time elapsed: 0 sec  <<< ERROR!
java.lang.IllegalArgumentException: Field type must not be null
	at org.joda.time.format.DateTimeFormatterBuilder.appendShortText(DateTimeFormatterBuilder.java:108)
	at org.joda.time.format.DateTimeFormatterBuilder.appendDayOfWeekShortText(DateTimeFormatterBuilder.java:144)
	at org.joda.time.format.TestDateTimeFormatter.setUp(TestDateTimeFormatter.java:89)
	at junit.framework.TestCase.runBare(TestCase.java:128)
	at junit.framework.TestResult$1.protect(TestResult.java:106)
	at junit.framework.TestResult.runProtected(TestResult.java:124)
	at junit.framework.TestResult.run(TestResult.java:109)
	at junit.framework.TestCase.run(TestCase.java:120)
	at junit.framework.TestSuite.runTest(TestSuite.java:230)
	at junit.framework.TestSuite.run(TestSuite.java:225)
	at junit.framework.TestSuite.runTest(TestSuite.java:230)
	at junit.framework.TestSuite.run(TestSuite.java:225)
	at junit.framework.TestSuite.runTest(TestSuite.java:230)
	at junit.framework.TestSuite.run(TestSuite.java:225)
	at sun.reflect.NativeMethodAccessorImpl.invoke0(Native Method)
	at sun.reflect.NativeMethodAccessorImpl.invoke(NativeMethodAccessorImpl.java:57)
	at sun.reflect.DelegatingMethodAccessorImpl.invoke(DelegatingMethodAccessorImpl.java:43)
	at java.lang.reflect.Method.invoke(Method.java:606)
	at org.apache.maven.surefire.junit.JUnitTestSet.execute(JUnitTestSet.java:99)
	at org.apache.maven.surefire.junit.JUnit3Provider.executeTestSet(JUnit3Provider.java:130)
	at org.apache.maven.surefire.junit.JUnit3Provider.invoke(JUnit3Provider.java:107)
	at org.apache.maven.surefire.booter.ForkedBooter.invokeProviderInSameClassLoader(ForkedBooter.java:203)
	at org.apache.maven.surefire.booter.ForkedBooter.runSuitesInProcess(ForkedBooter.java:155)
	at org.apache.maven.surefire.booter.ForkedBooter.main(ForkedBooter.java:103)

testParseLocalDate_year_month_week_2015(org.joda.time.format.TestDateTimeFormatter)  Time elapsed: 0 sec  <<< ERROR!
java.lang.IllegalArgumentException: Field type must not be null
	at org.joda.time.format.DateTimeFormatterBuilder.appendShortText(DateTimeFormatterBuilder.java:108)
	at org.joda.time.format.DateTimeFormatterBuilder.appendDayOfWeekShortText(DateTimeFormatterBuilder.java:144)
	at org.joda.time.format.TestDateTimeFormatter.setUp(TestDateTimeFormatter.java:89)
	at junit.framework.TestCase.runBare(TestCase.java:128)
	at junit.framework.TestResult$1.protect(TestResult.java:106)
	at junit.framework.TestResult.runProtected(TestResult.java:124)
	at junit.framework.TestResult.run(TestResult.java:109)
	at junit.framework.TestCase.run(TestCase.java:120)
	at junit.framework.TestSuite.runTest(TestSuite.java:230)
	at junit.framework.TestSuite.run(TestSuite.java:225)
	at junit.framework.TestSuite.runTest(TestSuite.java:230)
	at junit.framework.TestSuite.run(TestSuite.java:225)
	at junit.framework.TestSuite.runTest(TestSuite.java:230)
	at junit.framework.TestSuite.run(TestSuite.java:225)
	at sun.reflect.NativeMethodAccessorImpl.invoke0(Native Method)
	at sun.reflect.NativeMethodAccessorImpl.invoke(NativeMethodAccessorImpl.java:57)
	at sun.reflect.DelegatingMethodAccessorImpl.invoke(DelegatingMethodAccessorImpl.java:43)
	at java.lang.reflect.Method.invoke(Method.java:606)
	at org.apache.maven.surefire.junit.JUnitTestSet.execute(JUnitTestSet.java:99)
	at org.apache.maven.surefire.junit.JUnit3Provider.executeTestSet(JUnit3Provider.java:130)
	at org.apache.maven.surefire.junit.JUnit3Provider.invoke(JUnit3Provider.java:107)
	at org.apache.maven.surefire.booter.ForkedBooter.invokeProviderInSameClassLoader(ForkedBooter.java:203)
	at org.apache.maven.surefire.booter.ForkedBooter.runSuitesInProcess(ForkedBooter.java:155)
	at org.apache.maven.surefire.booter.ForkedBooter.main(ForkedBooter.java:103)

testParseLocalDate_year_month_week_2016(org.joda.time.format.TestDateTimeFormatter)  Time elapsed: 0 sec  <<< ERROR!
java.lang.IllegalArgumentException: Field type must not be null
	at org.joda.time.format.DateTimeFormatterBuilder.appendShortText(DateTimeFormatterBuilder.java:108)
	at org.joda.time.format.DateTimeFormatterBuilder.appendDayOfWeekShortText(DateTimeFormatterBuilder.java:144)
	at org.joda.time.format.TestDateTimeFormatter.setUp(TestDateTimeFormatter.java:89)
	at junit.framework.TestCase.runBare(TestCase.java:128)
	at junit.framework.TestResult$1.protect(TestResult.java:106)
	at junit.framework.TestResult.runProtected(TestResult.java:124)
	at junit.framework.TestResult.run(TestResult.java:109)
	at junit.framework.TestCase.run(TestCase.java:120)
	at junit.framework.TestSuite.runTest(TestSuite.java:230)
	at junit.framework.TestSuite.run(TestSuite.java:225)
	at junit.framework.TestSuite.runTest(TestSuite.java:230)
	at junit.framework.TestSuite.run(TestSuite.java:225)
	at junit.framework.TestSuite.runTest(TestSuite.java:230)
	at junit.framework.TestSuite.run(TestSuite.java:225)
	at sun.reflect.NativeMethodAccessorImpl.invoke0(Native Method)
	at sun.reflect.NativeMethodAccessorImpl.invoke(NativeMethodAccessorImpl.java:57)
	at sun.reflect.DelegatingMethodAccessorImpl.invoke(DelegatingMethodAccessorImpl.java:43)
	at java.lang.reflect.Method.invoke(Method.java:606)
	at org.apache.maven.surefire.junit.JUnitTestSet.execute(JUnitTestSet.java:99)
	at org.apache.maven.surefire.junit.JUnit3Provider.executeTestSet(JUnit3Provider.java:130)
	at org.apache.maven.surefire.junit.JUnit3Provider.invoke(JUnit3Provider.java:107)
	at org.apache.maven.surefire.booter.ForkedBooter.invokeProviderInSameClassLoader(ForkedBooter.java:203)
	at org.apache.maven.surefire.booter.ForkedBooter.runSuitesInProcess(ForkedBooter.java:155)
	at org.apache.maven.surefire.booter.ForkedBooter.main(ForkedBooter.java:103)

testParseLocalTime_simple(org.joda.time.format.TestDateTimeFormatter)  Time elapsed: 0 sec  <<< ERROR!
java.lang.IllegalArgumentException: Field type must not be null
	at org.joda.time.format.DateTimeFormatterBuilder.appendShortText(DateTimeFormatterBuilder.java:108)
	at org.joda.time.format.DateTimeFormatterBuilder.appendDayOfWeekShortText(DateTimeFormatterBuilder.java:144)
	at org.joda.time.format.TestDateTimeFormatter.setUp(TestDateTimeFormatter.java:89)
	at junit.framework.TestCase.runBare(TestCase.java:128)
	at junit.framework.TestResult$1.protect(TestResult.java:106)
	at junit.framework.TestResult.runProtected(TestResult.java:124)
	at junit.framework.TestResult.run(TestResult.java:109)
	at junit.framework.TestCase.run(TestCase.java:120)
	at junit.framework.TestSuite.runTest(TestSuite.java:230)
	at junit.framework.TestSuite.run(TestSuite.java:225)
	at junit.framework.TestSuite.runTest(TestSuite.java:230)
	at junit.framework.TestSuite.run(TestSuite.java:225)
	at junit.framework.TestSuite.runTest(TestSuite.java:230)
	at junit.framework.TestSuite.run(TestSuite.java:225)
	at sun.reflect.NativeMethodAccessorImpl.invoke0(Native Method)
	at sun.reflect.NativeMethodAccessorImpl.invoke(NativeMethodAccessorImpl.java:57)
	at sun.reflect.DelegatingMethodAccessorImpl.invoke(DelegatingMethodAccessorImpl.java:43)
	at java.lang.reflect.Method.invoke(Method.java:606)
	at org.apache.maven.surefire.junit.JUnitTestSet.execute(JUnitTestSet.java:99)
	at org.apache.maven.surefire.junit.JUnit3Provider.executeTestSet(JUnit3Provider.java:130)
	at org.apache.maven.surefire.junit.JUnit3Provider.invoke(JUnit3Provider.java:107)
	at org.apache.maven.surefire.booter.ForkedBooter.invokeProviderInSameClassLoader(ForkedBooter.java:203)
	at org.apache.maven.surefire.booter.ForkedBooter.runSuitesInProcess(ForkedBooter.java:155)
	at org.apache.maven.surefire.booter.ForkedBooter.main(ForkedBooter.java:103)

testParseLocalDateTime_simple(org.joda.time.format.TestDateTimeFormatter)  Time elapsed: 0 sec  <<< ERROR!
java.lang.IllegalArgumentException: Field type must not be null
	at org.joda.time.format.DateTimeFormatterBuilder.appendShortText(DateTimeFormatterBuilder.java:108)
	at org.joda.time.format.DateTimeFormatterBuilder.appendDayOfWeekShortText(DateTimeFormatterBuilder.java:144)
	at org.joda.time.format.TestDateTimeFormatter.setUp(TestDateTimeFormatter.java:89)
	at junit.framework.TestCase.runBare(TestCase.java:128)
	at junit.framework.TestResult$1.protect(TestResult.java:106)
	at junit.framework.TestResult.runProtected(TestResult.java:124)
	at junit.framework.TestResult.run(TestResult.java:109)
	at junit.framework.TestCase.run(TestCase.java:120)
	at junit.framework.TestSuite.runTest(TestSuite.java:230)
	at junit.framework.TestSuite.run(TestSuite.java:225)
	at junit.framework.TestSuite.runTest(TestSuite.java:230)
	at junit.framework.TestSuite.run(TestSuite.java:225)
	at junit.framework.TestSuite.runTest(TestSuite.java:230)
	at junit.framework.TestSuite.run(TestSuite.java:225)
	at sun.reflect.NativeMethodAccessorImpl.invoke0(Native Method)
	at sun.reflect.NativeMethodAccessorImpl.invoke(NativeMethodAccessorImpl.java:57)
	at sun.reflect.DelegatingMethodAccessorImpl.invoke(DelegatingMethodAccessorImpl.java:43)
	at java.lang.reflect.Method.invoke(Method.java:606)
	at org.apache.maven.surefire.junit.JUnitTestSet.execute(JUnitTestSet.java:99)
	at org.apache.maven.surefire.junit.JUnit3Provider.executeTestSet(JUnit3Provider.java:130)
	at org.apache.maven.surefire.junit.JUnit3Provider.invoke(JUnit3Provider.java:107)
	at org.apache.maven.surefire.booter.ForkedBooter.invokeProviderInSameClassLoader(ForkedBooter.java:203)
	at org.apache.maven.surefire.booter.ForkedBooter.runSuitesInProcess(ForkedBooter.java:155)
	at org.apache.maven.surefire.booter.ForkedBooter.main(ForkedBooter.java:103)

testParseLocalDateTime_monthDay_feb29(org.joda.time.format.TestDateTimeFormatter)  Time elapsed: 0 sec  <<< ERROR!
java.lang.IllegalArgumentException: Field type must not be null
	at org.joda.time.format.DateTimeFormatterBuilder.appendShortText(DateTimeFormatterBuilder.java:108)
	at org.joda.time.format.DateTimeFormatterBuilder.appendDayOfWeekShortText(DateTimeFormatterBuilder.java:144)
	at org.joda.time.format.TestDateTimeFormatter.setUp(TestDateTimeFormatter.java:89)
	at junit.framework.TestCase.runBare(TestCase.java:128)
	at junit.framework.TestResult$1.protect(TestResult.java:106)
	at junit.framework.TestResult.runProtected(TestResult.java:124)
	at junit.framework.TestResult.run(TestResult.java:109)
	at junit.framework.TestCase.run(TestCase.java:120)
	at junit.framework.TestSuite.runTest(TestSuite.java:230)
	at junit.framework.TestSuite.run(TestSuite.java:225)
	at junit.framework.TestSuite.runTest(TestSuite.java:230)
	at junit.framework.TestSuite.run(TestSuite.java:225)
	at junit.framework.TestSuite.runTest(TestSuite.java:230)
	at junit.framework.TestSuite.run(TestSuite.java:225)
	at sun.reflect.NativeMethodAccessorImpl.invoke0(Native Method)
	at sun.reflect.NativeMethodAccessorImpl.invoke(NativeMethodAccessorImpl.java:57)
	at sun.reflect.DelegatingMethodAccessorImpl.invoke(DelegatingMethodAccessorImpl.java:43)
	at java.lang.reflect.Method.invoke(Method.java:606)
	at org.apache.maven.surefire.junit.JUnitTestSet.execute(JUnitTestSet.java:99)
	at org.apache.maven.surefire.junit.JUnit3Provider.executeTestSet(JUnit3Provider.java:130)
	at org.apache.maven.surefire.junit.JUnit3Provider.invoke(JUnit3Provider.java:107)
	at org.apache.maven.surefire.booter.ForkedBooter.invokeProviderInSameClassLoader(ForkedBooter.java:203)
	at org.apache.maven.surefire.booter.ForkedBooter.runSuitesInProcess(ForkedBooter.java:155)
	at org.apache.maven.surefire.booter.ForkedBooter.main(ForkedBooter.java:103)

testParseLocalDateTime_monthDay_withDefaultYear_feb29(org.joda.time.format.TestDateTimeFormatter)  Time elapsed: 0.001 sec  <<< ERROR!
java.lang.IllegalArgumentException: Field type must not be null
	at org.joda.time.format.DateTimeFormatterBuilder.appendShortText(DateTimeFormatterBuilder.java:108)
	at org.joda.time.format.DateTimeFormatterBuilder.appendDayOfWeekShortText(DateTimeFormatterBuilder.java:144)
	at org.joda.time.format.TestDateTimeFormatter.setUp(TestDateTimeFormatter.java:89)
	at junit.framework.TestCase.runBare(TestCase.java:128)
	at junit.framework.TestResult$1.protect(TestResult.java:106)
	at junit.framework.TestResult.runProtected(TestResult.java:124)
	at junit.framework.TestResult.run(TestResult.java:109)
	at junit.framework.TestCase.run(TestCase.java:120)
	at junit.framework.TestSuite.runTest(TestSuite.java:230)
	at junit.framework.TestSuite.run(TestSuite.java:225)
	at junit.framework.TestSuite.runTest(TestSuite.java:230)
	at junit.framework.TestSuite.run(TestSuite.java:225)
	at junit.framework.TestSuite.runTest(TestSuite.java:230)
	at junit.framework.TestSuite.run(TestSuite.java:225)
	at sun.reflect.NativeMethodAccessorImpl.invoke0(Native Method)
	at sun.reflect.NativeMethodAccessorImpl.invoke(NativeMethodAccessorImpl.java:57)
	at sun.reflect.DelegatingMethodAccessorImpl.invoke(DelegatingMethodAccessorImpl.java:43)
	at java.lang.reflect.Method.invoke(Method.java:606)
	at org.apache.maven.surefire.junit.JUnitTestSet.execute(JUnitTestSet.java:99)
	at org.apache.maven.surefire.junit.JUnit3Provider.executeTestSet(JUnit3Provider.java:130)
	at org.apache.maven.surefire.junit.JUnit3Provider.invoke(JUnit3Provider.java:107)
	at org.apache.maven.surefire.booter.ForkedBooter.invokeProviderInSameClassLoader(ForkedBooter.java:203)
	at org.apache.maven.surefire.booter.ForkedBooter.runSuitesInProcess(ForkedBooter.java:155)
	at org.apache.maven.surefire.booter.ForkedBooter.main(ForkedBooter.java:103)

testParseDateTime_simple(org.joda.time.format.TestDateTimeFormatter)  Time elapsed: 0 sec  <<< ERROR!
java.lang.IllegalArgumentException: Field type must not be null
	at org.joda.time.format.DateTimeFormatterBuilder.appendShortText(DateTimeFormatterBuilder.java:108)
	at org.joda.time.format.DateTimeFormatterBuilder.appendDayOfWeekShortText(DateTimeFormatterBuilder.java:144)
	at org.joda.time.format.TestDateTimeFormatter.setUp(TestDateTimeFormatter.java:89)
	at junit.framework.TestCase.runBare(TestCase.java:128)
	at junit.framework.TestResult$1.protect(TestResult.java:106)
	at junit.framework.TestResult.runProtected(TestResult.java:124)
	at junit.framework.TestResult.run(TestResult.java:109)
	at junit.framework.TestCase.run(TestCase.java:120)
	at junit.framework.TestSuite.runTest(TestSuite.java:230)
	at junit.framework.TestSuite.run(TestSuite.java:225)
	at junit.framework.TestSuite.runTest(TestSuite.java:230)
	at junit.framework.TestSuite.run(TestSuite.java:225)
	at junit.framework.TestSuite.runTest(TestSuite.java:230)
	at junit.framework.TestSuite.run(TestSuite.java:225)
	at sun.reflect.NativeMethodAccessorImpl.invoke0(Native Method)
	at sun.reflect.NativeMethodAccessorImpl.invoke(NativeMethodAccessorImpl.java:57)
	at sun.reflect.DelegatingMethodAccessorImpl.invoke(DelegatingMethodAccessorImpl.java:43)
	at java.lang.reflect.Method.invoke(Method.java:606)
	at org.apache.maven.surefire.junit.JUnitTestSet.execute(JUnitTestSet.java:99)
	at org.apache.maven.surefire.junit.JUnit3Provider.executeTestSet(JUnit3Provider.java:130)
	at org.apache.maven.surefire.junit.JUnit3Provider.invoke(JUnit3Provider.java:107)
	at org.apache.maven.surefire.booter.ForkedBooter.invokeProviderInSameClassLoader(ForkedBooter.java:203)
	at org.apache.maven.surefire.booter.ForkedBooter.runSuitesInProcess(ForkedBooter.java:155)
	at org.apache.maven.surefire.booter.ForkedBooter.main(ForkedBooter.java:103)

testParseDateTime_zone(org.joda.time.format.TestDateTimeFormatter)  Time elapsed: 0 sec  <<< ERROR!
java.lang.IllegalArgumentException: Field type must not be null
	at org.joda.time.format.DateTimeFormatterBuilder.appendShortText(DateTimeFormatterBuilder.java:108)
	at org.joda.time.format.DateTimeFormatterBuilder.appendDayOfWeekShortText(DateTimeFormatterBuilder.java:144)
	at org.joda.time.format.TestDateTimeFormatter.setUp(TestDateTimeFormatter.java:89)
	at junit.framework.TestCase.runBare(TestCase.java:128)
	at junit.framework.TestResult$1.protect(TestResult.java:106)
	at junit.framework.TestResult.runProtected(TestResult.java:124)
	at junit.framework.TestResult.run(TestResult.java:109)
	at junit.framework.TestCase.run(TestCase.java:120)
	at junit.framework.TestSuite.runTest(TestSuite.java:230)
	at junit.framework.TestSuite.run(TestSuite.java:225)
	at junit.framework.TestSuite.runTest(TestSuite.java:230)
	at junit.framework.TestSuite.run(TestSuite.java:225)
	at junit.framework.TestSuite.runTest(TestSuite.java:230)
	at junit.framework.TestSuite.run(TestSuite.java:225)
	at sun.reflect.NativeMethodAccessorImpl.invoke0(Native Method)
	at sun.reflect.NativeMethodAccessorImpl.invoke(NativeMethodAccessorImpl.java:57)
	at sun.reflect.DelegatingMethodAccessorImpl.invoke(DelegatingMethodAccessorImpl.java:43)
	at java.lang.reflect.Method.invoke(Method.java:606)
	at org.apache.maven.surefire.junit.JUnitTestSet.execute(JUnitTestSet.java:99)
	at org.apache.maven.surefire.junit.JUnit3Provider.executeTestSet(JUnit3Provider.java:130)
	at org.apache.maven.surefire.junit.JUnit3Provider.invoke(JUnit3Provider.java:107)
	at org.apache.maven.surefire.booter.ForkedBooter.invokeProviderInSameClassLoader(ForkedBooter.java:203)
	at org.apache.maven.surefire.booter.ForkedBooter.runSuitesInProcess(ForkedBooter.java:155)
	at org.apache.maven.surefire.booter.ForkedBooter.main(ForkedBooter.java:103)

testFormatParse_textMonthJanShort_UK(org.joda.time.format.TestDateTimeFormat)  Time elapsed: 0.001 sec  <<< ERROR!
java.lang.IllegalArgumentException: Field type must not be null
	at org.joda.time.format.DateTimeFormatterBuilder.appendShortText(DateTimeFormatterBuilder.java:108)
	at org.joda.time.format.DateTimeFormatterBuilder.appendMonthOfYearShortText(DateTimeFormatterBuilder.java:146)
	at org.joda.time.format.DateTimeFormat.parsePatternTo(DateTimeFormat.java:490)
	at org.joda.time.format.DateTimeFormat.createFormatterForPattern(DateTimeFormat.java:687)
	at org.joda.time.format.DateTimeFormat.forPattern(DateTimeFormat.java:177)
	at org.joda.time.format.TestDateTimeFormat.testFormatParse_textMonthJanShort_UK(TestDateTimeFormat.java:894)

testFormatParse_textMonthJanShortLowerCase_UK(org.joda.time.format.TestDateTimeFormat)  Time elapsed: 0.001 sec  <<< ERROR!
java.lang.IllegalArgumentException: Field type must not be null
	at org.joda.time.format.DateTimeFormatterBuilder.appendShortText(DateTimeFormatterBuilder.java:108)
	at org.joda.time.format.DateTimeFormatterBuilder.appendMonthOfYearShortText(DateTimeFormatterBuilder.java:146)
	at org.joda.time.format.DateTimeFormat.parsePatternTo(DateTimeFormat.java:490)
	at org.joda.time.format.DateTimeFormat.createFormatterForPattern(DateTimeFormat.java:687)
	at org.joda.time.format.DateTimeFormat.forPattern(DateTimeFormat.java:177)
	at org.joda.time.format.TestDateTimeFormat.testFormatParse_textMonthJanShortLowerCase_UK(TestDateTimeFormat.java:904)

testFormatParse_textMonthJanShortUpperCase_UK(org.joda.time.format.TestDateTimeFormat)  Time elapsed: 0.001 sec  <<< ERROR!
java.lang.IllegalArgumentException: Field type must not be null
	at org.joda.time.format.DateTimeFormatterBuilder.appendShortText(DateTimeFormatterBuilder.java:108)
	at org.joda.time.format.DateTimeFormatterBuilder.appendMonthOfYearShortText(DateTimeFormatterBuilder.java:146)
	at org.joda.time.format.DateTimeFormat.parsePatternTo(DateTimeFormat.java:490)
	at org.joda.time.format.DateTimeFormat.createFormatterForPattern(DateTimeFormat.java:687)
	at org.joda.time.format.DateTimeFormat.forPattern(DateTimeFormat.java:177)
	at org.joda.time.format.TestDateTimeFormat.testFormatParse_textMonthJanShortUpperCase_UK(TestDateTimeFormat.java:911)

testParse_textMonthJanLong_UK(org.joda.time.format.TestDateTimeFormat)  Time elapsed: 0.001 sec  <<< ERROR!
java.lang.IllegalArgumentException: Field type must not be null
	at org.joda.time.format.DateTimeFormatterBuilder.appendShortText(DateTimeFormatterBuilder.java:108)
	at org.joda.time.format.DateTimeFormatterBuilder.appendMonthOfYearShortText(DateTimeFormatterBuilder.java:146)
	at org.joda.time.format.DateTimeFormat.parsePatternTo(DateTimeFormat.java:490)
	at org.joda.time.format.DateTimeFormat.createFormatterForPattern(DateTimeFormat.java:687)
	at org.joda.time.format.DateTimeFormat.forPattern(DateTimeFormat.java:177)
	at org.joda.time.format.TestDateTimeFormat.testParse_textMonthJanLong_UK(TestDateTimeFormat.java:918)

testFormatParse_textMonthJanLongLowerCase_UK(org.joda.time.format.TestDateTimeFormat)  Time elapsed: 0 sec  <<< ERROR!
java.lang.IllegalArgumentException: Field type must not be null
	at org.joda.time.format.DateTimeFormatterBuilder.appendShortText(DateTimeFormatterBuilder.java:108)
	at org.joda.time.format.DateTimeFormatterBuilder.appendMonthOfYearShortText(DateTimeFormatterBuilder.java:146)
	at org.joda.time.format.DateTimeFormat.parsePatternTo(DateTimeFormat.java:490)
	at org.joda.time.format.DateTimeFormat.createFormatterForPattern(DateTimeFormat.java:687)
	at org.joda.time.format.DateTimeFormat.forPattern(DateTimeFormat.java:177)
	at org.joda.time.format.TestDateTimeFormat.testFormatParse_textMonthJanLongLowerCase_UK(TestDateTimeFormat.java:926)

testFormatParse_textMonthJanLongUpperCase_UK(org.joda.time.format.TestDateTimeFormat)  Time elapsed: 0 sec  <<< ERROR!
java.lang.IllegalArgumentException: Field type must not be null
	at org.joda.time.format.DateTimeFormatterBuilder.appendShortText(DateTimeFormatterBuilder.java:108)
	at org.joda.time.format.DateTimeFormatterBuilder.appendMonthOfYearShortText(DateTimeFormatterBuilder.java:146)
	at org.joda.time.format.DateTimeFormat.parsePatternTo(DateTimeFormat.java:490)
	at org.joda.time.format.DateTimeFormat.createFormatterForPattern(DateTimeFormat.java:687)
	at org.joda.time.format.DateTimeFormat.forPattern(DateTimeFormat.java:177)
	at org.joda.time.format.TestDateTimeFormat.testFormatParse_textMonthJanLongUpperCase_UK(TestDateTimeFormat.java:933)

testFormatParse_textMonthJanShort_France(org.joda.time.format.TestDateTimeFormat)  Time elapsed: 0.001 sec  <<< ERROR!
java.lang.IllegalArgumentException: Field type must not be null
	at org.joda.time.format.DateTimeFormatterBuilder.appendShortText(DateTimeFormatterBuilder.java:108)
	at org.joda.time.format.DateTimeFormatterBuilder.appendMonthOfYearShortText(DateTimeFormatterBuilder.java:146)
	at org.joda.time.format.DateTimeFormat.parsePatternTo(DateTimeFormat.java:490)
	at org.joda.time.format.DateTimeFormat.createFormatterForPattern(DateTimeFormat.java:687)
	at org.joda.time.format.DateTimeFormat.forPattern(DateTimeFormat.java:177)
	at org.joda.time.format.TestDateTimeFormat.testFormatParse_textMonthJanShort_France(TestDateTimeFormat.java:940)

testFormatParse_textMonthJanLong_France(org.joda.time.format.TestDateTimeFormat)  Time elapsed: 0.001 sec  <<< ERROR!
java.lang.IllegalArgumentException: Field type must not be null
	at org.joda.time.format.DateTimeFormatterBuilder.appendShortText(DateTimeFormatterBuilder.java:108)
	at org.joda.time.format.DateTimeFormatterBuilder.appendMonthOfYearShortText(DateTimeFormatterBuilder.java:146)
	at org.joda.time.format.DateTimeFormat.parsePatternTo(DateTimeFormat.java:490)
	at org.joda.time.format.DateTimeFormat.createFormatterForPattern(DateTimeFormat.java:687)
	at org.joda.time.format.DateTimeFormat.forPattern(DateTimeFormat.java:177)
	at org.joda.time.format.TestDateTimeFormat.testFormatParse_textMonthJanLong_France(TestDateTimeFormat.java:950)

testFormatParse_textMonthApr_France(org.joda.time.format.TestDateTimeFormat)  Time elapsed: 0.001 sec  <<< ERROR!
java.lang.IllegalArgumentException: Field type must not be null
	at org.joda.time.format.DateTimeFormatterBuilder.appendShortText(DateTimeFormatterBuilder.java:108)
	at org.joda.time.format.DateTimeFormatterBuilder.appendMonthOfYearShortText(DateTimeFormatterBuilder.java:146)
	at org.joda.time.format.DateTimeFormat.parsePatternTo(DateTimeFormat.java:490)
	at org.joda.time.format.DateTimeFormat.createFormatterForPattern(DateTimeFormat.java:687)
	at org.joda.time.format.DateTimeFormat.forPattern(DateTimeFormat.java:177)
	at org.joda.time.format.TestDateTimeFormat.testFormatParse_textMonthApr_France(TestDateTimeFormat.java:958)

testFormatParse_textMonthAtEnd_France(org.joda.time.format.TestDateTimeFormat)  Time elapsed: 0 sec  <<< ERROR!
java.lang.IllegalArgumentException: Field type must not be null
	at org.joda.time.format.DateTimeFormatterBuilder.appendShortText(DateTimeFormatterBuilder.java:108)
	at org.joda.time.format.DateTimeFormatterBuilder.appendMonthOfYearShortText(DateTimeFormatterBuilder.java:146)
	at org.joda.time.format.DateTimeFormat.parsePatternTo(DateTimeFormat.java:490)
	at org.joda.time.format.DateTimeFormat.createFormatterForPattern(DateTimeFormat.java:687)
	at org.joda.time.format.DateTimeFormat.forPattern(DateTimeFormat.java:177)
	at org.joda.time.format.TestDateTimeFormat.testFormatParse_textMonthAtEnd_France(TestDateTimeFormat.java:968)

testFormatParse_textMonthAtEnd_France_withSpecifiedDefault(org.joda.time.format.TestDateTimeFormat)  Time elapsed: 0 sec  <<< ERROR!
java.lang.IllegalArgumentException: Field type must not be null
	at org.joda.time.format.DateTimeFormatterBuilder.appendShortText(DateTimeFormatterBuilder.java:108)
	at org.joda.time.format.DateTimeFormatterBuilder.appendMonthOfYearShortText(DateTimeFormatterBuilder.java:146)
	at org.joda.time.format.DateTimeFormat.parsePatternTo(DateTimeFormat.java:490)
	at org.joda.time.format.DateTimeFormat.createFormatterForPattern(DateTimeFormat.java:687)
	at org.joda.time.format.DateTimeFormat.forPattern(DateTimeFormat.java:177)
	at org.joda.time.format.TestDateTimeFormat.testFormatParse_textMonthAtEnd_France_withSpecifiedDefault(TestDateTimeFormat.java:978)

testFormatParse_textAdjoiningHelloWorld_UK(org.joda.time.format.TestDateTimeFormat)  Time elapsed: 0 sec  <<< ERROR!
java.lang.IllegalArgumentException: Field type must not be null
	at org.joda.time.format.DateTimeFormatterBuilder.appendShortText(DateTimeFormatterBuilder.java:108)
	at org.joda.time.format.DateTimeFormatterBuilder.appendMonthOfYearShortText(DateTimeFormatterBuilder.java:146)
	at org.joda.time.format.TestDateTimeFormat.testFormatParse_textAdjoiningHelloWorld_UK(TestDateTimeFormat.java:1111)

testFormatParse_textAdjoiningMonthDOW_UK(org.joda.time.format.TestDateTimeFormat)  Time elapsed: 0 sec  <<< ERROR!
java.lang.IllegalArgumentException: Field type must not be null
	at org.joda.time.format.DateTimeFormatterBuilder.appendShortText(DateTimeFormatterBuilder.java:108)
	at org.joda.time.format.DateTimeFormatterBuilder.appendMonthOfYearShortText(DateTimeFormatterBuilder.java:146)
	at org.joda.time.format.TestDateTimeFormat.testFormatParse_textAdjoiningMonthDOW_UK(TestDateTimeFormat.java:1125)

testFormat_dayOfWeekShortText(org.joda.time.format.TestDateTimeFormat)  Time elapsed: 0 sec  <<< ERROR!
java.lang.IllegalArgumentException: Field type must not be null
	at org.joda.time.format.DateTimeFormatterBuilder.appendShortText(DateTimeFormatterBuilder.java:108)
	at org.joda.time.format.DateTimeFormatterBuilder.appendDayOfWeekShortText(DateTimeFormatterBuilder.java:144)
	at org.joda.time.format.DateTimeFormat.parsePatternTo(DateTimeFormat.java:530)
	at org.joda.time.format.DateTimeFormat.createFormatterForPattern(DateTimeFormat.java:687)
	at org.joda.time.format.DateTimeFormat.forPattern(DateTimeFormat.java:177)
	at org.joda.time.format.TestDateTimeFormat.testFormat_dayOfWeekShortText(TestDateTimeFormat.java:524)

testFormat_monthOfYearShortText(org.joda.time.format.TestDateTimeFormat)  Time elapsed: 0.001 sec  <<< ERROR!
java.lang.IllegalArgumentException: Field type must not be null
	at org.joda.time.format.DateTimeFormatterBuilder.appendShortText(DateTimeFormatterBuilder.java:108)
	at org.joda.time.format.DateTimeFormatterBuilder.appendMonthOfYearShortText(DateTimeFormatterBuilder.java:146)
	at org.joda.time.format.DateTimeFormat.parsePatternTo(DateTimeFormat.java:490)
	at org.joda.time.format.DateTimeFormat.createFormatterForPattern(DateTimeFormat.java:687)
	at org.joda.time.format.DateTimeFormat.forPattern(DateTimeFormat.java:177)
	at org.joda.time.format.TestDateTimeFormat.testFormat_monthOfYearShortText(TestDateTimeFormat.java:582)

testForStyle_mediumDate(org.joda.time.format.TestDateTimeFormatStyle)  Time elapsed: 0.001 sec  <<< ERROR!
java.lang.IllegalArgumentException: Field type must not be null
	at org.joda.time.format.DateTimeFormatterBuilder.appendShortText(DateTimeFormatterBuilder.java:108)
	at org.joda.time.format.DateTimeFormatterBuilder.appendMonthOfYearShortText(DateTimeFormatterBuilder.java:146)
	at org.joda.time.format.DateTimeFormat.parsePatternTo(DateTimeFormat.java:490)
	at org.joda.time.format.DateTimeFormat.createFormatterForPattern(DateTimeFormat.java:687)
	at org.joda.time.format.DateTimeFormat.forPattern(DateTimeFormat.java:177)
	at org.joda.time.format.DateTimeFormat$StyleFormatter.getFormatter(DateTimeFormat.java:833)
	at org.joda.time.format.DateTimeFormat$StyleFormatter.printTo(DateTimeFormat.java:810)
	at org.joda.time.format.DateTimeFormatter.printTo(DateTimeFormatter.java:684)
	at org.joda.time.format.DateTimeFormatter.printTo(DateTimeFormatter.java:521)
	at org.joda.time.format.DateTimeFormatter.print(DateTimeFormatter.java:625)
	at org.joda.time.format.TestDateTimeFormatStyle.testForStyle_mediumDate(TestDateTimeFormatStyle.java:189)

testForStyle_mediumDateTime(org.joda.time.format.TestDateTimeFormatStyle)  Time elapsed: 0.001 sec  <<< ERROR!
java.lang.IllegalArgumentException: Field type must not be null
	at org.joda.time.format.DateTimeFormatterBuilder.appendShortText(DateTimeFormatterBuilder.java:108)
	at org.joda.time.format.DateTimeFormatterBuilder.appendMonthOfYearShortText(DateTimeFormatterBuilder.java:146)
	at org.joda.time.format.DateTimeFormat.parsePatternTo(DateTimeFormat.java:490)
	at org.joda.time.format.DateTimeFormat.createFormatterForPattern(DateTimeFormat.java:687)
	at org.joda.time.format.DateTimeFormat.forPattern(DateTimeFormat.java:177)
	at org.joda.time.format.DateTimeFormat$StyleFormatter.getFormatter(DateTimeFormat.java:833)
	at org.joda.time.format.DateTimeFormat$StyleFormatter.printTo(DateTimeFormat.java:810)
	at org.joda.time.format.DateTimeFormatter.printTo(DateTimeFormatter.java:684)
	at org.joda.time.format.DateTimeFormatter.printTo(DateTimeFormatter.java:521)
	at org.joda.time.format.DateTimeFormatter.print(DateTimeFormatter.java:625)
	at org.joda.time.format.TestDateTimeFormatStyle.testForStyle_mediumDateTime(TestDateTimeFormatStyle.java:215)

testForStyle_mediumShortDateTime(org.joda.time.format.TestDateTimeFormatStyle)  Time elapsed: 0 sec  <<< ERROR!
java.lang.IllegalArgumentException: Field type must not be null
	at org.joda.time.format.DateTimeFormatterBuilder.appendShortText(DateTimeFormatterBuilder.java:108)
	at org.joda.time.format.DateTimeFormatterBuilder.appendMonthOfYearShortText(DateTimeFormatterBuilder.java:146)
	at org.joda.time.format.DateTimeFormat.parsePatternTo(DateTimeFormat.java:490)
	at org.joda.time.format.DateTimeFormat.createFormatterForPattern(DateTimeFormat.java:687)
	at org.joda.time.format.DateTimeFormat.forPattern(DateTimeFormat.java:177)
	at org.joda.time.format.DateTimeFormat$StyleFormatter.getFormatter(DateTimeFormat.java:833)
	at org.joda.time.format.DateTimeFormat$StyleFormatter.printTo(DateTimeFormat.java:810)
	at org.joda.time.format.DateTimeFormatter.printTo(DateTimeFormatter.java:684)
	at org.joda.time.format.DateTimeFormatter.printTo(DateTimeFormatter.java:521)
	at org.joda.time.format.DateTimeFormatter.print(DateTimeFormatter.java:625)
	at org.joda.time.format.TestDateTimeFormatStyle.testForStyle_mediumShortDateTime(TestDateTimeFormatStyle.java:341)

testForStyle_mediumLongDateTime(org.joda.time.format.TestDateTimeFormatStyle)  Time elapsed: 0.001 sec  <<< ERROR!
java.lang.IllegalArgumentException: Field type must not be null
	at org.joda.time.format.DateTimeFormatterBuilder.appendShortText(DateTimeFormatterBuilder.java:108)
	at org.joda.time.format.DateTimeFormatterBuilder.appendMonthOfYearShortText(DateTimeFormatterBuilder.java:146)
	at org.joda.time.format.DateTimeFormat.parsePatternTo(DateTimeFormat.java:490)
	at org.joda.time.format.DateTimeFormat.createFormatterForPattern(DateTimeFormat.java:687)
	at org.joda.time.format.DateTimeFormat.forPattern(DateTimeFormat.java:177)
	at org.joda.time.format.DateTimeFormat$StyleFormatter.getFormatter(DateTimeFormat.java:833)
	at org.joda.time.format.DateTimeFormat$StyleFormatter.printTo(DateTimeFormat.java:810)
	at org.joda.time.format.DateTimeFormatter.printTo(DateTimeFormatter.java:684)
	at org.joda.time.format.DateTimeFormatter.printTo(DateTimeFormatter.java:521)
	at org.joda.time.format.DateTimeFormatter.print(DateTimeFormatter.java:625)
	at org.joda.time.format.TestDateTimeFormatStyle.testForStyle_mediumLongDateTime(TestDateTimeFormatStyle.java:352)

testForStyle_mediumFullDateTime(org.joda.time.format.TestDateTimeFormatStyle)  Time elapsed: 0.001 sec  <<< ERROR!
java.lang.IllegalArgumentException: Field type must not be null
	at org.joda.time.format.DateTimeFormatterBuilder.appendShortText(DateTimeFormatterBuilder.java:108)
	at org.joda.time.format.DateTimeFormatterBuilder.appendMonthOfYearShortText(DateTimeFormatterBuilder.java:146)
	at org.joda.time.format.DateTimeFormat.parsePatternTo(DateTimeFormat.java:490)
	at org.joda.time.format.DateTimeFormat.createFormatterForPattern(DateTimeFormat.java:687)
	at org.joda.time.format.DateTimeFormat.forPattern(DateTimeFormat.java:177)
	at org.joda.time.format.DateTimeFormat$StyleFormatter.getFormatter(DateTimeFormat.java:833)
	at org.joda.time.format.DateTimeFormat$StyleFormatter.printTo(DateTimeFormat.java:810)
	at org.joda.time.format.DateTimeFormatter.printTo(DateTimeFormatter.java:684)
	at org.joda.time.format.DateTimeFormatter.printTo(DateTimeFormatter.java:521)
	at org.joda.time.format.DateTimeFormatter.print(DateTimeFormatter.java:625)
	at org.joda.time.format.TestDateTimeFormatStyle.testForStyle_mediumFullDateTime(TestDateTimeFormatStyle.java:363)


Results :

Tests in error: 
  org.joda.time.TestDateMidnight_Basics#testToString_String_String IllegalArgumentException
  org.joda.time.TestDateTime_Basics#testToString_String_Locale IllegalArgumentException
  org.joda.time.TestLocalDateTime_Basics#testToString_String_Locale IllegalArgumentException
  org.joda.time.TestLocalDate_Basics#testToString_String_Locale IllegalArgumentException
  org.joda.time.TestMonthDay_Basics#testToString_String_Locale IllegalArgumentException
  org.joda.time.TestMutableDateTime_Basics#testToString_String_String IllegalArgumentException
  org.joda.time.TestYearMonthDay_Basics#testToString_String_Locale IllegalArgumentException
  org.joda.time.TestYearMonth_Basics#testToString_String_Locale IllegalArgumentException
  org.joda.time.format.TestDateTimeFormat#testFormatParse_textAdjoiningHelloWorld_UK IllegalArgumentException
  org.joda.time.format.TestDateTimeFormat#testFormatParse_textAdjoiningMonthDOW_UK IllegalArgumentException
  org.joda.time.format.TestDateTimeFormat#testFormatParse_textMonthApr_France IllegalArgumentException
  org.joda.time.format.TestDateTimeFormat#testFormatParse_textMonthAtEnd_France IllegalArgumentException
  org.joda.time.format.TestDateTimeFormat#testFormatParse_textMonthAtEnd_France_withSpecifiedDefault IllegalArgumentException
  org.joda.time.format.TestDateTimeFormat#testFormatParse_textMonthJanLongLowerCase_UK IllegalArgumentException
  org.joda.time.format.TestDateTimeFormat#testFormatParse_textMonthJanLongUpperCase_UK IllegalArgumentException
  org.joda.time.format.TestDateTimeFormat#testFormatParse_textMonthJanLong_France IllegalArgumentException
  org.joda.time.format.TestDateTimeFormat#testFormatParse_textMonthJanShortLowerCase_UK IllegalArgumentException
  org.joda.time.format.TestDateTimeFormat#testFormatParse_textMonthJanShortUpperCase_UK IllegalArgumentException
  org.joda.time.format.TestDateTimeFormat#testFormatParse_textMonthJanShort_France IllegalArgumentException
  org.joda.time.format.TestDateTimeFormat#testFormatParse_textMonthJanShort_UK IllegalArgumentException
  org.joda.time.format.TestDateTimeFormat#testFormat_dayOfWeekShortText IllegalArgumentException
  org.joda.time.format.TestDateTimeFormat#testFormat_monthOfYearShortText IllegalArgumentException
  org.joda.time.format.TestDateTimeFormat#testParse_textMonthJanLong_UK IllegalArgumentException
  org.joda.time.format.TestDateTimeFormatStyle#testForStyle_mediumDate IllegalArgumentException
  org.joda.time.format.TestDateTimeFormatStyle#testForStyle_mediumDateTime IllegalArgumentException
  org.joda.time.format.TestDateTimeFormatStyle#testForStyle_mediumFullDateTime IllegalArgumentException
  org.joda.time.format.TestDateTimeFormatStyle#testForStyle_mediumLongDateTime IllegalArgumentException
  org.joda.time.format.TestDateTimeFormatStyle#testForStyle_mediumShortDateTime IllegalArgumentException
  org.joda.time.format.TestDateTimeFormatter#testParseDateTime_chrono IllegalArgumentException
  org.joda.time.format.TestDateTimeFormatter#testParseDateTime_offsetParsed IllegalArgumentException
  org.joda.time.format.TestDateTimeFormatter#testParseDateTime_simple IllegalArgumentException
  org.joda.time.format.TestDateTimeFormatter#testParseDateTime_simple_precedence IllegalArgumentException
  org.joda.time.format.TestDateTimeFormatter#testParseDateTime_zone IllegalArgumentException
  org.joda.time.format.TestDateTimeFormatter#testParseDateTime_zone2 IllegalArgumentException
  org.joda.time.format.TestDateTimeFormatter#testParseDateTime_zone3 IllegalArgumentException
  org.joda.time.format.TestDateTimeFormatter#testParseInto_chrono IllegalArgumentException
  org.joda.time.format.TestDateTimeFormatter#testParseInto_monthDay_feb29 IllegalArgumentException
  org.joda.time.format.TestDateTimeFormatter#testParseInto_monthDay_feb29_OfYear IllegalArgumentException
  org.joda.time.format.TestDateTimeFormatter#testParseInto_monthDay_feb29_newYork IllegalArgumentException
  org.joda.time.format.TestDateTimeFormatter#testParseInto_monthDay_feb29_newYork_endOfYear IllegalArgumentException
  org.joda.time.format.TestDateTimeFormatter#testParseInto_monthDay_feb29_newYork_startOfYear IllegalArgumentException
  org.joda.time.format.TestDateTimeFormatter#testParseInto_monthDay_feb29_startOfYear IllegalArgumentException
  org.joda.time.format.TestDateTimeFormatter#testParseInto_monthDay_feb29_tokyo IllegalArgumentException
  org.joda.time.format.TestDateTimeFormatter#testParseInto_monthDay_feb29_tokyo_endOfYear IllegalArgumentException
  org.joda.time.format.TestDateTimeFormatter#testParseInto_monthDay_feb29_tokyo_startOfYear IllegalArgumentException
  org.joda.time.format.TestDateTimeFormatter#testParseInto_monthDay_withDefaultYear_feb29 IllegalArgumentException
  org.joda.time.format.TestDateTimeFormatter#testParseInto_monthDay_withDefaultYear_feb29_newYork IllegalArgumentException
  org.joda.time.format.TestDateTimeFormatter#testParseInto_monthDay_withDefaultYear_feb29_newYork_endOfYear IllegalArgumentException
  org.joda.time.format.TestDateTimeFormatter#testParseInto_monthOnly IllegalArgumentException
  org.joda.time.format.TestDateTimeFormatter#testParseInto_monthOnly_baseEndYear IllegalArgumentException
  org.joda.time.format.TestDateTimeFormatter#testParseInto_monthOnly_baseStartYear IllegalArgumentException
  org.joda.time.format.TestDateTimeFormatter#testParseInto_monthOnly_parseEndYear IllegalArgumentException
  org.joda.time.format.TestDateTimeFormatter#testParseInto_monthOnly_parseStartYear IllegalArgumentException
  org.joda.time.format.TestDateTimeFormatter#testParseInto_offsetParsed IllegalArgumentException
  org.joda.time.format.TestDateTimeFormatter#testParseInto_simple IllegalArgumentException
  org.joda.time.format.TestDateTimeFormatter#testParseInto_simple_precedence IllegalArgumentException
  org.joda.time.format.TestDateTimeFormatter#testParseInto_zone IllegalArgumentException
  org.joda.time.format.TestDateTimeFormatter#testParseInto_zone2 IllegalArgumentException
  org.joda.time.format.TestDateTimeFormatter#testParseInto_zone3 IllegalArgumentException
  org.joda.time.format.TestDateTimeFormatter#testParseLocalDateTime_monthDay_feb29 IllegalArgumentException
  org.joda.time.format.TestDateTimeFormatter#testParseLocalDateTime_monthDay_withDefaultYear_feb29 IllegalArgumentException
  org.joda.time.format.TestDateTimeFormatter#testParseLocalDateTime_simple IllegalArgumentException
  org.joda.time.format.TestDateTimeFormatter#testParseLocalDate_monthDay_feb29 IllegalArgumentException
  org.joda.time.format.TestDateTimeFormatter#testParseLocalDate_monthDay_withDefaultYear_feb29 IllegalArgumentException
  org.joda.time.format.TestDateTimeFormatter#testParseLocalDate_simple IllegalArgumentException
  org.joda.time.format.TestDateTimeFormatter#testParseLocalDate_weekyear_month_week_2010 IllegalArgumentException
  org.joda.time.format.TestDateTimeFormatter#testParseLocalDate_weekyear_month_week_2011 IllegalArgumentException
  org.joda.time.format.TestDateTimeFormatter#testParseLocalDate_weekyear_month_week_2012 IllegalArgumentException
  org.joda.time.format.TestDateTimeFormatter#testParseLocalDate_yearOfCentury IllegalArgumentException
  org.joda.time.format.TestDateTimeFormatter#testParseLocalDate_yearOfEra IllegalArgumentException
  org.joda.time.format.TestDateTimeFormatter#testParseLocalDate_year_month_week_2010 IllegalArgumentException
  org.joda.time.format.TestDateTimeFormatter#testParseLocalDate_year_month_week_2011 IllegalArgumentException
  org.joda.time.format.TestDateTimeFormatter#testParseLocalDate_year_month_week_2012 IllegalArgumentException
  org.joda.time.format.TestDateTimeFormatter#testParseLocalDate_year_month_week_2013 IllegalArgumentException
  org.joda.time.format.TestDateTimeFormatter#testParseLocalDate_year_month_week_2014 IllegalArgumentException
  org.joda.time.format.TestDateTimeFormatter#testParseLocalDate_year_month_week_2015 IllegalArgumentException
  org.joda.time.format.TestDateTimeFormatter#testParseLocalDate_year_month_week_2016 IllegalArgumentException
  org.joda.time.format.TestDateTimeFormatter#testParseLocalTime_simple IllegalArgumentException
  org.joda.time.format.TestDateTimeFormatter#testParseMillis_fractionOfSecondLong IllegalArgumentException
  org.joda.time.format.TestDateTimeFormatter#testParseMutableDateTime_chrono IllegalArgumentException
  org.joda.time.format.TestDateTimeFormatter#testParseMutableDateTime_offsetParsed IllegalArgumentException
  org.joda.time.format.TestDateTimeFormatter#testParseMutableDateTime_simple IllegalArgumentException
  org.joda.time.format.TestDateTimeFormatter#testParseMutableDateTime_simple_precedence IllegalArgumentException
  org.joda.time.format.TestDateTimeFormatter#testParseMutableDateTime_zone IllegalArgumentException
  org.joda.time.format.TestDateTimeFormatter#testParseMutableDateTime_zone2 IllegalArgumentException
  org.joda.time.format.TestDateTimeFormatter#testParseMutableDateTime_zone3 IllegalArgumentException
  org.joda.time.format.TestDateTimeFormatter#testPrint_appendableMethods IllegalArgumentException
  org.joda.time.format.TestDateTimeFormatter#testPrint_bufferMethods IllegalArgumentException
  org.joda.time.format.TestDateTimeFormatter#testPrint_chrono IllegalArgumentException
  org.joda.time.format.TestDateTimeFormatter#testPrint_chrono_and_zone IllegalArgumentException
  org.joda.time.format.TestDateTimeFormatter#testPrint_locale IllegalArgumentException
  org.joda.time.format.TestDateTimeFormatter#testPrint_simple IllegalArgumentException
  org.joda.time.format.TestDateTimeFormatter#testPrint_writerMethods IllegalArgumentException
  org.joda.time.format.TestDateTimeFormatter#testPrint_zone IllegalArgumentException
  org.joda.time.format.TestDateTimeFormatter#testPrinterParserMethods IllegalArgumentException
  org.joda.time.format.TestDateTimeFormatter#testWithGetChronology IllegalArgumentException
  org.joda.time.format.TestDateTimeFormatter#testWithGetLocale IllegalArgumentException
  org.joda.time.format.TestDateTimeFormatter#testWithGetOffsetParsedMethods IllegalArgumentException
  org.joda.time.format.TestDateTimeFormatter#testWithGetPivotYear IllegalArgumentException
  org.joda.time.format.TestDateTimeFormatter#testWithGetZone IllegalArgumentException
  org.joda.time.format.TestDateTimeFormatter#testZoneNameNearTransition IllegalArgumentException
  org.joda.time.format.TestDateTimeFormatter#testZoneShortNameNearTransition IllegalArgumentException

Tests run: 4157, Failures: 0, Errors: 102, Skipped: 0

[INFO] ------------------------------------------------------------------------
[INFO] BUILD FAILURE
[INFO] ------------------------------------------------------------------------
[INFO] Total time: 16.554s
[INFO] Finished at: Thu Aug 06 08:08:05 BST 2015
[INFO] Final Memory: 9M/210M
[INFO] ------------------------------------------------------------------------
[ERROR] Failed to execute goal org.apache.maven.plugins:maven-surefire-plugin:2.18.1:test (default-test) on project joda-time: There are test failures.
[ERROR] 
[ERROR] Please refer to /home/perham/Study/LittleDarwin/Cases/joda-time-2.8.1/target/surefire-reports for the individual test results.
[ERROR] -> [Help 1]
[ERROR] 
[ERROR] To see the full stack trace of the errors, re-run Maven with the -e switch.
[ERROR] Re-run Maven using the -X switch to enable full debug logging.
[ERROR] 
[ERROR] For more information about the errors and possible solutions, please read the following articles:
[ERROR] [Help 1] http://cwiki.apache.org/confluence/display/MAVEN/MojoFailureException
