[INFO] Scanning for projects...
[INFO]                                                                         
[INFO] ------------------------------------------------------------------------
[INFO] Building Joda-Time 2.8.1
[INFO] ------------------------------------------------------------------------
[INFO] 
[INFO] --- maven-resources-plugin:2.7:resources (default-resources) @ joda-time ---
[INFO] Using 'UTF-8' encoding to copy filtered resources.
[INFO] Copying 2 resources to META-INF
[INFO] Copying 10 resources
[INFO] 
[INFO] --- maven-compiler-plugin:3.3:compile (default-compile) @ joda-time ---
[INFO] Changes detected - recompiling the module!
[INFO] Compiling 166 source files to /home/perham/Study/LittleDarwin/Cases/joda-time-2.8.1/target/classes
[INFO] 
[INFO] --- exec-maven-plugin:1.4.0:java (compile-tzdb) @ joda-time ---
Writing zoneinfo files
Writing ZoneInfoMap
[INFO] 
[INFO] --- maven-resources-plugin:2.7:testResources (default-testResources) @ joda-time ---
[INFO] Using 'UTF-8' encoding to copy filtered resources.
[INFO] Copying 34 resources
[INFO] 
[INFO] --- maven-compiler-plugin:3.3:testCompile (default-testCompile) @ joda-time ---
[INFO] Nothing to compile - all classes are up to date
[INFO] 
[INFO] --- maven-surefire-plugin:2.18.1:test (default-test) @ joda-time ---
[INFO] Surefire report directory: /home/perham/Study/LittleDarwin/Cases/joda-time-2.8.1/target/surefire-reports

-------------------------------------------------------
 T E S T S
-------------------------------------------------------
Running org.joda.time.TestAllPackages

TestBuddhistChronology.testCalendar

TestCopticChronology.testCalendar

TestEthiopicChronology.testCalendar

TestIslamicChronology.testCalendar

Testing Gregorian chronology over 1000 iterations
100% complete (i=1000)

Testing Julian chronology over 1000 iterations
100% complete (i=1000)
Writing zoneinfo files
Writing ZoneInfoMap
Tests run: 4157, Failures: 99, Errors: 0, Skipped: 0, Time elapsed: 5.393 sec <<< FAILURE! - in org.joda.time.TestAllPackages
testTest(org.joda.time.TestChronology)  Time elapsed: 0.016 sec  <<< FAILURE!
junit.framework.ComparisonFailure: expected:<...2-06-09T00:00:00.000[Z]> but was:<...2-06-09T00:00:00.000[+00:00]>
	at junit.framework.Assert.assertEquals(Assert.java:81)
	at junit.framework.Assert.assertEquals(Assert.java:87)
	at org.joda.time.TestChronology.testTest(TestChronology.java:112)

testTest(org.joda.time.TestInstant_Basics)  Time elapsed: 0.001 sec  <<< FAILURE!
junit.framework.ComparisonFailure: expected:<...2-06-09T00:00:00.000[Z]> but was:<...2-06-09T00:00:00.000[+00:00]>
	at junit.framework.Assert.assertEquals(Assert.java:81)
	at junit.framework.Assert.assertEquals(Assert.java:87)
	at org.joda.time.TestInstant_Basics.testTest(TestInstant_Basics.java:109)

testToString(org.joda.time.TestInstant_Basics)  Time elapsed: 0.002 sec  <<< FAILURE!
junit.framework.ComparisonFailure: expected:<...2-06-09T00:00:00.000[Z]> but was:<...2-06-09T00:00:00.000[+00:00]>
	at junit.framework.Assert.assertEquals(Assert.java:81)
	at junit.framework.Assert.assertEquals(Assert.java:87)
	at org.joda.time.TestInstant_Basics.testToString(TestInstant_Basics.java:384)

testTest(org.joda.time.TestDateTime_Constructors)  Time elapsed: 0.001 sec  <<< FAILURE!
junit.framework.ComparisonFailure: expected:<...2-06-09T00:00:00.000[Z]> but was:<...2-06-09T00:00:00.000[+00:00]>
	at junit.framework.Assert.assertEquals(Assert.java:81)
	at junit.framework.Assert.assertEquals(Assert.java:87)
	at org.joda.time.TestDateTime_Constructors.testTest(TestDateTime_Constructors.java:102)

testTest(org.joda.time.TestDateTime_Basics)  Time elapsed: 0.001 sec  <<< FAILURE!
junit.framework.ComparisonFailure: expected:<...2-06-09T00:00:00.000[Z]> but was:<...2-06-09T00:00:00.000[+00:00]>
	at junit.framework.Assert.assertEquals(Assert.java:81)
	at junit.framework.Assert.assertEquals(Assert.java:87)
	at org.joda.time.TestDateTime_Basics.testTest(TestDateTime_Basics.java:131)

testTest(org.joda.time.TestDateTime_Properties)  Time elapsed: 0.001 sec  <<< FAILURE!
junit.framework.ComparisonFailure: expected:<...2-06-09T00:00:00.000[Z]> but was:<...2-06-09T00:00:00.000[+00:00]>
	at junit.framework.Assert.assertEquals(Assert.java:81)
	at junit.framework.Assert.assertEquals(Assert.java:87)
	at org.joda.time.TestDateTime_Properties.testTest(TestDateTime_Properties.java:100)

testPropertyAddMonthOfYear(org.joda.time.TestDateTime_Properties)  Time elapsed: 0.001 sec  <<< FAILURE!
junit.framework.ComparisonFailure: expected:<...4-12-09T00:00:00.000[Z]> but was:<...4-12-09T00:00:00.000[+00:00]>
	at junit.framework.Assert.assertEquals(Assert.java:81)
	at junit.framework.Assert.assertEquals(Assert.java:87)
	at org.joda.time.TestDateTime_Properties.testPropertyAddMonthOfYear(TestDateTime_Properties.java:401)

testPropertyAddWrapFieldMonthOfYear(org.joda.time.TestDateTime_Properties)  Time elapsed: 0 sec  <<< FAILURE!
junit.framework.ComparisonFailure: expected:<...4-02-09T00:00:00.000[Z]> but was:<...4-02-09T00:00:00.000[+00:00]>
	at junit.framework.Assert.assertEquals(Assert.java:81)
	at junit.framework.Assert.assertEquals(Assert.java:87)
	at org.joda.time.TestDateTime_Properties.testPropertyAddWrapFieldMonthOfYear(TestDateTime_Properties.java:435)

testPropertySetMonthOfYear(org.joda.time.TestDateTime_Properties)  Time elapsed: 0 sec  <<< FAILURE!
junit.framework.ComparisonFailure: expected:<...4-12-09T00:00:00.000[Z]> but was:<...4-12-09T00:00:00.000[+00:00]>
	at junit.framework.Assert.assertEquals(Assert.java:81)
	at junit.framework.Assert.assertEquals(Assert.java:87)
	at org.joda.time.TestDateTime_Properties.testPropertySetMonthOfYear(TestDateTime_Properties.java:461)

testPropertySetTextMonthOfYear(org.joda.time.TestDateTime_Properties)  Time elapsed: 0.001 sec  <<< FAILURE!
junit.framework.ComparisonFailure: expected:<...4-12-09T00:00:00.000[Z]> but was:<...4-12-09T00:00:00.000[+00:00]>
	at junit.framework.Assert.assertEquals(Assert.java:81)
	at junit.framework.Assert.assertEquals(Assert.java:87)
	at org.joda.time.TestDateTime_Properties.testPropertySetTextMonthOfYear(TestDateTime_Properties.java:481)

testPropertyAddDayOfMonth(org.joda.time.TestDateTime_Properties)  Time elapsed: 0.001 sec  <<< FAILURE!
junit.framework.ComparisonFailure: expected:<...4-12-31T00:00:00.000[Z]> but was:<...4-12-31T00:00:00.000[+00:00]>
	at junit.framework.Assert.assertEquals(Assert.java:81)
	at junit.framework.Assert.assertEquals(Assert.java:87)
	at org.joda.time.TestDateTime_Properties.testPropertyAddDayOfMonth(TestDateTime_Properties.java:573)

testPropertyWithMaximumValueMillisOfDayDSTGap(org.joda.time.TestDateTime_Properties)  Time elapsed: 0.001 sec  <<< FAILURE!
junit.framework.ComparisonFailure: expected:<...6-04-17T22:59:59.999[Z]> but was:<...6-04-17T22:59:59.999[+00:00]>
	at junit.framework.Assert.assertEquals(Assert.java:81)
	at junit.framework.Assert.assertEquals(Assert.java:87)
	at org.joda.time.TestDateTime_Properties.testPropertyWithMaximumValueMillisOfDayDSTGap(TestDateTime_Properties.java:651)

testPropertyAddDayOfYear(org.joda.time.TestDateTime_Properties)  Time elapsed: 0.001 sec  <<< FAILURE!
junit.framework.ComparisonFailure: expected:<...4-12-31T00:00:00.000[Z]> but was:<...4-12-31T00:00:00.000[+00:00]>
	at junit.framework.Assert.assertEquals(Assert.java:81)
	at junit.framework.Assert.assertEquals(Assert.java:87)
	at org.joda.time.TestDateTime_Properties.testPropertyAddDayOfYear(TestDateTime_Properties.java:737)

testPropertyAddWrapFieldDayOfYear(org.joda.time.TestDateTime_Properties)  Time elapsed: 0.001 sec  <<< FAILURE!
junit.framework.ComparisonFailure: expected:<...4-12-31T00:00:00.000[Z]> but was:<...4-12-31T00:00:00.000[+00:00]>
	at junit.framework.Assert.assertEquals(Assert.java:81)
	at junit.framework.Assert.assertEquals(Assert.java:87)
	at org.joda.time.TestDateTime_Properties.testPropertyAddWrapFieldDayOfYear(TestDateTime_Properties.java:768)

testPropertySetDayOfYear(org.joda.time.TestDateTime_Properties)  Time elapsed: 0 sec  <<< FAILURE!
junit.framework.ComparisonFailure: expected:<...4-01-12T00:00:00.000[Z]> but was:<...4-01-12T00:00:00.000[+00:00]>
	at junit.framework.Assert.assertEquals(Assert.java:81)
	at junit.framework.Assert.assertEquals(Assert.java:87)
	at org.joda.time.TestDateTime_Properties.testPropertySetDayOfYear(TestDateTime_Properties.java:784)

testPropertySetTextDayOfYear(org.joda.time.TestDateTime_Properties)  Time elapsed: 0.001 sec  <<< FAILURE!
junit.framework.ComparisonFailure: expected:<...4-01-12T00:00:00.000[Z]> but was:<...4-01-12T00:00:00.000[+00:00]>
	at junit.framework.Assert.assertEquals(Assert.java:81)
	at junit.framework.Assert.assertEquals(Assert.java:87)
	at org.joda.time.TestDateTime_Properties.testPropertySetTextDayOfYear(TestDateTime_Properties.java:800)

testPropertyAddWeekOfWeekyear(org.joda.time.TestDateTime_Properties)  Time elapsed: 0 sec  <<< FAILURE!
junit.framework.ComparisonFailure: expected:<...4-12-27T00:00:00.000[Z]> but was:<...4-12-27T00:00:00.000[+00:00]>
	at junit.framework.Assert.assertEquals(Assert.java:81)
	at junit.framework.Assert.assertEquals(Assert.java:87)
	at org.joda.time.TestDateTime_Properties.testPropertyAddWeekOfWeekyear(TestDateTime_Properties.java:878)

testPropertyAddWrapFieldWeekOfWeekyear(org.joda.time.TestDateTime_Properties)  Time elapsed: 0.001 sec  <<< FAILURE!
junit.framework.ComparisonFailure: expected:<...4-12-27T00:00:00.000[Z]> but was:<...4-12-27T00:00:00.000[+00:00]>
	at junit.framework.Assert.assertEquals(Assert.java:81)
	at junit.framework.Assert.assertEquals(Assert.java:87)
	at org.joda.time.TestDateTime_Properties.testPropertyAddWrapFieldWeekOfWeekyear(TestDateTime_Properties.java:897)

testPropertySetWeekOfWeekyear(org.joda.time.TestDateTime_Properties)  Time elapsed: 0 sec  <<< FAILURE!
junit.framework.ComparisonFailure: expected:<...4-01-19T00:00:00.000[Z]> but was:<...4-01-19T00:00:00.000[+00:00]>
	at junit.framework.Assert.assertEquals(Assert.java:81)
	at junit.framework.Assert.assertEquals(Assert.java:87)
	at org.joda.time.TestDateTime_Properties.testPropertySetWeekOfWeekyear(TestDateTime_Properties.java:910)

testPropertySetTextWeekOfWeekyear(org.joda.time.TestDateTime_Properties)  Time elapsed: 0.001 sec  <<< FAILURE!
junit.framework.ComparisonFailure: expected:<...4-01-19T00:00:00.000[Z]> but was:<...4-01-19T00:00:00.000[+00:00]>
	at junit.framework.Assert.assertEquals(Assert.java:81)
	at junit.framework.Assert.assertEquals(Assert.java:87)
	at org.joda.time.TestDateTime_Properties.testPropertySetTextWeekOfWeekyear(TestDateTime_Properties.java:926)

testPropertyAddDayOfWeek(org.joda.time.TestDateTime_Properties)  Time elapsed: 0.001 sec  <<< FAILURE!
junit.framework.ComparisonFailure: expected:<...4-12-31T00:00:00.000[Z]> but was:<...4-12-31T00:00:00.000[+00:00]>
	at junit.framework.Assert.assertEquals(Assert.java:81)
	at junit.framework.Assert.assertEquals(Assert.java:87)
	at org.joda.time.TestDateTime_Properties.testPropertyAddDayOfWeek(TestDateTime_Properties.java:996)

testTest(org.joda.time.TestMutableDateTime_Constructors)  Time elapsed: 0.001 sec  <<< FAILURE!
junit.framework.ComparisonFailure: expected:<...2-06-09T00:00:00.000[Z]> but was:<...2-06-09T00:00:00.000[+00:00]>
	at junit.framework.Assert.assertEquals(Assert.java:81)
	at junit.framework.Assert.assertEquals(Assert.java:87)
	at org.joda.time.TestMutableDateTime_Constructors.testTest(TestMutableDateTime_Constructors.java:102)

testTest(org.joda.time.TestMutableDateTime_Basics)  Time elapsed: 0 sec  <<< FAILURE!
junit.framework.ComparisonFailure: expected:<...2-06-09T00:00:00.000[Z]> but was:<...2-06-09T00:00:00.000[+00:00]>
	at junit.framework.Assert.assertEquals(Assert.java:81)
	at junit.framework.Assert.assertEquals(Assert.java:87)
	at org.joda.time.TestMutableDateTime_Basics.testTest(TestMutableDateTime_Basics.java:115)

testTest(org.joda.time.TestMutableDateTime_Sets)  Time elapsed: 0.001 sec  <<< FAILURE!
junit.framework.ComparisonFailure: expected:<...2-06-09T00:00:00.000[Z]> but was:<...2-06-09T00:00:00.000[+00:00]>
	at junit.framework.Assert.assertEquals(Assert.java:81)
	at junit.framework.Assert.assertEquals(Assert.java:87)
	at org.joda.time.TestMutableDateTime_Sets.testTest(TestMutableDateTime_Sets.java:103)

testSetDayOfYear_int1(org.joda.time.TestMutableDateTime_Sets)  Time elapsed: 0.001 sec  <<< FAILURE!
junit.framework.ComparisonFailure: expected:<...2-01-03T05:06:07.008[Z]> but was:<...2-01-03T05:06:07.008[+00:00]>
	at junit.framework.Assert.assertEquals(Assert.java:81)
	at junit.framework.Assert.assertEquals(Assert.java:87)
	at org.joda.time.TestMutableDateTime_Sets.testSetDayOfYear_int1(TestMutableDateTime_Sets.java:489)

testSetWeekOfWeekyear_int1(org.joda.time.TestMutableDateTime_Sets)  Time elapsed: 0.001 sec  <<< FAILURE!
junit.framework.ComparisonFailure: expected:<...2-01-13T05:06:07.008[Z]> but was:<...2-01-13T05:06:07.008[+00:00]>
	at junit.framework.Assert.assertEquals(Assert.java:81)
	at junit.framework.Assert.assertEquals(Assert.java:87)
	at org.joda.time.TestMutableDateTime_Sets.testSetWeekOfWeekyear_int1(TestMutableDateTime_Sets.java:527)

testSetMonthOfYear_int1(org.joda.time.TestMutableDateTime_Sets)  Time elapsed: 0.001 sec  <<< FAILURE!
junit.framework.ComparisonFailure: expected:<...2-12-09T05:06:07.008[Z]> but was:<...2-12-09T05:06:07.008[+00:00]>
	at junit.framework.Assert.assertEquals(Assert.java:81)
	at junit.framework.Assert.assertEquals(Assert.java:87)
	at org.joda.time.TestMutableDateTime_Sets.testSetMonthOfYear_int1(TestMutableDateTime_Sets.java:427)

testTest(org.joda.time.TestMutableDateTime_Adds)  Time elapsed: 0.001 sec  <<< FAILURE!
junit.framework.ComparisonFailure: expected:<...2-06-09T00:00:00.000[Z]> but was:<...2-06-09T00:00:00.000[+00:00]>
	at junit.framework.Assert.assertEquals(Assert.java:81)
	at junit.framework.Assert.assertEquals(Assert.java:87)
	at org.joda.time.TestMutableDateTime_Adds.testTest(TestMutableDateTime_Adds.java:100)

testAddWeeks_int1(org.joda.time.TestMutableDateTime_Adds)  Time elapsed: 0.002 sec  <<< FAILURE!
junit.framework.ComparisonFailure: expected:<...2-01-13T05:06:07.008[Z]> but was:<...2-01-13T05:06:07.008[+00:00]>
	at junit.framework.Assert.assertEquals(Assert.java:81)
	at junit.framework.Assert.assertEquals(Assert.java:87)
	at org.joda.time.TestMutableDateTime_Adds.testAddWeeks_int1(TestMutableDateTime_Adds.java:285)

testAddMonths_int1(org.joda.time.TestMutableDateTime_Adds)  Time elapsed: 0 sec  <<< FAILURE!
junit.framework.ComparisonFailure: expected:<...2-12-09T05:06:07.008[Z]> but was:<...2-12-09T05:06:07.008[+00:00]>
	at junit.framework.Assert.assertEquals(Assert.java:81)
	at junit.framework.Assert.assertEquals(Assert.java:87)
	at org.joda.time.TestMutableDateTime_Adds.testAddMonths_int1(TestMutableDateTime_Adds.java:234)

testTest(org.joda.time.TestMutableDateTime_Properties)  Time elapsed: 0.001 sec  <<< FAILURE!
junit.framework.ComparisonFailure: expected:<...2-06-09T00:00:00.000[Z]> but was:<...2-06-09T00:00:00.000[+00:00]>
	at junit.framework.Assert.assertEquals(Assert.java:81)
	at junit.framework.Assert.assertEquals(Assert.java:87)
	at org.joda.time.TestMutableDateTime_Properties.testTest(TestMutableDateTime_Properties.java:93)

testPropertyAddMonthOfYear(org.joda.time.TestMutableDateTime_Properties)  Time elapsed: 0 sec  <<< FAILURE!
junit.framework.ComparisonFailure: expected:<...4-12-09T00:00:00.000[Z]> but was:<...4-12-09T00:00:00.000[+00:00]>
	at junit.framework.Assert.assertEquals(Assert.java:81)
	at junit.framework.Assert.assertEquals(Assert.java:87)
	at org.joda.time.TestMutableDateTime_Properties.testPropertyAddMonthOfYear(TestMutableDateTime_Properties.java:262)

testPropertyAddWrapFieldMonthOfYear(org.joda.time.TestMutableDateTime_Properties)  Time elapsed: 0 sec  <<< FAILURE!
junit.framework.ComparisonFailure: expected:<...4-02-09T00:00:00.000[Z]> but was:<...4-02-09T00:00:00.000[+00:00]>
	at junit.framework.Assert.assertEquals(Assert.java:81)
	at junit.framework.Assert.assertEquals(Assert.java:87)
	at org.joda.time.TestMutableDateTime_Properties.testPropertyAddWrapFieldMonthOfYear(TestMutableDateTime_Properties.java:268)

testPropertySetMonthOfYear(org.joda.time.TestMutableDateTime_Properties)  Time elapsed: 0 sec  <<< FAILURE!
junit.framework.ComparisonFailure: expected:<...4-12-09T00:00:00.000[Z]> but was:<...4-12-09T00:00:00.000[+00:00]>
	at junit.framework.Assert.assertEquals(Assert.java:81)
	at junit.framework.Assert.assertEquals(Assert.java:87)
	at org.joda.time.TestMutableDateTime_Properties.testPropertySetMonthOfYear(TestMutableDateTime_Properties.java:274)

testPropertySetTextMonthOfYear(org.joda.time.TestMutableDateTime_Properties)  Time elapsed: 0.002 sec  <<< FAILURE!
junit.framework.ComparisonFailure: expected:<...4-12-09T00:00:00.000[Z]> but was:<...4-12-09T00:00:00.000[+00:00]>
	at junit.framework.Assert.assertEquals(Assert.java:81)
	at junit.framework.Assert.assertEquals(Assert.java:87)
	at org.joda.time.TestMutableDateTime_Properties.testPropertySetTextMonthOfYear(TestMutableDateTime_Properties.java:280)

testPropertyAddWrapFieldDayOfYear(org.joda.time.TestMutableDateTime_Properties)  Time elapsed: 0 sec  <<< FAILURE!
junit.framework.ComparisonFailure: expected:<...4-01-01T00:00:00.000[Z]> but was:<...4-01-01T00:00:00.000[+00:00]>
	at junit.framework.Assert.assertEquals(Assert.java:81)
	at junit.framework.Assert.assertEquals(Assert.java:87)
	at org.joda.time.TestMutableDateTime_Properties.testPropertyAddWrapFieldDayOfYear(TestMutableDateTime_Properties.java:369)

testPropertySetDayOfYear(org.joda.time.TestMutableDateTime_Properties)  Time elapsed: 0 sec  <<< FAILURE!
junit.framework.ComparisonFailure: expected:<...4-01-12T00:00:00.000[Z]> but was:<...4-01-12T00:00:00.000[+00:00]>
	at junit.framework.Assert.assertEquals(Assert.java:81)
	at junit.framework.Assert.assertEquals(Assert.java:87)
	at org.joda.time.TestMutableDateTime_Properties.testPropertySetDayOfYear(TestMutableDateTime_Properties.java:375)

testPropertySetTextDayOfYear(org.joda.time.TestMutableDateTime_Properties)  Time elapsed: 0.001 sec  <<< FAILURE!
junit.framework.ComparisonFailure: expected:<...4-01-12T00:00:00.000[Z]> but was:<...4-01-12T00:00:00.000[+00:00]>
	at junit.framework.Assert.assertEquals(Assert.java:81)
	at junit.framework.Assert.assertEquals(Assert.java:87)
	at org.joda.time.TestMutableDateTime_Properties.testPropertySetTextDayOfYear(TestMutableDateTime_Properties.java:381)

testPropertyAddWrapFieldWeekOfWeekyear(org.joda.time.TestMutableDateTime_Properties)  Time elapsed: 0.001 sec  <<< FAILURE!
junit.framework.ComparisonFailure: expected:<...3-12-29T00:00:00.000[Z]> but was:<...3-12-29T00:00:00.000[+00:00]>
	at junit.framework.Assert.assertEquals(Assert.java:81)
	at junit.framework.Assert.assertEquals(Assert.java:87)
	at org.joda.time.TestMutableDateTime_Properties.testPropertyAddWrapFieldWeekOfWeekyear(TestMutableDateTime_Properties.java:426)

testPropertySetWeekOfWeekyear(org.joda.time.TestMutableDateTime_Properties)  Time elapsed: 0 sec  <<< FAILURE!
junit.framework.ComparisonFailure: expected:<...4-01-19T00:00:00.000[Z]> but was:<...4-01-19T00:00:00.000[+00:00]>
	at junit.framework.Assert.assertEquals(Assert.java:81)
	at junit.framework.Assert.assertEquals(Assert.java:87)
	at org.joda.time.TestMutableDateTime_Properties.testPropertySetWeekOfWeekyear(TestMutableDateTime_Properties.java:432)

testPropertySetTextWeekOfWeekyear(org.joda.time.TestMutableDateTime_Properties)  Time elapsed: 0.001 sec  <<< FAILURE!
junit.framework.ComparisonFailure: expected:<...4-01-19T00:00:00.000[Z]> but was:<...4-01-19T00:00:00.000[+00:00]>
	at junit.framework.Assert.assertEquals(Assert.java:81)
	at junit.framework.Assert.assertEquals(Assert.java:87)
	at org.joda.time.TestMutableDateTime_Properties.testPropertySetTextWeekOfWeekyear(TestMutableDateTime_Properties.java:438)

testTest(org.joda.time.TestDateMidnight_Constructors)  Time elapsed: 0.001 sec  <<< FAILURE!
junit.framework.ComparisonFailure: expected:<...2-06-09T00:00:00.000[Z]> but was:<...2-06-09T00:00:00.000[+00:00]>
	at junit.framework.Assert.assertEquals(Assert.java:81)
	at junit.framework.Assert.assertEquals(Assert.java:87)
	at org.joda.time.TestDateMidnight_Constructors.testTest(TestDateMidnight_Constructors.java:116)

testTest(org.joda.time.TestDateMidnight_Basics)  Time elapsed: 0.001 sec  <<< FAILURE!
junit.framework.ComparisonFailure: expected:<...2-06-09T00:00:00.000[Z]> but was:<...2-06-09T00:00:00.000[+00:00]>
	at junit.framework.Assert.assertEquals(Assert.java:81)
	at junit.framework.Assert.assertEquals(Assert.java:87)
	at org.joda.time.TestDateMidnight_Basics.testTest(TestDateMidnight_Basics.java:146)

testTest(org.joda.time.TestDateMidnight_Properties)  Time elapsed: 0 sec  <<< FAILURE!
junit.framework.ComparisonFailure: expected:<...2-06-09T00:00:00.000[Z]> but was:<...2-06-09T00:00:00.000[+00:00]>
	at junit.framework.Assert.assertEquals(Assert.java:81)
	at junit.framework.Assert.assertEquals(Assert.java:87)
	at org.joda.time.TestDateMidnight_Properties.testTest(TestDateMidnight_Properties.java:101)

testTest(org.joda.time.TestDuration_Basics)  Time elapsed: 0 sec  <<< FAILURE!
junit.framework.ComparisonFailure: expected:<...2-06-09T00:00:00.000[Z]> but was:<...2-06-09T00:00:00.000[+00:00]>
	at junit.framework.Assert.assertEquals(Assert.java:81)
	at junit.framework.Assert.assertEquals(Assert.java:87)
	at org.joda.time.TestDuration_Basics.testTest(TestDuration_Basics.java:106)

testTest(org.joda.time.TestInterval_Basics)  Time elapsed: 0 sec  <<< FAILURE!
junit.framework.ComparisonFailure: expected:<...2-06-09T00:00:00.000[Z]> but was:<...2-06-09T00:00:00.000[+00:00]>
	at junit.framework.Assert.assertEquals(Assert.java:81)
	at junit.framework.Assert.assertEquals(Assert.java:87)
	at org.joda.time.TestInterval_Basics.testTest(TestInterval_Basics.java:116)

testToString(org.joda.time.TestInterval_Basics)  Time elapsed: 0 sec  <<< FAILURE!
junit.framework.ComparisonFailure: expected:<...4-06-09T07:08:09.010[Z/2005-08-13T12:14:16.018Z]> but was:<...4-06-09T07:08:09.010[+00:00/2005-08-13T12:14:16.018+00:00]>
	at junit.framework.Assert.assertEquals(Assert.java:81)
	at junit.framework.Assert.assertEquals(Assert.java:87)
	at org.joda.time.TestInterval_Basics.testToString(TestInterval_Basics.java:1046)

testTest(org.joda.time.TestMutableInterval_Constructors)  Time elapsed: 0.001 sec  <<< FAILURE!
junit.framework.ComparisonFailure: expected:<...2-06-09T00:00:00.000[Z]> but was:<...2-06-09T00:00:00.000[+00:00]>
	at junit.framework.Assert.assertEquals(Assert.java:81)
	at junit.framework.Assert.assertEquals(Assert.java:87)
	at org.joda.time.TestMutableInterval_Constructors.testTest(TestMutableInterval_Constructors.java:105)

testTest(org.joda.time.TestMutableInterval_Basics)  Time elapsed: 0.001 sec  <<< FAILURE!
junit.framework.ComparisonFailure: expected:<...2-06-09T00:00:00.000[Z]> but was:<...2-06-09T00:00:00.000[+00:00]>
	at junit.framework.Assert.assertEquals(Assert.java:81)
	at junit.framework.Assert.assertEquals(Assert.java:87)
	at org.joda.time.TestMutableInterval_Basics.testTest(TestMutableInterval_Basics.java:109)

testToString(org.joda.time.TestMutableInterval_Basics)  Time elapsed: 0 sec  <<< FAILURE!
junit.framework.ComparisonFailure: expected:<...4-06-09T07:08:09.010[Z/2005-08-13T12:14:16.018Z]> but was:<...4-06-09T07:08:09.010[+00:00/2005-08-13T12:14:16.018+00:00]>
	at junit.framework.Assert.assertEquals(Assert.java:81)
	at junit.framework.Assert.assertEquals(Assert.java:87)
	at org.joda.time.TestMutableInterval_Basics.testToString(TestMutableInterval_Basics.java:471)

testTest(org.joda.time.TestMutableInterval_Updates)  Time elapsed: 0.001 sec  <<< FAILURE!
junit.framework.ComparisonFailure: expected:<...2-06-09T00:00:00.000[Z]> but was:<...2-06-09T00:00:00.000[+00:00]>
	at junit.framework.Assert.assertEquals(Assert.java:81)
	at junit.framework.Assert.assertEquals(Assert.java:87)
	at org.joda.time.TestMutableInterval_Updates.testTest(TestMutableInterval_Updates.java:102)

testTest(org.joda.time.TestPeriod_Basics)  Time elapsed: 0.007 sec  <<< FAILURE!
junit.framework.ComparisonFailure: expected:<...2-06-09T00:00:00.000[Z]> but was:<...2-06-09T00:00:00.000[+00:00]>
	at junit.framework.Assert.assertEquals(Assert.java:81)
	at junit.framework.Assert.assertEquals(Assert.java:87)
	at org.joda.time.TestPeriod_Basics.testTest(TestPeriod_Basics.java:109)

testTest(org.joda.time.TestMutablePeriod_Basics)  Time elapsed: 0 sec  <<< FAILURE!
junit.framework.ComparisonFailure: expected:<...2-06-09T00:00:00.000[Z]> but was:<...2-06-09T00:00:00.000[+00:00]>
	at junit.framework.Assert.assertEquals(Assert.java:81)
	at junit.framework.Assert.assertEquals(Assert.java:87)
	at org.joda.time.TestMutablePeriod_Basics.testTest(TestMutablePeriod_Basics.java:105)

testTest(org.joda.time.TestMutablePeriod_Updates)  Time elapsed: 0.001 sec  <<< FAILURE!
junit.framework.ComparisonFailure: expected:<...2-06-09T00:00:00.000[Z]> but was:<...2-06-09T00:00:00.000[+00:00]>
	at junit.framework.Assert.assertEquals(Assert.java:81)
	at junit.framework.Assert.assertEquals(Assert.java:87)
	at org.joda.time.TestMutablePeriod_Updates.testTest(TestMutablePeriod_Updates.java:101)

testTest(org.joda.time.TestDateTimeUtils)  Time elapsed: 0.001 sec  <<< FAILURE!
junit.framework.ComparisonFailure: expected:<...2-06-09T00:00:00.000[Z]> but was:<...2-06-09T00:00:00.000[+00:00]>
	at junit.framework.Assert.assertEquals(Assert.java:81)
	at junit.framework.Assert.assertEquals(Assert.java:87)
	at org.joda.time.TestDateTimeUtils.testTest(TestDateTimeUtils.java:140)

test_DateTime_withZoneRetainFields_Gaza(org.joda.time.TestDateTimeZoneCutover)  Time elapsed: 0 sec  <<< FAILURE!
junit.framework.ComparisonFailure: expected:<...7-04-01T00:00:00.000[Z]> but was:<...7-04-01T00:00:00.000[+00:00]>
	at junit.framework.Assert.assertEquals(Assert.java:81)
	at junit.framework.Assert.assertEquals(Assert.java:87)
	at org.joda.time.TestDateTimeZoneCutover.test_DateTime_withZoneRetainFields_Gaza(TestDateTimeZoneCutover.java:200)

test_MutableDateTime_withZoneRetainFields_Gaza(org.joda.time.TestDateTimeZoneCutover)  Time elapsed: 0.001 sec  <<< FAILURE!
junit.framework.ComparisonFailure: expected:<...7-04-01T00:00:00.000[Z]> but was:<...7-04-01T00:00:00.000[+00:00]>
	at junit.framework.Assert.assertEquals(Assert.java:81)
	at junit.framework.Assert.assertEquals(Assert.java:87)
	at org.joda.time.TestDateTimeZoneCutover.test_MutableDateTime_withZoneRetainFields_Gaza(TestDateTimeZoneCutover.java:208)

test_DateTime_withZoneRetainFields_Turk(org.joda.time.TestDateTimeZoneCutover)  Time elapsed: 0.001 sec  <<< FAILURE!
junit.framework.ComparisonFailure: expected:<...7-04-01T00:00:00.000[Z]> but was:<...7-04-01T00:00:00.000[+00:00]>
	at junit.framework.Assert.assertEquals(Assert.java:81)
	at junit.framework.Assert.assertEquals(Assert.java:87)
	at org.joda.time.TestDateTimeZoneCutover.test_DateTime_withZoneRetainFields_Turk(TestDateTimeZoneCutover.java:417)

test_MutableDateTime_setZoneRetainFields_Turk(org.joda.time.TestDateTimeZoneCutover)  Time elapsed: 0.001 sec  <<< FAILURE!
junit.framework.ComparisonFailure: expected:<...7-04-01T00:00:00.000[Z]> but was:<...7-04-01T00:00:00.000[+00:00]>
	at junit.framework.Assert.assertEquals(Assert.java:81)
	at junit.framework.Assert.assertEquals(Assert.java:87)
	at org.joda.time.TestDateTimeZoneCutover.test_MutableDateTime_setZoneRetainFields_Turk(TestDateTimeZoneCutover.java:425)

testDateTimeCreation_london(org.joda.time.TestDateTimeZoneCutover)  Time elapsed: 0.001 sec  <<< FAILURE!
junit.framework.ComparisonFailure: expected:<...1-10-30T01:15:00.000[Z]> but was:<...1-10-30T01:15:00.000[+00:00]>
	at junit.framework.Assert.assertEquals(Assert.java:81)
	at junit.framework.Assert.assertEquals(Assert.java:87)
	at org.joda.time.TestDateTimeZoneCutover.testDateTimeCreation_london(TestDateTimeZoneCutover.java:1334)

testTest(org.joda.time.TestPeriodType)  Time elapsed: 0.001 sec  <<< FAILURE!
junit.framework.ComparisonFailure: expected:<...2-06-09T00:00:00.000[Z]> but was:<...2-06-09T00:00:00.000[+00:00]>
	at junit.framework.Assert.assertEquals(Assert.java:81)
	at junit.framework.Assert.assertEquals(Assert.java:87)
	at org.joda.time.TestPeriodType.testTest(TestPeriodType.java:103)

testTest(org.joda.time.TestSerialization)  Time elapsed: 0 sec  <<< FAILURE!
junit.framework.ComparisonFailure: expected:<...2-06-09T00:00:00.000[Z]> but was:<...2-06-09T00:00:00.000[+00:00]>
	at junit.framework.Assert.assertEquals(Assert.java:81)
	at junit.framework.Assert.assertEquals(Assert.java:87)
	at org.joda.time.TestSerialization.testTest(TestSerialization.java:122)

testToString(org.joda.time.chrono.TestGJChronology)  Time elapsed: 0.001 sec  <<< FAILURE!
junit.framework.ComparisonFailure: expected:<...0-01-01T00:00:00.001[Z],mdfw=2]> but was:<...0-01-01T00:00:00.001[+00:00],mdfw=2]>
	at junit.framework.Assert.assertEquals(Assert.java:81)
	at junit.framework.Assert.assertEquals(Assert.java:87)
	at org.joda.time.chrono.TestGJChronology.testToString(TestGJChronology.java:195)

test_setMonthOfYear(org.joda.time.chrono.TestLenientChronology)  Time elapsed: 0.001 sec  <<< FAILURE!
junit.framework.ComparisonFailure: expected:<...7-01-01T00:00:00.000[Z]> but was:<...7-01-01T00:00:00.000[+00:00]>
	at junit.framework.Assert.assertEquals(Assert.java:81)
	at junit.framework.Assert.assertEquals(Assert.java:87)
	at org.joda.time.chrono.TestLenientChronology.test_setMonthOfYear(TestLenientChronology.java:63)

test_setDayOfMonth(org.joda.time.chrono.TestLenientChronology)  Time elapsed: 0.001 sec  <<< FAILURE!
junit.framework.ComparisonFailure: expected:<...7-01-01T00:00:00.000[Z]> but was:<...7-01-01T00:00:00.000[+00:00]>
	at junit.framework.Assert.assertEquals(Assert.java:81)
	at junit.framework.Assert.assertEquals(Assert.java:87)
	at org.joda.time.chrono.TestLenientChronology.test_setDayOfMonth(TestLenientChronology.java:74)

test_setHourOfDay(org.joda.time.chrono.TestLenientChronology)  Time elapsed: 0.001 sec  <<< FAILURE!
junit.framework.ComparisonFailure: expected:<...7-01-01T00:00:00.000[Z]> but was:<...7-01-01T00:00:00.000[+00:00]>
	at junit.framework.Assert.assertEquals(Assert.java:81)
	at junit.framework.Assert.assertEquals(Assert.java:87)
	at org.joda.time.chrono.TestLenientChronology.test_setHourOfDay(TestLenientChronology.java:85)

test_setYear(org.joda.time.chrono.TestLenientChronology)  Time elapsed: 0.001 sec  <<< FAILURE!
junit.framework.ComparisonFailure: expected:<...7-01-01T00:00:00.000[Z]> but was:<...7-01-01T00:00:00.000[+00:00]>
	at junit.framework.Assert.assertEquals(Assert.java:81)
	at junit.framework.Assert.assertEquals(Assert.java:87)
	at org.joda.time.chrono.TestLenientChronology.test_setYear(TestLenientChronology.java:54)

testPrint_simple(org.joda.time.format.TestDateTimeFormatter)  Time elapsed: 0 sec  <<< FAILURE!
junit.framework.ComparisonFailure: expected:<... 2004-06-09T10:20:30[Z]> but was:<... 2004-06-09T10:20:30[+00:00]>
	at junit.framework.Assert.assertEquals(Assert.java:81)
	at junit.framework.Assert.assertEquals(Assert.java:87)
	at org.joda.time.format.TestDateTimeFormatter.testPrint_simple(TestDateTimeFormatter.java:112)

testPrint_locale(org.joda.time.format.TestDateTimeFormatter)  Time elapsed: 0.001 sec  <<< FAILURE!
junit.framework.ComparisonFailure: expected:<... 2004-06-09T10:20:30[Z]> but was:<... 2004-06-09T10:20:30[+00:00]>
	at junit.framework.Assert.assertEquals(Assert.java:81)
	at junit.framework.Assert.assertEquals(Assert.java:87)
	at org.joda.time.format.TestDateTimeFormatter.testPrint_locale(TestDateTimeFormatter.java:127)

testPrint_zone(org.joda.time.format.TestDateTimeFormatter)  Time elapsed: 0 sec  <<< FAILURE!
junit.framework.ComparisonFailure: expected:<... 2004-06-09T10:20:30[Z]> but was:<... 2004-06-09T10:20:30[+00:00]>
	at junit.framework.Assert.assertEquals(Assert.java:81)
	at junit.framework.Assert.assertEquals(Assert.java:87)
	at org.joda.time.format.TestDateTimeFormatter.testPrint_zone(TestDateTimeFormatter.java:136)

testPrint_chrono(org.joda.time.format.TestDateTimeFormatter)  Time elapsed: 0.001 sec  <<< FAILURE!
junit.framework.ComparisonFailure: expected:<... 2004-06-09T10:20:30[Z]> but was:<... 2004-06-09T10:20:30[+00:00]>
	at junit.framework.Assert.assertEquals(Assert.java:81)
	at junit.framework.Assert.assertEquals(Assert.java:87)
	at org.joda.time.format.TestDateTimeFormatter.testPrint_chrono(TestDateTimeFormatter.java:150)

testPrint_bufferMethods(org.joda.time.format.TestDateTimeFormatter)  Time elapsed: 0 sec  <<< FAILURE!
junit.framework.ComparisonFailure: expected:<... 2004-06-09T10:20:30[Z]> but was:<... 2004-06-09T10:20:30[+00:00]>
	at junit.framework.Assert.assertEquals(Assert.java:81)
	at junit.framework.Assert.assertEquals(Assert.java:87)
	at org.joda.time.format.TestDateTimeFormatter.testPrint_bufferMethods(TestDateTimeFormatter.java:164)

testPrint_writerMethods(org.joda.time.format.TestDateTimeFormatter)  Time elapsed: 0.006 sec  <<< FAILURE!
junit.framework.ComparisonFailure: expected:<... 2004-06-09T10:20:30[Z]> but was:<... 2004-06-09T10:20:30[+00:00]>
	at junit.framework.Assert.assertEquals(Assert.java:81)
	at junit.framework.Assert.assertEquals(Assert.java:87)
	at org.joda.time.format.TestDateTimeFormatter.testPrint_writerMethods(TestDateTimeFormatter.java:186)

testPrint_appendableMethods(org.joda.time.format.TestDateTimeFormatter)  Time elapsed: 0 sec  <<< FAILURE!
junit.framework.ComparisonFailure: expected:<... 2004-06-09T10:20:30[Z]> but was:<... 2004-06-09T10:20:30[+00:00]>
	at junit.framework.Assert.assertEquals(Assert.java:81)
	at junit.framework.Assert.assertEquals(Assert.java:87)
	at org.joda.time.format.TestDateTimeFormatter.testPrint_appendableMethods(TestDateTimeFormatter.java:208)

testPrint_chrono_and_zone(org.joda.time.format.TestDateTimeFormatter)  Time elapsed: 0 sec  <<< FAILURE!
junit.framework.ComparisonFailure: expected:<... 2004-06-09T10:20:30[Z]> but was:<... 2004-06-09T10:20:30[+00:00]>
	at junit.framework.Assert.assertEquals(Assert.java:81)
	at junit.framework.Assert.assertEquals(Assert.java:87)
	at org.joda.time.format.TestDateTimeFormatter.testPrint_chrono_and_zone(TestDateTimeFormatter.java:228)

testFormatParse_zoneId_noColon(org.joda.time.format.TestDateTimeFormat)  Time elapsed: 0.001 sec  <<< FAILURE!
junit.framework.ComparisonFailure: expected:<01:02 [+0000]> but was:<01:02 [null]>
	at junit.framework.Assert.assertEquals(Assert.java:81)
	at junit.framework.Assert.assertEquals(Assert.java:87)
	at org.joda.time.format.TestDateTimeFormat.testFormatParse_zoneId_noColon(TestDateTimeFormat.java:1142)

testFormatParse_zoneId_colon(org.joda.time.format.TestDateTimeFormat)  Time elapsed: 0 sec  <<< FAILURE!
junit.framework.ComparisonFailure: expected:<01:02 [+00:00]> but was:<01:02 [null]>
	at junit.framework.Assert.assertEquals(Assert.java:81)
	at junit.framework.Assert.assertEquals(Assert.java:87)
	at org.joda.time.format.TestDateTimeFormat.testFormatParse_zoneId_colon(TestDateTimeFormat.java:1158)

testFormat_zoneAmount(org.joda.time.format.TestDateTimeFormat)  Time elapsed: 0 sec  <<< FAILURE!
junit.framework.ComparisonFailure: 2004-06-09T10:20:30.040+00:00 expected:<[+0000]> but was:<[null]>
	at junit.framework.Assert.assertEquals(Assert.java:81)
	at org.joda.time.format.TestDateTimeFormat.testFormat_zoneAmount(TestDateTimeFormat.java:782)

testFormat_zoneAmountColon(org.joda.time.format.TestDateTimeFormat)  Time elapsed: 0.001 sec  <<< FAILURE!
junit.framework.ComparisonFailure: 2004-06-09T10:20:30.040+00:00 expected:<[+00:00]> but was:<[null]>
	at junit.framework.Assert.assertEquals(Assert.java:81)
	at org.joda.time.format.TestDateTimeFormat.testFormat_zoneAmountColon(TestDateTimeFormat.java:794)

testFormat_basicOrdinalDateTimeNoMillis(org.joda.time.format.TestISODateTimeFormat)  Time elapsed: 0 sec  <<< FAILURE!
junit.framework.ComparisonFailure: expected:<2004161T102030[Z]> but was:<2004161T102030[+0000]>
	at junit.framework.Assert.assertEquals(Assert.java:81)
	at junit.framework.Assert.assertEquals(Assert.java:87)
	at org.joda.time.format.TestISODateTimeFormat.testFormat_basicOrdinalDateTimeNoMillis(TestISODateTimeFormat.java:376)

testFormat_basicWeekDateTime(org.joda.time.format.TestISODateTimeFormat)  Time elapsed: 0 sec  <<< FAILURE!
junit.framework.ComparisonFailure: expected:<2004W243T102030.040[Z]> but was:<2004W243T102030.040[+0000]>
	at junit.framework.Assert.assertEquals(Assert.java:81)
	at junit.framework.Assert.assertEquals(Assert.java:87)
	at org.joda.time.format.TestISODateTimeFormat.testFormat_basicWeekDateTime(TestISODateTimeFormat.java:398)

testFormat_basicWeekDateTimeNoMillis(org.joda.time.format.TestISODateTimeFormat)  Time elapsed: 0.001 sec  <<< FAILURE!
junit.framework.ComparisonFailure: expected:<2004W243T102030[Z]> but was:<2004W243T102030[+0000]>
	at junit.framework.Assert.assertEquals(Assert.java:81)
	at junit.framework.Assert.assertEquals(Assert.java:87)
	at org.joda.time.format.TestISODateTimeFormat.testFormat_basicWeekDateTimeNoMillis(TestISODateTimeFormat.java:409)

testFormat_tTime(org.joda.time.format.TestISODateTimeFormat)  Time elapsed: 0.001 sec  <<< FAILURE!
junit.framework.ComparisonFailure: expected:<T10:20:30.040[Z]> but was:<T10:20:30.040[+00:00]>
	at junit.framework.Assert.assertEquals(Assert.java:81)
	at junit.framework.Assert.assertEquals(Assert.java:87)
	at org.joda.time.format.TestISODateTimeFormat.testFormat_tTime(TestISODateTimeFormat.java:154)

testFormat_tTimeNoMillis(org.joda.time.format.TestISODateTimeFormat)  Time elapsed: 0 sec  <<< FAILURE!
junit.framework.ComparisonFailure: expected:<T10:20:30[Z]> but was:<T10:20:30[+00:00]>
	at junit.framework.Assert.assertEquals(Assert.java:81)
	at junit.framework.Assert.assertEquals(Assert.java:87)
	at org.joda.time.format.TestISODateTimeFormat.testFormat_tTimeNoMillis(TestISODateTimeFormat.java:165)

testFormat_dateTime(org.joda.time.format.TestISODateTimeFormat)  Time elapsed: 0.001 sec  <<< FAILURE!
junit.framework.ComparisonFailure: expected:<...4-06-09T10:20:30.040[Z]> but was:<...4-06-09T10:20:30.040[+00:00]>
	at junit.framework.Assert.assertEquals(Assert.java:81)
	at junit.framework.Assert.assertEquals(Assert.java:87)
	at org.joda.time.format.TestISODateTimeFormat.testFormat_dateTime(TestISODateTimeFormat.java:176)

testFormat_dateTimeNoMillis(org.joda.time.format.TestISODateTimeFormat)  Time elapsed: 0 sec  <<< FAILURE!
junit.framework.ComparisonFailure: expected:<2004-06-09T10:20:30[Z]> but was:<2004-06-09T10:20:30[+00:00]>
	at junit.framework.Assert.assertEquals(Assert.java:81)
	at junit.framework.Assert.assertEquals(Assert.java:87)
	at org.joda.time.format.TestISODateTimeFormat.testFormat_dateTimeNoMillis(TestISODateTimeFormat.java:199)

testFormat_ordinalDateTime(org.joda.time.format.TestISODateTimeFormat)  Time elapsed: 0.001 sec  <<< FAILURE!
junit.framework.ComparisonFailure: expected:<...004-161T10:20:30.040[Z]> but was:<...004-161T10:20:30.040[+00:00]>
	at junit.framework.Assert.assertEquals(Assert.java:81)
	at junit.framework.Assert.assertEquals(Assert.java:87)
	at org.joda.time.format.TestISODateTimeFormat.testFormat_ordinalDateTime(TestISODateTimeFormat.java:221)

testFormat_ordinalDateTimeNoMillis(org.joda.time.format.TestISODateTimeFormat)  Time elapsed: 0.001 sec  <<< FAILURE!
junit.framework.ComparisonFailure: expected:<2004-161T10:20:30[Z]> but was:<2004-161T10:20:30[+00:00]>
	at junit.framework.Assert.assertEquals(Assert.java:81)
	at junit.framework.Assert.assertEquals(Assert.java:87)
	at org.joda.time.format.TestISODateTimeFormat.testFormat_ordinalDateTimeNoMillis(TestISODateTimeFormat.java:232)

testFormat_weekDateTime(org.joda.time.format.TestISODateTimeFormat)  Time elapsed: 0 sec  <<< FAILURE!
junit.framework.ComparisonFailure: expected:<...4-W24-3T10:20:30.040[Z]> but was:<...4-W24-3T10:20:30.040[+00:00]>
	at junit.framework.Assert.assertEquals(Assert.java:81)
	at junit.framework.Assert.assertEquals(Assert.java:87)
	at org.joda.time.format.TestISODateTimeFormat.testFormat_weekDateTime(TestISODateTimeFormat.java:254)

testFormat_weekDateTimeNoMillis(org.joda.time.format.TestISODateTimeFormat)  Time elapsed: 0 sec  <<< FAILURE!
junit.framework.ComparisonFailure: expected:<2004-W24-3T10:20:30[Z]> but was:<2004-W24-3T10:20:30[+00:00]>
	at junit.framework.Assert.assertEquals(Assert.java:81)
	at junit.framework.Assert.assertEquals(Assert.java:87)
	at org.joda.time.format.TestISODateTimeFormat.testFormat_weekDateTimeNoMillis(TestISODateTimeFormat.java:265)

testFormat_basicTime(org.joda.time.format.TestISODateTimeFormat)  Time elapsed: 0.001 sec  <<< FAILURE!
junit.framework.ComparisonFailure: expected:<102030.040[Z]> but was:<102030.040[+0000]>
	at junit.framework.Assert.assertEquals(Assert.java:81)
	at junit.framework.Assert.assertEquals(Assert.java:87)
	at org.joda.time.format.TestISODateTimeFormat.testFormat_basicTime(TestISODateTimeFormat.java:288)

testFormat_basicTimeNoMillis(org.joda.time.format.TestISODateTimeFormat)  Time elapsed: 0 sec  <<< FAILURE!
junit.framework.ComparisonFailure: expected:<102030[Z]> but was:<102030[+0000]>
	at junit.framework.Assert.assertEquals(Assert.java:81)
	at junit.framework.Assert.assertEquals(Assert.java:87)
	at org.joda.time.format.TestISODateTimeFormat.testFormat_basicTimeNoMillis(TestISODateTimeFormat.java:299)

testFormat_basicTTime(org.joda.time.format.TestISODateTimeFormat)  Time elapsed: 0.001 sec  <<< FAILURE!
junit.framework.ComparisonFailure: expected:<T102030.040[Z]> but was:<T102030.040[+0000]>
	at junit.framework.Assert.assertEquals(Assert.java:81)
	at junit.framework.Assert.assertEquals(Assert.java:87)
	at org.joda.time.format.TestISODateTimeFormat.testFormat_basicTTime(TestISODateTimeFormat.java:310)

testFormat_basicTTimeNoMillis(org.joda.time.format.TestISODateTimeFormat)  Time elapsed: 0 sec  <<< FAILURE!
junit.framework.ComparisonFailure: expected:<T102030[Z]> but was:<T102030[+0000]>
	at junit.framework.Assert.assertEquals(Assert.java:81)
	at junit.framework.Assert.assertEquals(Assert.java:87)
	at org.joda.time.format.TestISODateTimeFormat.testFormat_basicTTimeNoMillis(TestISODateTimeFormat.java:321)

testFormat_basicDateTime(org.joda.time.format.TestISODateTimeFormat)  Time elapsed: 0.001 sec  <<< FAILURE!
junit.framework.ComparisonFailure: expected:<20040609T102030.040[Z]> but was:<20040609T102030.040[+0000]>
	at junit.framework.Assert.assertEquals(Assert.java:81)
	at junit.framework.Assert.assertEquals(Assert.java:87)
	at org.joda.time.format.TestISODateTimeFormat.testFormat_basicDateTime(TestISODateTimeFormat.java:332)

testFormat_basicDateTimeNoMillis(org.joda.time.format.TestISODateTimeFormat)  Time elapsed: 0 sec  <<< FAILURE!
junit.framework.ComparisonFailure: expected:<20040609T102030[Z]> but was:<20040609T102030[+0000]>
	at junit.framework.Assert.assertEquals(Assert.java:81)
	at junit.framework.Assert.assertEquals(Assert.java:87)
	at org.joda.time.format.TestISODateTimeFormat.testFormat_basicDateTimeNoMillis(TestISODateTimeFormat.java:343)

testFormat_basicOrdinalDateTime(org.joda.time.format.TestISODateTimeFormat)  Time elapsed: 0.001 sec  <<< FAILURE!
junit.framework.ComparisonFailure: expected:<2004161T102030.040[Z]> but was:<2004161T102030.040[+0000]>
	at junit.framework.Assert.assertEquals(Assert.java:81)
	at junit.framework.Assert.assertEquals(Assert.java:87)
	at org.joda.time.format.TestISODateTimeFormat.testFormat_basicOrdinalDateTime(TestISODateTimeFormat.java:365)

testFormat_time(org.joda.time.format.TestISODateTimeFormat)  Time elapsed: 0.001 sec  <<< FAILURE!
junit.framework.ComparisonFailure: expected:<10:20:30.040[Z]> but was:<10:20:30.040[+00:00]>
	at junit.framework.Assert.assertEquals(Assert.java:81)
	at junit.framework.Assert.assertEquals(Assert.java:87)
	at org.joda.time.format.TestISODateTimeFormat.testFormat_time(TestISODateTimeFormat.java:116)

testFormat_timeNoMillis(org.joda.time.format.TestISODateTimeFormat)  Time elapsed: 0 sec  <<< FAILURE!
junit.framework.ComparisonFailure: expected:<10:20:30[Z]> but was:<10:20:30[+00:00]>
	at junit.framework.Assert.assertEquals(Assert.java:81)
	at junit.framework.Assert.assertEquals(Assert.java:87)
	at org.joda.time.format.TestISODateTimeFormat.testFormat_timeNoMillis(TestISODateTimeFormat.java:135)


Results :

Failed tests: 
  org.joda.time.TestChronology#testTest ComparisonFailure expected:<...2-06-09T0...
  org.joda.time.TestDateMidnight_Basics#testTest ComparisonFailure expected:<......
  org.joda.time.TestDateMidnight_Constructors#testTest ComparisonFailure expecte...
  org.joda.time.TestDateMidnight_Properties#testTest ComparisonFailure expected:...
  org.joda.time.TestDateTimeUtils#testTest ComparisonFailure expected:<...2-06-0...
  org.joda.time.TestDateTimeZoneCutover#testDateTimeCreation_london ComparisonFailure
  org.joda.time.TestDateTimeZoneCutover#test_DateTime_withZoneRetainFields_Gaza ComparisonFailure
  org.joda.time.TestDateTimeZoneCutover#test_DateTime_withZoneRetainFields_Turk ComparisonFailure
  org.joda.time.TestDateTimeZoneCutover#test_MutableDateTime_setZoneRetainFields_Turk ComparisonFailure
  org.joda.time.TestDateTimeZoneCutover#test_MutableDateTime_withZoneRetainFields_Gaza ComparisonFailure
  org.joda.time.TestDateTime_Basics#testTest ComparisonFailure expected:<...2-06...
  org.joda.time.TestDateTime_Constructors#testTest ComparisonFailure expected:<....
  org.joda.time.TestDateTime_Properties#testPropertyAddDayOfMonth ComparisonFailure
  org.joda.time.TestDateTime_Properties#testPropertyAddDayOfWeek ComparisonFailure
  org.joda.time.TestDateTime_Properties#testPropertyAddDayOfYear ComparisonFailure
  org.joda.time.TestDateTime_Properties#testPropertyAddMonthOfYear ComparisonFailure
  org.joda.time.TestDateTime_Properties#testPropertyAddWeekOfWeekyear ComparisonFailure
  org.joda.time.TestDateTime_Properties#testPropertyAddWrapFieldDayOfYear ComparisonFailure
  org.joda.time.TestDateTime_Properties#testPropertyAddWrapFieldMonthOfYear ComparisonFailure
  org.joda.time.TestDateTime_Properties#testPropertyAddWrapFieldWeekOfWeekyear ComparisonFailure
  org.joda.time.TestDateTime_Properties#testPropertySetDayOfYear ComparisonFailure
  org.joda.time.TestDateTime_Properties#testPropertySetMonthOfYear ComparisonFailure
  org.joda.time.TestDateTime_Properties#testPropertySetTextDayOfYear ComparisonFailure
  org.joda.time.TestDateTime_Properties#testPropertySetTextMonthOfYear ComparisonFailure
  org.joda.time.TestDateTime_Properties#testPropertySetTextWeekOfWeekyear ComparisonFailure
  org.joda.time.TestDateTime_Properties#testPropertySetWeekOfWeekyear ComparisonFailure
  org.joda.time.TestDateTime_Properties#testPropertyWithMaximumValueMillisOfDayDSTGap ComparisonFailure
  org.joda.time.TestDateTime_Properties#testTest ComparisonFailure expected:<......
  org.joda.time.TestDuration_Basics#testTest ComparisonFailure expected:<...2-06...
  org.joda.time.TestInstant_Basics#testTest ComparisonFailure expected:<...2-06-...
  org.joda.time.TestInstant_Basics#testToString ComparisonFailure expected:<...2...
  org.joda.time.TestInterval_Basics#testTest ComparisonFailure expected:<...2-06...
  org.joda.time.TestInterval_Basics#testToString ComparisonFailure expected:<......
  org.joda.time.TestMutableDateTime_Adds#testAddMonths_int1 ComparisonFailure ex...
  org.joda.time.TestMutableDateTime_Adds#testAddWeeks_int1 ComparisonFailure exp...
  org.joda.time.TestMutableDateTime_Adds#testTest ComparisonFailure expected:<.....
  org.joda.time.TestMutableDateTime_Basics#testTest ComparisonFailure expected:<...
  org.joda.time.TestMutableDateTime_Constructors#testTest ComparisonFailure expe...
  org.joda.time.TestMutableDateTime_Properties#testPropertyAddMonthOfYear ComparisonFailure
  org.joda.time.TestMutableDateTime_Properties#testPropertyAddWrapFieldDayOfYear ComparisonFailure
  org.joda.time.TestMutableDateTime_Properties#testPropertyAddWrapFieldMonthOfYear ComparisonFailure
  org.joda.time.TestMutableDateTime_Properties#testPropertyAddWrapFieldWeekOfWeekyear ComparisonFailure
  org.joda.time.TestMutableDateTime_Properties#testPropertySetDayOfYear ComparisonFailure
  org.joda.time.TestMutableDateTime_Properties#testPropertySetMonthOfYear ComparisonFailure
  org.joda.time.TestMutableDateTime_Properties#testPropertySetTextDayOfYear ComparisonFailure
  org.joda.time.TestMutableDateTime_Properties#testPropertySetTextMonthOfYear ComparisonFailure
  org.joda.time.TestMutableDateTime_Properties#testPropertySetTextWeekOfWeekyear ComparisonFailure
  org.joda.time.TestMutableDateTime_Properties#testPropertySetWeekOfWeekyear ComparisonFailure
  org.joda.time.TestMutableDateTime_Properties#testTest ComparisonFailure expect...
  org.joda.time.TestMutableDateTime_Sets#testSetDayOfYear_int1 ComparisonFailure
  org.joda.time.TestMutableDateTime_Sets#testSetMonthOfYear_int1 ComparisonFailure
  org.joda.time.TestMutableDateTime_Sets#testSetWeekOfWeekyear_int1 ComparisonFailure
  org.joda.time.TestMutableDateTime_Sets#testTest ComparisonFailure expected:<.....
  org.joda.time.TestMutableInterval_Basics#testTest ComparisonFailure expected:<...
  org.joda.time.TestMutableInterval_Basics#testToString ComparisonFailure expect...
  org.joda.time.TestMutableInterval_Constructors#testTest ComparisonFailure expe...
  org.joda.time.TestMutableInterval_Updates#testTest ComparisonFailure expected:...
  org.joda.time.TestMutablePeriod_Basics#testTest ComparisonFailure expected:<.....
  org.joda.time.TestMutablePeriod_Updates#testTest ComparisonFailure expected:<....
  org.joda.time.TestPeriodType#testTest ComparisonFailure expected:<...2-06-09T0...
  org.joda.time.TestPeriod_Basics#testTest ComparisonFailure expected:<...2-06-0...
  org.joda.time.TestSerialization#testTest ComparisonFailure expected:<...2-06-0...
  org.joda.time.chrono.TestGJChronology#testToString ComparisonFailure expected:...
  org.joda.time.chrono.TestLenientChronology#test_setDayOfMonth ComparisonFailure
  org.joda.time.chrono.TestLenientChronology#test_setHourOfDay ComparisonFailure
  org.joda.time.chrono.TestLenientChronology#test_setMonthOfYear ComparisonFailure
  org.joda.time.chrono.TestLenientChronology#test_setYear ComparisonFailure expe...
  org.joda.time.format.TestDateTimeFormat#testFormatParse_zoneId_colon ComparisonFailure
  org.joda.time.format.TestDateTimeFormat#testFormatParse_zoneId_noColon ComparisonFailure
  org.joda.time.format.TestDateTimeFormat#testFormat_zoneAmount ComparisonFailure
  org.joda.time.format.TestDateTimeFormat#testFormat_zoneAmountColon ComparisonFailure
  org.joda.time.format.TestDateTimeFormatter#testPrint_appendableMethods ComparisonFailure
  org.joda.time.format.TestDateTimeFormatter#testPrint_bufferMethods ComparisonFailure
  org.joda.time.format.TestDateTimeFormatter#testPrint_chrono ComparisonFailure ...
  org.joda.time.format.TestDateTimeFormatter#testPrint_chrono_and_zone ComparisonFailure
  org.joda.time.format.TestDateTimeFormatter#testPrint_locale ComparisonFailure ...
  org.joda.time.format.TestDateTimeFormatter#testPrint_simple ComparisonFailure ...
  org.joda.time.format.TestDateTimeFormatter#testPrint_writerMethods ComparisonFailure
  org.joda.time.format.TestDateTimeFormatter#testPrint_zone ComparisonFailure ex...
  org.joda.time.format.TestISODateTimeFormat#testFormat_basicDateTime ComparisonFailure
  org.joda.time.format.TestISODateTimeFormat#testFormat_basicDateTimeNoMillis ComparisonFailure
  org.joda.time.format.TestISODateTimeFormat#testFormat_basicOrdinalDateTime ComparisonFailure
  org.joda.time.format.TestISODateTimeFormat#testFormat_basicOrdinalDateTimeNoMillis ComparisonFailure
  org.joda.time.format.TestISODateTimeFormat#testFormat_basicTTime ComparisonFailure
  org.joda.time.format.TestISODateTimeFormat#testFormat_basicTTimeNoMillis ComparisonFailure
  org.joda.time.format.TestISODateTimeFormat#testFormat_basicTime ComparisonFailure
  org.joda.time.format.TestISODateTimeFormat#testFormat_basicTimeNoMillis ComparisonFailure
  org.joda.time.format.TestISODateTimeFormat#testFormat_basicWeekDateTime ComparisonFailure
  org.joda.time.format.TestISODateTimeFormat#testFormat_basicWeekDateTimeNoMillis ComparisonFailure
  org.joda.time.format.TestISODateTimeFormat#testFormat_dateTime ComparisonFailure
  org.joda.time.format.TestISODateTimeFormat#testFormat_dateTimeNoMillis ComparisonFailure
  org.joda.time.format.TestISODateTimeFormat#testFormat_ordinalDateTime ComparisonFailure
  org.joda.time.format.TestISODateTimeFormat#testFormat_ordinalDateTimeNoMillis ComparisonFailure
  org.joda.time.format.TestISODateTimeFormat#testFormat_tTime ComparisonFailure ...
  org.joda.time.format.TestISODateTimeFormat#testFormat_tTimeNoMillis ComparisonFailure
  org.joda.time.format.TestISODateTimeFormat#testFormat_time ComparisonFailure e...
  org.joda.time.format.TestISODateTimeFormat#testFormat_timeNoMillis ComparisonFailure
  org.joda.time.format.TestISODateTimeFormat#testFormat_weekDateTime ComparisonFailure
  org.joda.time.format.TestISODateTimeFormat#testFormat_weekDateTimeNoMillis ComparisonFailure

Tests run: 4157, Failures: 99, Errors: 0, Skipped: 0

[INFO] ------------------------------------------------------------------------
[INFO] BUILD FAILURE
[INFO] ------------------------------------------------------------------------
[INFO] Total time: 16.594s
[INFO] Finished at: Thu Aug 06 07:41:22 BST 2015
[INFO] Final Memory: 8M/216M
[INFO] ------------------------------------------------------------------------
[ERROR] Failed to execute goal org.apache.maven.plugins:maven-surefire-plugin:2.18.1:test (default-test) on project joda-time: There are test failures.
[ERROR] 
[ERROR] Please refer to /home/perham/Study/LittleDarwin/Cases/joda-time-2.8.1/target/surefire-reports for the individual test results.
[ERROR] -> [Help 1]
[ERROR] 
[ERROR] To see the full stack trace of the errors, re-run Maven with the -e switch.
[ERROR] Re-run Maven using the -X switch to enable full debug logging.
[ERROR] 
[ERROR] For more information about the errors and possible solutions, please read the following articles:
[ERROR] [Help 1] http://cwiki.apache.org/confluence/display/MAVEN/MojoFailureException
