[INFO] Scanning for projects...
[INFO]                                                                         
[INFO] ------------------------------------------------------------------------
[INFO] Building Joda-Time 2.8.1
[INFO] ------------------------------------------------------------------------
[INFO] 
[INFO] --- maven-resources-plugin:2.7:resources (default-resources) @ joda-time ---
[INFO] Using 'UTF-8' encoding to copy filtered resources.
[INFO] Copying 2 resources to META-INF
[INFO] Copying 10 resources
[INFO] 
[INFO] --- maven-compiler-plugin:3.3:compile (default-compile) @ joda-time ---
[INFO] Changes detected - recompiling the module!
[INFO] Compiling 166 source files to /home/perham/Study/LittleDarwin/Cases/joda-time-2.8.1/target/classes
[INFO] 
[INFO] --- exec-maven-plugin:1.4.0:java (compile-tzdb) @ joda-time ---
Writing zoneinfo files
Writing ZoneInfoMap
[INFO] 
[INFO] --- maven-resources-plugin:2.7:testResources (default-testResources) @ joda-time ---
[INFO] Using 'UTF-8' encoding to copy filtered resources.
[INFO] Copying 34 resources
[INFO] 
[INFO] --- maven-compiler-plugin:3.3:testCompile (default-testCompile) @ joda-time ---
[INFO] Nothing to compile - all classes are up to date
[INFO] 
[INFO] --- maven-surefire-plugin:2.18.1:test (default-test) @ joda-time ---
[INFO] Surefire report directory: /home/perham/Study/LittleDarwin/Cases/joda-time-2.8.1/target/surefire-reports

-------------------------------------------------------
 T E S T S
-------------------------------------------------------
Running org.joda.time.TestAllPackages

TestBuddhistChronology.testCalendar

TestCopticChronology.testCalendar

TestEthiopicChronology.testCalendar

TestIslamicChronology.testCalendar

Testing Gregorian chronology over 1000 iterations
100% complete (i=1000)

Testing Julian chronology over 1000 iterations
100% complete (i=1000)
Writing zoneinfo files
Writing ZoneInfoMap
Tests run: 4157, Failures: 267, Errors: 0, Skipped: 0, Time elapsed: 5.672 sec <<< FAILURE! - in org.joda.time.TestAllPackages
testToString(org.joda.time.TestDateTime_Basics)  Time elapsed: 0.007 sec  <<< FAILURE!
junit.framework.ComparisonFailure: expected:<...9T01:00:00.000+01:00[]> but was:<...9T01:00:00.000+01:00[:00]>
	at junit.framework.Assert.assertEquals(Assert.java:81)
	at junit.framework.Assert.assertEquals(Assert.java:87)
	at org.joda.time.TestDateTime_Basics.testToString(TestDateTime_Basics.java:504)

testToString_String(org.joda.time.TestDateTime_Basics)  Time elapsed: 0.002 sec  <<< FAILURE!
junit.framework.ComparisonFailure: expected:<...9T01:00:00.000+01:00[]> but was:<...9T01:00:00.000+01:00[:00]>
	at junit.framework.Assert.assertEquals(Assert.java:81)
	at junit.framework.Assert.assertEquals(Assert.java:87)
	at org.joda.time.TestDateTime_Basics.testToString_String(TestDateTime_Basics.java:513)

testToString_String_Locale(org.joda.time.TestDateTime_Basics)  Time elapsed: 0.01 sec  <<< FAILURE!
junit.framework.ComparisonFailure: expected:<...9T01:00:00.000+01:00[]> but was:<...9T01:00:00.000+01:00[:00]>
	at junit.framework.Assert.assertEquals(Assert.java:81)
	at junit.framework.Assert.assertEquals(Assert.java:87)
	at org.joda.time.TestDateTime_Basics.testToString_String_Locale(TestDateTime_Basics.java:520)

testToString_DTFormatter(org.joda.time.TestDateTime_Basics)  Time elapsed: 0.001 sec  <<< FAILURE!
junit.framework.ComparisonFailure: expected:<...9T00:00:00.000+01:00[]> but was:<...9T00:00:00.000+01:00[:00]>
	at junit.framework.Assert.assertEquals(Assert.java:81)
	at junit.framework.Assert.assertEquals(Assert.java:87)
	at org.joda.time.TestDateTime_Basics.testToString_DTFormatter(TestDateTime_Basics.java:529)

testPropertyAddMonthOfYear(org.joda.time.TestDateTime_Properties)  Time elapsed: 0.001 sec  <<< FAILURE!
junit.framework.ComparisonFailure: expected:<...9T00:00:00.000+01:00[]> but was:<...9T00:00:00.000+01:00[:00]>
	at junit.framework.Assert.assertEquals(Assert.java:81)
	at junit.framework.Assert.assertEquals(Assert.java:87)
	at org.joda.time.TestDateTime_Properties.testPropertyAddMonthOfYear(TestDateTime_Properties.java:400)

testPropertyAddWrapFieldMonthOfYear(org.joda.time.TestDateTime_Properties)  Time elapsed: 0.001 sec  <<< FAILURE!
junit.framework.ComparisonFailure: expected:<...9T00:00:00.000+01:00[]> but was:<...9T00:00:00.000+01:00[:00]>
	at junit.framework.Assert.assertEquals(Assert.java:81)
	at junit.framework.Assert.assertEquals(Assert.java:87)
	at org.joda.time.TestDateTime_Properties.testPropertyAddWrapFieldMonthOfYear(TestDateTime_Properties.java:431)

testPropertySetMonthOfYear(org.joda.time.TestDateTime_Properties)  Time elapsed: 0 sec  <<< FAILURE!
junit.framework.ComparisonFailure: expected:<...9T00:00:00.000+01:00[]> but was:<...9T00:00:00.000+01:00[:00]>
	at junit.framework.Assert.assertEquals(Assert.java:81)
	at junit.framework.Assert.assertEquals(Assert.java:87)
	at org.joda.time.TestDateTime_Properties.testPropertySetMonthOfYear(TestDateTime_Properties.java:460)

testPropertySetTextMonthOfYear(org.joda.time.TestDateTime_Properties)  Time elapsed: 0 sec  <<< FAILURE!
junit.framework.ComparisonFailure: expected:<...9T00:00:00.000+01:00[]> but was:<...9T00:00:00.000+01:00[:00]>
	at junit.framework.Assert.assertEquals(Assert.java:81)
	at junit.framework.Assert.assertEquals(Assert.java:87)
	at org.joda.time.TestDateTime_Properties.testPropertySetTextMonthOfYear(TestDateTime_Properties.java:480)

testPropertyAddDayOfMonth(org.joda.time.TestDateTime_Properties)  Time elapsed: 0.001 sec  <<< FAILURE!
junit.framework.ComparisonFailure: expected:<...9T00:00:00.000+01:00[]> but was:<...9T00:00:00.000+01:00[:00]>
	at junit.framework.Assert.assertEquals(Assert.java:81)
	at junit.framework.Assert.assertEquals(Assert.java:87)
	at org.joda.time.TestDateTime_Properties.testPropertyAddDayOfMonth(TestDateTime_Properties.java:557)

testPropertyAddYear(org.joda.time.TestDateTime_Properties)  Time elapsed: 0 sec  <<< FAILURE!
junit.framework.ComparisonFailure: expected:<...9T00:00:00.000+01:00[]> but was:<...9T00:00:00.000+01:00[:00]>
	at junit.framework.Assert.assertEquals(Assert.java:81)
	at junit.framework.Assert.assertEquals(Assert.java:87)
	at org.joda.time.TestDateTime_Properties.testPropertyAddYear(TestDateTime_Properties.java:243)

testPropertyAddWrapFieldYear(org.joda.time.TestDateTime_Properties)  Time elapsed: 0 sec  <<< FAILURE!
junit.framework.ComparisonFailure: expected:<...9T00:00:00.000+01:00[]> but was:<...9T00:00:00.000+01:00[:00]>
	at junit.framework.Assert.assertEquals(Assert.java:81)
	at junit.framework.Assert.assertEquals(Assert.java:87)
	at org.joda.time.TestDateTime_Properties.testPropertyAddWrapFieldYear(TestDateTime_Properties.java:272)

testPropertySetYear(org.joda.time.TestDateTime_Properties)  Time elapsed: 0.001 sec  <<< FAILURE!
junit.framework.ComparisonFailure: expected:<...9T00:00:00.000+01:00[]> but was:<...9T00:00:00.000+01:00[:00]>
	at junit.framework.Assert.assertEquals(Assert.java:81)
	at junit.framework.Assert.assertEquals(Assert.java:87)
	at org.joda.time.TestDateTime_Properties.testPropertySetYear(TestDateTime_Properties.java:288)

testPropertySetTextYear(org.joda.time.TestDateTime_Properties)  Time elapsed: 0.001 sec  <<< FAILURE!
junit.framework.ComparisonFailure: expected:<...9T00:00:00.000+01:00[]> but was:<...9T00:00:00.000+01:00[:00]>
	at junit.framework.Assert.assertEquals(Assert.java:81)
	at junit.framework.Assert.assertEquals(Assert.java:87)
	at org.joda.time.TestDateTime_Properties.testPropertySetTextYear(TestDateTime_Properties.java:295)

testPropertyAddWrapFieldDayOfYear(org.joda.time.TestDateTime_Properties)  Time elapsed: 0 sec  <<< FAILURE!
junit.framework.ComparisonFailure: expected:<...9T00:00:00.000+01:00[]> but was:<...9T00:00:00.000+01:00[:00]>
	at junit.framework.Assert.assertEquals(Assert.java:81)
	at junit.framework.Assert.assertEquals(Assert.java:87)
	at org.joda.time.TestDateTime_Properties.testPropertyAddWrapFieldDayOfYear(TestDateTime_Properties.java:758)

testPropertySetDayOfYear(org.joda.time.TestDateTime_Properties)  Time elapsed: 0 sec  <<< FAILURE!
junit.framework.ComparisonFailure: expected:<...9T00:00:00.000+01:00[]> but was:<...9T00:00:00.000+01:00[:00]>
	at junit.framework.Assert.assertEquals(Assert.java:81)
	at junit.framework.Assert.assertEquals(Assert.java:87)
	at org.joda.time.TestDateTime_Properties.testPropertySetDayOfYear(TestDateTime_Properties.java:783)

testPropertySetTextDayOfYear(org.joda.time.TestDateTime_Properties)  Time elapsed: 0.001 sec  <<< FAILURE!
junit.framework.ComparisonFailure: expected:<...9T00:00:00.000+01:00[]> but was:<...9T00:00:00.000+01:00[:00]>
	at junit.framework.Assert.assertEquals(Assert.java:81)
	at junit.framework.Assert.assertEquals(Assert.java:87)
	at org.joda.time.TestDateTime_Properties.testPropertySetTextDayOfYear(TestDateTime_Properties.java:799)

testPropertyAddWeekOfWeekyear(org.joda.time.TestDateTime_Properties)  Time elapsed: 0.001 sec  <<< FAILURE!
junit.framework.ComparisonFailure: expected:<...7T00:00:00.000+01:00[]> but was:<...7T00:00:00.000+01:00[:00]>
	at junit.framework.Assert.assertEquals(Assert.java:81)
	at junit.framework.Assert.assertEquals(Assert.java:87)
	at org.joda.time.TestDateTime_Properties.testPropertyAddWeekOfWeekyear(TestDateTime_Properties.java:874)

testPropertyAddWrapFieldWeekOfWeekyear(org.joda.time.TestDateTime_Properties)  Time elapsed: 0 sec  <<< FAILURE!
junit.framework.ComparisonFailure: expected:<...7T00:00:00.000+01:00[]> but was:<...7T00:00:00.000+01:00[:00]>
	at junit.framework.Assert.assertEquals(Assert.java:81)
	at junit.framework.Assert.assertEquals(Assert.java:87)
	at org.joda.time.TestDateTime_Properties.testPropertyAddWrapFieldWeekOfWeekyear(TestDateTime_Properties.java:893)

testPropertySetWeekOfWeekyear(org.joda.time.TestDateTime_Properties)  Time elapsed: 0.001 sec  <<< FAILURE!
junit.framework.ComparisonFailure: expected:<...7T00:00:00.000+01:00[]> but was:<...7T00:00:00.000+01:00[:00]>
	at junit.framework.Assert.assertEquals(Assert.java:81)
	at junit.framework.Assert.assertEquals(Assert.java:87)
	at org.joda.time.TestDateTime_Properties.testPropertySetWeekOfWeekyear(TestDateTime_Properties.java:909)

testPropertySetTextWeekOfWeekyear(org.joda.time.TestDateTime_Properties)  Time elapsed: 0.001 sec  <<< FAILURE!
junit.framework.ComparisonFailure: expected:<...7T00:00:00.000+01:00[]> but was:<...7T00:00:00.000+01:00[:00]>
	at junit.framework.Assert.assertEquals(Assert.java:81)
	at junit.framework.Assert.assertEquals(Assert.java:87)
	at org.joda.time.TestDateTime_Properties.testPropertySetTextWeekOfWeekyear(TestDateTime_Properties.java:925)

testPropertyAddDayOfWeek(org.joda.time.TestDateTime_Properties)  Time elapsed: 0.001 sec  <<< FAILURE!
junit.framework.ComparisonFailure: expected:<...9T00:00:00.000+01:00[]> but was:<...9T00:00:00.000+01:00[:00]>
	at junit.framework.Assert.assertEquals(Assert.java:81)
	at junit.framework.Assert.assertEquals(Assert.java:87)
	at org.joda.time.TestDateTime_Properties.testPropertyAddDayOfWeek(TestDateTime_Properties.java:986)

testPropertyAddLongDayOfWeek(org.joda.time.TestDateTime_Properties)  Time elapsed: 0 sec  <<< FAILURE!
junit.framework.ComparisonFailure: expected:<...9T00:00:00.000+01:00[]> but was:<...9T00:00:00.000+01:00[:00]>
	at junit.framework.Assert.assertEquals(Assert.java:81)
	at junit.framework.Assert.assertEquals(Assert.java:87)
	at org.joda.time.TestDateTime_Properties.testPropertyAddLongDayOfWeek(TestDateTime_Properties.java:1017)

testPropertyAddWrapFieldDayOfWeek(org.joda.time.TestDateTime_Properties)  Time elapsed: 0 sec  <<< FAILURE!
junit.framework.ComparisonFailure: expected:<...9T00:00:00.000+01:00[]> but was:<...9T00:00:00.000+01:00[:00]>
	at junit.framework.Assert.assertEquals(Assert.java:81)
	at junit.framework.Assert.assertEquals(Assert.java:87)
	at org.joda.time.TestDateTime_Properties.testPropertyAddWrapFieldDayOfWeek(TestDateTime_Properties.java:1024)

testPropertySetDayOfWeek(org.joda.time.TestDateTime_Properties)  Time elapsed: 0 sec  <<< FAILURE!
junit.framework.ComparisonFailure: expected:<...9T00:00:00.000+01:00[]> but was:<...9T00:00:00.000+01:00[:00]>
	at junit.framework.Assert.assertEquals(Assert.java:81)
	at junit.framework.Assert.assertEquals(Assert.java:87)
	at org.joda.time.TestDateTime_Properties.testPropertySetDayOfWeek(TestDateTime_Properties.java:1042)

testPropertyAddWrapFieldDayOfMonth(org.joda.time.TestDateTime_Properties)  Time elapsed: 0.001 sec  <<< FAILURE!
junit.framework.ComparisonFailure: expected:<...9T00:00:00.000+01:00[]> but was:<...9T00:00:00.000+01:00[:00]>
	at junit.framework.Assert.assertEquals(Assert.java:81)
	at junit.framework.Assert.assertEquals(Assert.java:87)
	at org.joda.time.TestDateTime_Properties.testPropertyAddWrapFieldDayOfMonth(TestDateTime_Properties.java:594)

testPropertySetDayOfMonth(org.joda.time.TestDateTime_Properties)  Time elapsed: 0 sec  <<< FAILURE!
junit.framework.ComparisonFailure: expected:<...9T00:00:00.000+01:00[]> but was:<...9T00:00:00.000+01:00[:00]>
	at junit.framework.Assert.assertEquals(Assert.java:81)
	at junit.framework.Assert.assertEquals(Assert.java:87)
	at org.joda.time.TestDateTime_Properties.testPropertySetDayOfMonth(TestDateTime_Properties.java:620)

testPropertySetTextDayOfMonth(org.joda.time.TestDateTime_Properties)  Time elapsed: 0.001 sec  <<< FAILURE!
junit.framework.ComparisonFailure: expected:<...9T00:00:00.000+01:00[]> but was:<...9T00:00:00.000+01:00[:00]>
	at junit.framework.Assert.assertEquals(Assert.java:81)
	at junit.framework.Assert.assertEquals(Assert.java:87)
	at org.joda.time.TestDateTime_Properties.testPropertySetTextDayOfMonth(TestDateTime_Properties.java:636)

testPropertyWithMaximumValueDayOfMonth(org.joda.time.TestDateTime_Properties)  Time elapsed: 0 sec  <<< FAILURE!
junit.framework.ComparisonFailure: expected:<...9T00:00:00.000+01:00[]> but was:<...9T00:00:00.000+01:00[:00]>
	at junit.framework.Assert.assertEquals(Assert.java:81)
	at junit.framework.Assert.assertEquals(Assert.java:87)
	at org.joda.time.TestDateTime_Properties.testPropertyWithMaximumValueDayOfMonth(TestDateTime_Properties.java:643)

testPropertyWithMinimumValueDayOfMonth(org.joda.time.TestDateTime_Properties)  Time elapsed: 0 sec  <<< FAILURE!
junit.framework.ComparisonFailure: expected:<...9T00:00:00.000+01:00[]> but was:<...9T00:00:00.000+01:00[:00]>
	at junit.framework.Assert.assertEquals(Assert.java:81)
	at junit.framework.Assert.assertEquals(Assert.java:87)
	at org.joda.time.TestDateTime_Properties.testPropertyWithMinimumValueDayOfMonth(TestDateTime_Properties.java:657)

testPropertyWithMinimumValueMillisOfDayDSTGap(org.joda.time.TestDateTime_Properties)  Time elapsed: 0.002 sec  <<< FAILURE!
junit.framework.ComparisonFailure: expected:<...0T01:00:00.000+03:00[]> but was:<...0T01:00:00.000+03:00[:00]>
	at junit.framework.Assert.assertEquals(Assert.java:81)
	at junit.framework.Assert.assertEquals(Assert.java:87)
	at org.joda.time.TestDateTime_Properties.testPropertyWithMinimumValueMillisOfDayDSTGap(TestDateTime_Properties.java:665)

testPropertyAddDayOfYear(org.joda.time.TestDateTime_Properties)  Time elapsed: 0.001 sec  <<< FAILURE!
junit.framework.ComparisonFailure: expected:<...9T00:00:00.000+01:00[]> but was:<...9T00:00:00.000+01:00[:00]>
	at junit.framework.Assert.assertEquals(Assert.java:81)
	at junit.framework.Assert.assertEquals(Assert.java:87)
	at org.joda.time.TestDateTime_Properties.testPropertyAddDayOfYear(TestDateTime_Properties.java:727)

testPropertySetTextDayOfWeek(org.joda.time.TestDateTime_Properties)  Time elapsed: 0 sec  <<< FAILURE!
junit.framework.ComparisonFailure: expected:<...9T00:00:00.000+01:00[]> but was:<...9T00:00:00.000+01:00[:00]>
	at junit.framework.Assert.assertEquals(Assert.java:81)
	at junit.framework.Assert.assertEquals(Assert.java:87)
	at org.joda.time.TestDateTime_Properties.testPropertySetTextDayOfWeek(TestDateTime_Properties.java:1058)

testPropertyRoundFloorHourOfDay(org.joda.time.TestDateTime_Properties)  Time elapsed: 0.001 sec  <<< FAILURE!
junit.framework.ComparisonFailure: expected:<...9T13:00:00.000+01:00[]> but was:<...9T13:00:00.000+01:00[:00]>
	at junit.framework.Assert.assertEquals(Assert.java:81)
	at junit.framework.Assert.assertEquals(Assert.java:87)
	at org.joda.time.TestDateTime_Properties.testPropertyRoundFloorHourOfDay(TestDateTime_Properties.java:1125)

testPropertyRoundCeilingHourOfDay(org.joda.time.TestDateTime_Properties)  Time elapsed: 0 sec  <<< FAILURE!
junit.framework.ComparisonFailure: expected:<...9T14:00:00.000+01:00[]> but was:<...9T14:00:00.000+01:00[:00]>
	at junit.framework.Assert.assertEquals(Assert.java:81)
	at junit.framework.Assert.assertEquals(Assert.java:87)
	at org.joda.time.TestDateTime_Properties.testPropertyRoundCeilingHourOfDay(TestDateTime_Properties.java:1131)

testPropertyRoundHalfFloorHourOfDay(org.joda.time.TestDateTime_Properties)  Time elapsed: 0.001 sec  <<< FAILURE!
junit.framework.ComparisonFailure: expected:<...9T13:00:00.000+01:00[]> but was:<...9T13:00:00.000+01:00[:00]>
	at junit.framework.Assert.assertEquals(Assert.java:81)
	at junit.framework.Assert.assertEquals(Assert.java:87)
	at org.joda.time.TestDateTime_Properties.testPropertyRoundHalfFloorHourOfDay(TestDateTime_Properties.java:1137)

testPropertyRoundHalfCeilingHourOfDay(org.joda.time.TestDateTime_Properties)  Time elapsed: 0.001 sec  <<< FAILURE!
junit.framework.ComparisonFailure: expected:<...9T14:00:00.000+01:00[]> but was:<...9T14:00:00.000+01:00[:00]>
	at junit.framework.Assert.assertEquals(Assert.java:81)
	at junit.framework.Assert.assertEquals(Assert.java:87)
	at org.joda.time.TestDateTime_Properties.testPropertyRoundHalfCeilingHourOfDay(TestDateTime_Properties.java:1151)

testPropertyRoundHalfEvenHourOfDay(org.joda.time.TestDateTime_Properties)  Time elapsed: 0 sec  <<< FAILURE!
junit.framework.ComparisonFailure: expected:<...9T14:00:00.000+01:00[]> but was:<...9T14:00:00.000+01:00[:00]>
	at junit.framework.Assert.assertEquals(Assert.java:81)
	at junit.framework.Assert.assertEquals(Assert.java:87)
	at org.joda.time.TestDateTime_Properties.testPropertyRoundHalfEvenHourOfDay(TestDateTime_Properties.java:1165)

testToString(org.joda.time.TestMutableDateTime_Basics)  Time elapsed: 0.001 sec  <<< FAILURE!
junit.framework.ComparisonFailure: expected:<...9T01:00:00.000+01:00[]> but was:<...9T01:00:00.000+01:00[:00]>
	at junit.framework.Assert.assertEquals(Assert.java:81)
	at junit.framework.Assert.assertEquals(Assert.java:87)
	at org.joda.time.TestMutableDateTime_Basics.testToString(TestMutableDateTime_Basics.java:408)

testToString_String(org.joda.time.TestMutableDateTime_Basics)  Time elapsed: 0 sec  <<< FAILURE!
junit.framework.ComparisonFailure: expected:<...9T01:00:00.000+01:00[]> but was:<...9T01:00:00.000+01:00[:00]>
	at junit.framework.Assert.assertEquals(Assert.java:81)
	at junit.framework.Assert.assertEquals(Assert.java:87)
	at org.joda.time.TestMutableDateTime_Basics.testToString_String(TestMutableDateTime_Basics.java:417)

testToString_DTFormatter(org.joda.time.TestMutableDateTime_Basics)  Time elapsed: 0 sec  <<< FAILURE!
junit.framework.ComparisonFailure: expected:<...9T01:00:00.000+01:00[]> but was:<...9T01:00:00.000+01:00[:00]>
	at junit.framework.Assert.assertEquals(Assert.java:81)
	at junit.framework.Assert.assertEquals(Assert.java:87)
	at org.joda.time.TestMutableDateTime_Basics.testToString_DTFormatter(TestMutableDateTime_Basics.java:432)

testToString_String_String(org.joda.time.TestMutableDateTime_Basics)  Time elapsed: 0 sec  <<< FAILURE!
junit.framework.ComparisonFailure: expected:<...9T01:00:00.000+01:00[]> but was:<...9T01:00:00.000+01:00[:00]>
	at junit.framework.Assert.assertEquals(Assert.java:81)
	at junit.framework.Assert.assertEquals(Assert.java:87)
	at org.joda.time.TestMutableDateTime_Basics.testToString_String_String(TestMutableDateTime_Basics.java:424)

testRounding1(org.joda.time.TestMutableDateTime_Basics)  Time elapsed: 0 sec  <<< FAILURE!
junit.framework.ComparisonFailure: expected:<...9T05:00:00.000+01:00[]> but was:<...9T05:00:00.000+01:00[:00]>
	at junit.framework.Assert.assertEquals(Assert.java:81)
	at junit.framework.Assert.assertEquals(Assert.java:87)
	at org.joda.time.TestMutableDateTime_Basics.testRounding1(TestMutableDateTime_Basics.java:631)

testRounding2(org.joda.time.TestMutableDateTime_Basics)  Time elapsed: 0 sec  <<< FAILURE!
junit.framework.ComparisonFailure: expected:<...9T06:00:00.000+01:00[]> but was:<...9T06:00:00.000+01:00[:00]>
	at junit.framework.Assert.assertEquals(Assert.java:81)
	at junit.framework.Assert.assertEquals(Assert.java:87)
	at org.joda.time.TestMutableDateTime_Basics.testRounding2(TestMutableDateTime_Basics.java:639)

testRounding3(org.joda.time.TestMutableDateTime_Basics)  Time elapsed: 0 sec  <<< FAILURE!
junit.framework.ComparisonFailure: expected:<...9T05:00:00.000+01:00[]> but was:<...9T05:00:00.000+01:00[:00]>
	at junit.framework.Assert.assertEquals(Assert.java:81)
	at junit.framework.Assert.assertEquals(Assert.java:87)
	at org.joda.time.TestMutableDateTime_Basics.testRounding3(TestMutableDateTime_Basics.java:647)

testRounding4(org.joda.time.TestMutableDateTime_Basics)  Time elapsed: 0.001 sec  <<< FAILURE!
junit.framework.ComparisonFailure: expected:<...9T05:00:00.000+01:00[]> but was:<...9T05:00:00.000+01:00[:00]>
	at junit.framework.Assert.assertEquals(Assert.java:81)
	at junit.framework.Assert.assertEquals(Assert.java:87)
	at org.joda.time.TestMutableDateTime_Basics.testRounding4(TestMutableDateTime_Basics.java:659)

testRounding5(org.joda.time.TestMutableDateTime_Basics)  Time elapsed: 0 sec  <<< FAILURE!
junit.framework.ComparisonFailure: expected:<...9T05:00:00.000+01:00[]> but was:<...9T05:00:00.000+01:00[:00]>
	at junit.framework.Assert.assertEquals(Assert.java:81)
	at junit.framework.Assert.assertEquals(Assert.java:87)
	at org.joda.time.TestMutableDateTime_Basics.testRounding5(TestMutableDateTime_Basics.java:671)

testRounding6(org.joda.time.TestMutableDateTime_Basics)  Time elapsed: 0 sec  <<< FAILURE!
junit.framework.ComparisonFailure: expected:<...9T05:06:07.008+01:00[]> but was:<...9T05:06:07.008+01:00[:00]>
	at junit.framework.Assert.assertEquals(Assert.java:81)
	at junit.framework.Assert.assertEquals(Assert.java:87)
	at org.joda.time.TestMutableDateTime_Basics.testRounding6(TestMutableDateTime_Basics.java:687)

testSetYear_int1(org.joda.time.TestMutableDateTime_Sets)  Time elapsed: 0.001 sec  <<< FAILURE!
junit.framework.ComparisonFailure: expected:<...9T05:06:07.008+01:00[]> but was:<...9T05:06:07.008+01:00[:00]>
	at junit.framework.Assert.assertEquals(Assert.java:81)
	at junit.framework.Assert.assertEquals(Assert.java:87)
	at org.joda.time.TestMutableDateTime_Sets.testSetYear_int1(TestMutableDateTime_Sets.java:420)

testSetMonthOfYear_int_dstOverlapSummer_addZero(org.joda.time.TestMutableDateTime_Sets)  Time elapsed: 0.001 sec  <<< FAILURE!
junit.framework.ComparisonFailure: expected:<...0T02:30:00.000+02:00[]> but was:<...0T02:30:00.000+02:00[:00]>
	at junit.framework.Assert.assertEquals(Assert.java:81)
	at junit.framework.Assert.assertEquals(Assert.java:87)
	at org.joda.time.TestMutableDateTime_Sets.testSetMonthOfYear_int_dstOverlapSummer_addZero(TestMutableDateTime_Sets.java:432)

testSetMonthOfYear_int_dstOverlapWinter_addZero(org.joda.time.TestMutableDateTime_Sets)  Time elapsed: 0.006 sec  <<< FAILURE!
junit.framework.ComparisonFailure: expected:<...0T02:30:00.000+01:00[]> but was:<...0T02:30:00.000+01:00[:00]>
	at junit.framework.Assert.assertEquals(Assert.java:81)
	at junit.framework.Assert.assertEquals(Assert.java:87)
	at org.joda.time.TestMutableDateTime_Sets.testSetMonthOfYear_int_dstOverlapWinter_addZero(TestMutableDateTime_Sets.java:440)

testSetMonthOfYear_int2(org.joda.time.TestMutableDateTime_Sets)  Time elapsed: 0 sec  <<< FAILURE!
junit.framework.ComparisonFailure: expected:<...9T05:06:07.008+01:00[]> but was:<...9T05:06:07.008+01:00[:00]>
	at junit.framework.Assert.assertEquals(Assert.java:81)
	at junit.framework.Assert.assertEquals(Assert.java:87)
	at org.joda.time.TestMutableDateTime_Sets.testSetMonthOfYear_int2(TestMutableDateTime_Sets.java:451)

testSetDayOfMonth_int1(org.joda.time.TestMutableDateTime_Sets)  Time elapsed: 0 sec  <<< FAILURE!
junit.framework.ComparisonFailure: expected:<...7T05:06:07.008+01:00[]> but was:<...7T05:06:07.008+01:00[:00]>
	at junit.framework.Assert.assertEquals(Assert.java:81)
	at junit.framework.Assert.assertEquals(Assert.java:87)
	at org.joda.time.TestMutableDateTime_Sets.testSetDayOfMonth_int1(TestMutableDateTime_Sets.java:458)

testSetDayOfMonth_int2(org.joda.time.TestMutableDateTime_Sets)  Time elapsed: 0 sec  <<< FAILURE!
junit.framework.ComparisonFailure: expected:<...9T05:06:07.008+01:00[]> but was:<...9T05:06:07.008+01:00[:00]>
	at junit.framework.Assert.assertEquals(Assert.java:81)
	at junit.framework.Assert.assertEquals(Assert.java:87)
	at org.joda.time.TestMutableDateTime_Sets.testSetDayOfMonth_int2(TestMutableDateTime_Sets.java:467)

testSetDayOfMonth_int_dstOverlapSummer_addZero(org.joda.time.TestMutableDateTime_Sets)  Time elapsed: 0 sec  <<< FAILURE!
junit.framework.ComparisonFailure: expected:<...0T02:30:00.000+02:00[]> but was:<...0T02:30:00.000+02:00[:00]>
	at junit.framework.Assert.assertEquals(Assert.java:81)
	at junit.framework.Assert.assertEquals(Assert.java:87)
	at org.joda.time.TestMutableDateTime_Sets.testSetDayOfMonth_int_dstOverlapSummer_addZero(TestMutableDateTime_Sets.java:472)

testSetDayOfMonth_int_dstOverlapWinter_addZero(org.joda.time.TestMutableDateTime_Sets)  Time elapsed: 0 sec  <<< FAILURE!
junit.framework.ComparisonFailure: expected:<...0T02:30:00.000+01:00[]> but was:<...0T02:30:00.000+01:00[:00]>
	at junit.framework.Assert.assertEquals(Assert.java:81)
	at junit.framework.Assert.assertEquals(Assert.java:87)
	at org.joda.time.TestMutableDateTime_Sets.testSetDayOfMonth_int_dstOverlapWinter_addZero(TestMutableDateTime_Sets.java:480)

testSetDayOfYear_int_dstOverlapSummer_addZero(org.joda.time.TestMutableDateTime_Sets)  Time elapsed: 0 sec  <<< FAILURE!
junit.framework.ComparisonFailure: expected:<...0T02:30:00.000+02:00[]> but was:<...0T02:30:00.000+02:00[:00]>
	at junit.framework.Assert.assertEquals(Assert.java:81)
	at junit.framework.Assert.assertEquals(Assert.java:87)
	at org.joda.time.TestMutableDateTime_Sets.testSetDayOfYear_int_dstOverlapSummer_addZero(TestMutableDateTime_Sets.java:494)

testSetDayOfYear_int_dstOverlapWinter_addZero(org.joda.time.TestMutableDateTime_Sets)  Time elapsed: 0 sec  <<< FAILURE!
junit.framework.ComparisonFailure: expected:<...0T02:30:00.000+01:00[]> but was:<...0T02:30:00.000+01:00[:00]>
	at junit.framework.Assert.assertEquals(Assert.java:81)
	at junit.framework.Assert.assertEquals(Assert.java:87)
	at org.joda.time.TestMutableDateTime_Sets.testSetDayOfYear_int_dstOverlapWinter_addZero(TestMutableDateTime_Sets.java:502)

testSetDayOfYear_int2(org.joda.time.TestMutableDateTime_Sets)  Time elapsed: 0 sec  <<< FAILURE!
junit.framework.ComparisonFailure: expected:<...9T05:06:07.008+01:00[]> but was:<...9T05:06:07.008+01:00[:00]>
	at junit.framework.Assert.assertEquals(Assert.java:81)
	at junit.framework.Assert.assertEquals(Assert.java:87)
	at org.joda.time.TestMutableDateTime_Sets.testSetDayOfYear_int2(TestMutableDateTime_Sets.java:513)

testSetWeekyear_int1(org.joda.time.TestMutableDateTime_Sets)  Time elapsed: 0 sec  <<< FAILURE!
junit.framework.ComparisonFailure: expected:<...0T05:06:07.008+01:00[]> but was:<...0T05:06:07.008+01:00[:00]>
	at junit.framework.Assert.assertEquals(Assert.java:81)
	at junit.framework.Assert.assertEquals(Assert.java:87)
	at org.joda.time.TestMutableDateTime_Sets.testSetWeekyear_int1(TestMutableDateTime_Sets.java:520)

testSetWeekOfWeekyear_int2(org.joda.time.TestMutableDateTime_Sets)  Time elapsed: 0 sec  <<< FAILURE!
junit.framework.ComparisonFailure: expected:<...9T05:06:07.008+01:00[]> but was:<...9T05:06:07.008+01:00[:00]>
	at junit.framework.Assert.assertEquals(Assert.java:81)
	at junit.framework.Assert.assertEquals(Assert.java:87)
	at org.joda.time.TestMutableDateTime_Sets.testSetWeekOfWeekyear_int2(TestMutableDateTime_Sets.java:536)

testSetDayOfWeek_int1(org.joda.time.TestMutableDateTime_Sets)  Time elapsed: 0.001 sec  <<< FAILURE!
junit.framework.ComparisonFailure: expected:<...7T05:06:07.008+01:00[]> but was:<...7T05:06:07.008+01:00[:00]>
	at junit.framework.Assert.assertEquals(Assert.java:81)
	at junit.framework.Assert.assertEquals(Assert.java:87)
	at org.joda.time.TestMutableDateTime_Sets.testSetDayOfWeek_int1(TestMutableDateTime_Sets.java:543)

testSetDayOfWeek_int2(org.joda.time.TestMutableDateTime_Sets)  Time elapsed: 0 sec  <<< FAILURE!
junit.framework.ComparisonFailure: expected:<...9T05:06:07.008+01:00[]> but was:<...9T05:06:07.008+01:00[:00]>
	at junit.framework.Assert.assertEquals(Assert.java:81)
	at junit.framework.Assert.assertEquals(Assert.java:87)
	at org.joda.time.TestMutableDateTime_Sets.testSetDayOfWeek_int2(TestMutableDateTime_Sets.java:552)

testSetHourOfDay_int1(org.joda.time.TestMutableDateTime_Sets)  Time elapsed: 0.001 sec  <<< FAILURE!
junit.framework.ComparisonFailure: expected:<...9T13:06:07.008+01:00[]> but was:<...9T13:06:07.008+01:00[:00]>
	at junit.framework.Assert.assertEquals(Assert.java:81)
	at junit.framework.Assert.assertEquals(Assert.java:87)
	at org.joda.time.TestMutableDateTime_Sets.testSetHourOfDay_int1(TestMutableDateTime_Sets.java:559)

testSetHourOfDay_int2(org.joda.time.TestMutableDateTime_Sets)  Time elapsed: 0 sec  <<< FAILURE!
junit.framework.ComparisonFailure: expected:<...9T05:06:07.008+01:00[]> but was:<...9T05:06:07.008+01:00[:00]>
	at junit.framework.Assert.assertEquals(Assert.java:81)
	at junit.framework.Assert.assertEquals(Assert.java:87)
	at org.joda.time.TestMutableDateTime_Sets.testSetHourOfDay_int2(TestMutableDateTime_Sets.java:568)

testSetMinuteOfHour_int1(org.joda.time.TestMutableDateTime_Sets)  Time elapsed: 0 sec  <<< FAILURE!
junit.framework.ComparisonFailure: expected:<...9T05:13:07.008+01:00[]> but was:<...9T05:13:07.008+01:00[:00]>
	at junit.framework.Assert.assertEquals(Assert.java:81)
	at junit.framework.Assert.assertEquals(Assert.java:87)
	at org.joda.time.TestMutableDateTime_Sets.testSetMinuteOfHour_int1(TestMutableDateTime_Sets.java:575)

testSetMinuteOfHour_int2(org.joda.time.TestMutableDateTime_Sets)  Time elapsed: 0.001 sec  <<< FAILURE!
junit.framework.ComparisonFailure: expected:<...9T05:06:07.008+01:00[]> but was:<...9T05:06:07.008+01:00[:00]>
	at junit.framework.Assert.assertEquals(Assert.java:81)
	at junit.framework.Assert.assertEquals(Assert.java:87)
	at org.joda.time.TestMutableDateTime_Sets.testSetMinuteOfHour_int2(TestMutableDateTime_Sets.java:584)

testSetMinuteOfDay_int1(org.joda.time.TestMutableDateTime_Sets)  Time elapsed: 0 sec  <<< FAILURE!
junit.framework.ComparisonFailure: expected:<...9T00:13:07.008+01:00[]> but was:<...9T00:13:07.008+01:00[:00]>
	at junit.framework.Assert.assertEquals(Assert.java:81)
	at junit.framework.Assert.assertEquals(Assert.java:87)
	at org.joda.time.TestMutableDateTime_Sets.testSetMinuteOfDay_int1(TestMutableDateTime_Sets.java:591)

testSetMinuteOfDay_int2(org.joda.time.TestMutableDateTime_Sets)  Time elapsed: 0.001 sec  <<< FAILURE!
junit.framework.ComparisonFailure: expected:<...9T05:06:07.008+01:00[]> but was:<...9T05:06:07.008+01:00[:00]>
	at junit.framework.Assert.assertEquals(Assert.java:81)
	at junit.framework.Assert.assertEquals(Assert.java:87)
	at org.joda.time.TestMutableDateTime_Sets.testSetMinuteOfDay_int2(TestMutableDateTime_Sets.java:600)

testSetSecondOfMinute_int1(org.joda.time.TestMutableDateTime_Sets)  Time elapsed: 0.001 sec  <<< FAILURE!
junit.framework.ComparisonFailure: expected:<...9T05:06:13.008+01:00[]> but was:<...9T05:06:13.008+01:00[:00]>
	at junit.framework.Assert.assertEquals(Assert.java:81)
	at junit.framework.Assert.assertEquals(Assert.java:87)
	at org.joda.time.TestMutableDateTime_Sets.testSetSecondOfMinute_int1(TestMutableDateTime_Sets.java:607)

testSetSecondOfMinute_int2(org.joda.time.TestMutableDateTime_Sets)  Time elapsed: 0 sec  <<< FAILURE!
junit.framework.ComparisonFailure: expected:<...9T05:06:07.008+01:00[]> but was:<...9T05:06:07.008+01:00[:00]>
	at junit.framework.Assert.assertEquals(Assert.java:81)
	at junit.framework.Assert.assertEquals(Assert.java:87)
	at org.joda.time.TestMutableDateTime_Sets.testSetSecondOfMinute_int2(TestMutableDateTime_Sets.java:616)

testSetSecondOfDay_int1(org.joda.time.TestMutableDateTime_Sets)  Time elapsed: 0.001 sec  <<< FAILURE!
junit.framework.ComparisonFailure: expected:<...9T00:00:13.008+01:00[]> but was:<...9T00:00:13.008+01:00[:00]>
	at junit.framework.Assert.assertEquals(Assert.java:81)
	at junit.framework.Assert.assertEquals(Assert.java:87)
	at org.joda.time.TestMutableDateTime_Sets.testSetSecondOfDay_int1(TestMutableDateTime_Sets.java:623)

testSetSecondOfDay_int2(org.joda.time.TestMutableDateTime_Sets)  Time elapsed: 0 sec  <<< FAILURE!
junit.framework.ComparisonFailure: expected:<...9T05:06:07.008+01:00[]> but was:<...9T05:06:07.008+01:00[:00]>
	at junit.framework.Assert.assertEquals(Assert.java:81)
	at junit.framework.Assert.assertEquals(Assert.java:87)
	at org.joda.time.TestMutableDateTime_Sets.testSetSecondOfDay_int2(TestMutableDateTime_Sets.java:632)

testSetMilliOfSecond_int1(org.joda.time.TestMutableDateTime_Sets)  Time elapsed: 0 sec  <<< FAILURE!
junit.framework.ComparisonFailure: expected:<...9T05:06:07.013+01:00[]> but was:<...9T05:06:07.013+01:00[:00]>
	at junit.framework.Assert.assertEquals(Assert.java:81)
	at junit.framework.Assert.assertEquals(Assert.java:87)
	at org.joda.time.TestMutableDateTime_Sets.testSetMilliOfSecond_int1(TestMutableDateTime_Sets.java:639)

testSetMilliOfSecond_int2(org.joda.time.TestMutableDateTime_Sets)  Time elapsed: 0.001 sec  <<< FAILURE!
junit.framework.ComparisonFailure: expected:<...9T05:06:07.008+01:00[]> but was:<...9T05:06:07.008+01:00[:00]>
	at junit.framework.Assert.assertEquals(Assert.java:81)
	at junit.framework.Assert.assertEquals(Assert.java:87)
	at org.joda.time.TestMutableDateTime_Sets.testSetMilliOfSecond_int2(TestMutableDateTime_Sets.java:648)

testSetMilliOfDay_int1(org.joda.time.TestMutableDateTime_Sets)  Time elapsed: 0 sec  <<< FAILURE!
junit.framework.ComparisonFailure: expected:<...9T00:00:00.013+01:00[]> but was:<...9T00:00:00.013+01:00[:00]>
	at junit.framework.Assert.assertEquals(Assert.java:81)
	at junit.framework.Assert.assertEquals(Assert.java:87)
	at org.joda.time.TestMutableDateTime_Sets.testSetMilliOfDay_int1(TestMutableDateTime_Sets.java:655)

testSetMilliOfDay_int2(org.joda.time.TestMutableDateTime_Sets)  Time elapsed: 0.001 sec  <<< FAILURE!
junit.framework.ComparisonFailure: expected:<...9T05:06:07.008+01:00[]> but was:<...9T05:06:07.008+01:00[:00]>
	at junit.framework.Assert.assertEquals(Assert.java:81)
	at junit.framework.Assert.assertEquals(Assert.java:87)
	at org.joda.time.TestMutableDateTime_Sets.testSetMilliOfDay_int2(TestMutableDateTime_Sets.java:664)

testAdd_RP1(org.joda.time.TestMutableDateTime_Adds)  Time elapsed: 0 sec  <<< FAILURE!
junit.framework.ComparisonFailure: expected:<...9T05:06:07.008+01:00[]> but was:<...9T05:06:07.008+01:00[:00]>
	at junit.framework.Assert.assertEquals(Assert.java:81)
	at junit.framework.Assert.assertEquals(Assert.java:87)
	at org.joda.time.TestMutableDateTime_Adds.testAdd_RP1(TestMutableDateTime_Adds.java:143)

testAdd_DurationFieldType_int_dstOverlapSummer_addZero(org.joda.time.TestMutableDateTime_Adds)  Time elapsed: 0.001 sec  <<< FAILURE!
junit.framework.ComparisonFailure: expected:<...0T02:30:00.000+02:00[]> but was:<...0T02:30:00.000+02:00[:00]>
	at junit.framework.Assert.assertEquals(Assert.java:81)
	at junit.framework.Assert.assertEquals(Assert.java:87)
	at org.joda.time.TestMutableDateTime_Adds.testAdd_DurationFieldType_int_dstOverlapSummer_addZero(TestMutableDateTime_Adds.java:177)

testAdd_DurationFieldType_int_dstOverlapWinter_addZero(org.joda.time.TestMutableDateTime_Adds)  Time elapsed: 0 sec  <<< FAILURE!
junit.framework.ComparisonFailure: expected:<...0T02:30:00.000+01:00[]> but was:<...0T02:30:00.000+01:00[:00]>
	at junit.framework.Assert.assertEquals(Assert.java:81)
	at junit.framework.Assert.assertEquals(Assert.java:87)
	at org.joda.time.TestMutableDateTime_Adds.testAdd_DurationFieldType_int_dstOverlapWinter_addZero(TestMutableDateTime_Adds.java:185)

testAddYears_int1(org.joda.time.TestMutableDateTime_Adds)  Time elapsed: 0.002 sec  <<< FAILURE!
junit.framework.ComparisonFailure: expected:<...9T05:06:07.008+01:00[]> but was:<...9T05:06:07.008+01:00[:00]>
	at junit.framework.Assert.assertEquals(Assert.java:81)
	at junit.framework.Assert.assertEquals(Assert.java:87)
	at org.joda.time.TestMutableDateTime_Adds.testAddYears_int1(TestMutableDateTime_Adds.java:212)

testAddYears_int_dstOverlapSummer_addZero(org.joda.time.TestMutableDateTime_Adds)  Time elapsed: 0 sec  <<< FAILURE!
junit.framework.ComparisonFailure: expected:<...0T02:30:00.000+02:00[]> but was:<...0T02:30:00.000+02:00[:00]>
	at junit.framework.Assert.assertEquals(Assert.java:81)
	at junit.framework.Assert.assertEquals(Assert.java:87)
	at org.joda.time.TestMutableDateTime_Adds.testAddYears_int_dstOverlapSummer_addZero(TestMutableDateTime_Adds.java:217)

testAddYears_int_dstOverlapWinter_addZero(org.joda.time.TestMutableDateTime_Adds)  Time elapsed: 0 sec  <<< FAILURE!
junit.framework.ComparisonFailure: expected:<...0T02:30:00.000+01:00[]> but was:<...0T02:30:00.000+01:00[:00]>
	at junit.framework.Assert.assertEquals(Assert.java:81)
	at junit.framework.Assert.assertEquals(Assert.java:87)
	at org.joda.time.TestMutableDateTime_Adds.testAddYears_int_dstOverlapWinter_addZero(TestMutableDateTime_Adds.java:225)

testAddMonths_int_dstOverlapSummer_addZero(org.joda.time.TestMutableDateTime_Adds)  Time elapsed: 0 sec  <<< FAILURE!
junit.framework.ComparisonFailure: expected:<...0T02:30:00.000+02:00[]> but was:<...0T02:30:00.000+02:00[:00]>
	at junit.framework.Assert.assertEquals(Assert.java:81)
	at junit.framework.Assert.assertEquals(Assert.java:87)
	at org.joda.time.TestMutableDateTime_Adds.testAddMonths_int_dstOverlapSummer_addZero(TestMutableDateTime_Adds.java:239)

testAddMonths_int_dstOverlapWinter_addZero(org.joda.time.TestMutableDateTime_Adds)  Time elapsed: 0.002 sec  <<< FAILURE!
junit.framework.ComparisonFailure: expected:<...0T02:30:00.000+01:00[]> but was:<...0T02:30:00.000+01:00[:00]>
	at junit.framework.Assert.assertEquals(Assert.java:81)
	at junit.framework.Assert.assertEquals(Assert.java:87)
	at org.joda.time.TestMutableDateTime_Adds.testAddMonths_int_dstOverlapWinter_addZero(TestMutableDateTime_Adds.java:247)

testAddDays_int1(org.joda.time.TestMutableDateTime_Adds)  Time elapsed: 0 sec  <<< FAILURE!
junit.framework.ComparisonFailure: expected:<...6T05:06:07.008+01:00[]> but was:<...6T05:06:07.008+01:00[:00]>
	at junit.framework.Assert.assertEquals(Assert.java:81)
	at junit.framework.Assert.assertEquals(Assert.java:87)
	at org.joda.time.TestMutableDateTime_Adds.testAddDays_int1(TestMutableDateTime_Adds.java:256)

testAddDays_int_dstOverlapSummer_addZero(org.joda.time.TestMutableDateTime_Adds)  Time elapsed: 0.001 sec  <<< FAILURE!
junit.framework.ComparisonFailure: expected:<...0T02:30:00.000+02:00[]> but was:<...0T02:30:00.000+02:00[:00]>
	at junit.framework.Assert.assertEquals(Assert.java:81)
	at junit.framework.Assert.assertEquals(Assert.java:87)
	at org.joda.time.TestMutableDateTime_Adds.testAddDays_int_dstOverlapSummer_addZero(TestMutableDateTime_Adds.java:261)

testAddDays_int_dstOverlapWinter_addZero(org.joda.time.TestMutableDateTime_Adds)  Time elapsed: 0.001 sec  <<< FAILURE!
junit.framework.ComparisonFailure: expected:<...0T02:30:00.000+01:00[]> but was:<...0T02:30:00.000+01:00[:00]>
	at junit.framework.Assert.assertEquals(Assert.java:81)
	at junit.framework.Assert.assertEquals(Assert.java:87)
	at org.joda.time.TestMutableDateTime_Adds.testAddDays_int_dstOverlapWinter_addZero(TestMutableDateTime_Adds.java:269)

testAddWeekyears_int1(org.joda.time.TestMutableDateTime_Adds)  Time elapsed: 0.001 sec  <<< FAILURE!
junit.framework.ComparisonFailure: expected:<...0T05:06:07.008+01:00[]> but was:<...0T05:06:07.008+01:00[:00]>
	at junit.framework.Assert.assertEquals(Assert.java:81)
	at junit.framework.Assert.assertEquals(Assert.java:87)
	at org.joda.time.TestMutableDateTime_Adds.testAddWeekyears_int1(TestMutableDateTime_Adds.java:278)

testAddWeeks_int_dstOverlapSummer_addZero(org.joda.time.TestMutableDateTime_Adds)  Time elapsed: 0.001 sec  <<< FAILURE!
junit.framework.ComparisonFailure: expected:<...0T02:30:00.000+02:00[]> but was:<...0T02:30:00.000+02:00[:00]>
	at junit.framework.Assert.assertEquals(Assert.java:81)
	at junit.framework.Assert.assertEquals(Assert.java:87)
	at org.joda.time.TestMutableDateTime_Adds.testAddWeeks_int_dstOverlapSummer_addZero(TestMutableDateTime_Adds.java:290)

testAddWeeks_int_dstOverlapWinter_addZero(org.joda.time.TestMutableDateTime_Adds)  Time elapsed: 0.001 sec  <<< FAILURE!
junit.framework.ComparisonFailure: expected:<...0T02:30:00.000+01:00[]> but was:<...0T02:30:00.000+01:00[:00]>
	at junit.framework.Assert.assertEquals(Assert.java:81)
	at junit.framework.Assert.assertEquals(Assert.java:87)
	at org.joda.time.TestMutableDateTime_Adds.testAddWeeks_int_dstOverlapWinter_addZero(TestMutableDateTime_Adds.java:298)

testAddHours_int1(org.joda.time.TestMutableDateTime_Adds)  Time elapsed: 0.002 sec  <<< FAILURE!
junit.framework.ComparisonFailure: expected:<...9T18:06:07.008+01:00[]> but was:<...9T18:06:07.008+01:00[:00]>
	at junit.framework.Assert.assertEquals(Assert.java:81)
	at junit.framework.Assert.assertEquals(Assert.java:87)
	at org.joda.time.TestMutableDateTime_Adds.testAddHours_int1(TestMutableDateTime_Adds.java:307)

testAddHours_int_dstOverlapSummer_addZero(org.joda.time.TestMutableDateTime_Adds)  Time elapsed: 0 sec  <<< FAILURE!
junit.framework.ComparisonFailure: expected:<...0T02:30:00.000+02:00[]> but was:<...0T02:30:00.000+02:00[:00]>
	at junit.framework.Assert.assertEquals(Assert.java:81)
	at junit.framework.Assert.assertEquals(Assert.java:87)
	at org.joda.time.TestMutableDateTime_Adds.testAddHours_int_dstOverlapSummer_addZero(TestMutableDateTime_Adds.java:312)

testAddHours_int_dstOverlapWinter_addZero(org.joda.time.TestMutableDateTime_Adds)  Time elapsed: 0.001 sec  <<< FAILURE!
junit.framework.ComparisonFailure: expected:<...0T02:30:00.000+01:00[]> but was:<...0T02:30:00.000+01:00[:00]>
	at junit.framework.Assert.assertEquals(Assert.java:81)
	at junit.framework.Assert.assertEquals(Assert.java:87)
	at org.joda.time.TestMutableDateTime_Adds.testAddHours_int_dstOverlapWinter_addZero(TestMutableDateTime_Adds.java:320)

testAddMinutes_int1(org.joda.time.TestMutableDateTime_Adds)  Time elapsed: 0.001 sec  <<< FAILURE!
junit.framework.ComparisonFailure: expected:<...9T05:19:07.008+01:00[]> but was:<...9T05:19:07.008+01:00[:00]>
	at junit.framework.Assert.assertEquals(Assert.java:81)
	at junit.framework.Assert.assertEquals(Assert.java:87)
	at org.joda.time.TestMutableDateTime_Adds.testAddMinutes_int1(TestMutableDateTime_Adds.java:329)

testAddMinutes_int_dstOverlapSummer_addZero(org.joda.time.TestMutableDateTime_Adds)  Time elapsed: 0 sec  <<< FAILURE!
junit.framework.ComparisonFailure: expected:<...0T02:30:00.000+02:00[]> but was:<...0T02:30:00.000+02:00[:00]>
	at junit.framework.Assert.assertEquals(Assert.java:81)
	at junit.framework.Assert.assertEquals(Assert.java:87)
	at org.joda.time.TestMutableDateTime_Adds.testAddMinutes_int_dstOverlapSummer_addZero(TestMutableDateTime_Adds.java:334)

testAddMinutes_int_dstOverlapWinter_addZero(org.joda.time.TestMutableDateTime_Adds)  Time elapsed: 0.001 sec  <<< FAILURE!
junit.framework.ComparisonFailure: expected:<...0T02:30:00.000+01:00[]> but was:<...0T02:30:00.000+01:00[:00]>
	at junit.framework.Assert.assertEquals(Assert.java:81)
	at junit.framework.Assert.assertEquals(Assert.java:87)
	at org.joda.time.TestMutableDateTime_Adds.testAddMinutes_int_dstOverlapWinter_addZero(TestMutableDateTime_Adds.java:342)

testAddSeconds_int1(org.joda.time.TestMutableDateTime_Adds)  Time elapsed: 0 sec  <<< FAILURE!
junit.framework.ComparisonFailure: expected:<...9T05:06:20.008+01:00[]> but was:<...9T05:06:20.008+01:00[:00]>
	at junit.framework.Assert.assertEquals(Assert.java:81)
	at junit.framework.Assert.assertEquals(Assert.java:87)
	at org.joda.time.TestMutableDateTime_Adds.testAddSeconds_int1(TestMutableDateTime_Adds.java:351)

testAddSeconds_int_dstOverlapSummer_addZero(org.joda.time.TestMutableDateTime_Adds)  Time elapsed: 0.001 sec  <<< FAILURE!
junit.framework.ComparisonFailure: expected:<...0T02:30:00.000+02:00[]> but was:<...0T02:30:00.000+02:00[:00]>
	at junit.framework.Assert.assertEquals(Assert.java:81)
	at junit.framework.Assert.assertEquals(Assert.java:87)
	at org.joda.time.TestMutableDateTime_Adds.testAddSeconds_int_dstOverlapSummer_addZero(TestMutableDateTime_Adds.java:356)

testAddSeconds_int_dstOverlapWinter_addZero(org.joda.time.TestMutableDateTime_Adds)  Time elapsed: 0.001 sec  <<< FAILURE!
junit.framework.ComparisonFailure: expected:<...0T02:30:00.000+01:00[]> but was:<...0T02:30:00.000+01:00[:00]>
	at junit.framework.Assert.assertEquals(Assert.java:81)
	at junit.framework.Assert.assertEquals(Assert.java:87)
	at org.joda.time.TestMutableDateTime_Adds.testAddSeconds_int_dstOverlapWinter_addZero(TestMutableDateTime_Adds.java:364)

testAddMillis_int1(org.joda.time.TestMutableDateTime_Adds)  Time elapsed: 0 sec  <<< FAILURE!
junit.framework.ComparisonFailure: expected:<...9T05:06:07.021+01:00[]> but was:<...9T05:06:07.021+01:00[:00]>
	at junit.framework.Assert.assertEquals(Assert.java:81)
	at junit.framework.Assert.assertEquals(Assert.java:87)
	at org.joda.time.TestMutableDateTime_Adds.testAddMillis_int1(TestMutableDateTime_Adds.java:373)

testAddMillis_int_dstOverlapSummer_addZero(org.joda.time.TestMutableDateTime_Adds)  Time elapsed: 0.001 sec  <<< FAILURE!
junit.framework.ComparisonFailure: expected:<...0T02:30:00.000+02:00[]> but was:<...0T02:30:00.000+02:00[:00]>
	at junit.framework.Assert.assertEquals(Assert.java:81)
	at junit.framework.Assert.assertEquals(Assert.java:87)
	at org.joda.time.TestMutableDateTime_Adds.testAddMillis_int_dstOverlapSummer_addZero(TestMutableDateTime_Adds.java:378)

testAddMillis_int_dstOverlapWinter_addZero(org.joda.time.TestMutableDateTime_Adds)  Time elapsed: 0 sec  <<< FAILURE!
junit.framework.ComparisonFailure: expected:<...0T02:30:00.000+01:00[]> but was:<...0T02:30:00.000+01:00[:00]>
	at junit.framework.Assert.assertEquals(Assert.java:81)
	at junit.framework.Assert.assertEquals(Assert.java:87)
	at org.joda.time.TestMutableDateTime_Adds.testAddMillis_int_dstOverlapWinter_addZero(TestMutableDateTime_Adds.java:386)

testPropertyAddDayOfMonth(org.joda.time.TestMutableDateTime_Properties)  Time elapsed: 0.001 sec  <<< FAILURE!
junit.framework.ComparisonFailure: expected:<...8T00:00:00.000+01:00[]> but was:<...8T00:00:00.000+01:00[:00]>
	at junit.framework.Assert.assertEquals(Assert.java:81)
	at junit.framework.Assert.assertEquals(Assert.java:87)
	at org.joda.time.TestMutableDateTime_Properties.testPropertyAddDayOfMonth(TestMutableDateTime_Properties.java:318)

testPropertyAddYear(org.joda.time.TestMutableDateTime_Properties)  Time elapsed: 0.001 sec  <<< FAILURE!
junit.framework.ComparisonFailure: expected:<...9T00:00:00.000+01:00[]> but was:<...9T00:00:00.000+01:00[:00]>
	at junit.framework.Assert.assertEquals(Assert.java:81)
	at junit.framework.Assert.assertEquals(Assert.java:87)
	at org.joda.time.TestMutableDateTime_Properties.testPropertyAddYear(TestMutableDateTime_Properties.java:210)

testPropertyAddWrapFieldYear(org.joda.time.TestMutableDateTime_Properties)  Time elapsed: 0.001 sec  <<< FAILURE!
junit.framework.ComparisonFailure: expected:<...9T00:00:00.000+01:00[]> but was:<...9T00:00:00.000+01:00[:00]>
	at junit.framework.Assert.assertEquals(Assert.java:81)
	at junit.framework.Assert.assertEquals(Assert.java:87)
	at org.joda.time.TestMutableDateTime_Properties.testPropertyAddWrapFieldYear(TestMutableDateTime_Properties.java:216)

testPropertySetYear(org.joda.time.TestMutableDateTime_Properties)  Time elapsed: 0 sec  <<< FAILURE!
junit.framework.ComparisonFailure: expected:<...9T00:00:00.000+01:00[]> but was:<...9T00:00:00.000+01:00[:00]>
	at junit.framework.Assert.assertEquals(Assert.java:81)
	at junit.framework.Assert.assertEquals(Assert.java:87)
	at org.joda.time.TestMutableDateTime_Properties.testPropertySetYear(TestMutableDateTime_Properties.java:222)

testPropertySetTextYear(org.joda.time.TestMutableDateTime_Properties)  Time elapsed: 0.001 sec  <<< FAILURE!
junit.framework.ComparisonFailure: expected:<...9T00:00:00.000+01:00[]> but was:<...9T00:00:00.000+01:00[:00]>
	at junit.framework.Assert.assertEquals(Assert.java:81)
	at junit.framework.Assert.assertEquals(Assert.java:87)
	at org.joda.time.TestMutableDateTime_Properties.testPropertySetTextYear(TestMutableDateTime_Properties.java:228)

testPropertyAddWeekOfWeekyear(org.joda.time.TestMutableDateTime_Properties)  Time elapsed: 0.001 sec  <<< FAILURE!
junit.framework.ComparisonFailure: expected:<...4T00:00:00.000+01:00[]> but was:<...4T00:00:00.000+01:00[:00]>
	at junit.framework.Assert.assertEquals(Assert.java:81)
	at junit.framework.Assert.assertEquals(Assert.java:87)
	at org.joda.time.TestMutableDateTime_Properties.testPropertyAddWeekOfWeekyear(TestMutableDateTime_Properties.java:420)

testPropertyAddDayOfWeek(org.joda.time.TestMutableDateTime_Properties)  Time elapsed: 0 sec  <<< FAILURE!
junit.framework.ComparisonFailure: expected:<...0T00:00:00.000+01:00[]> but was:<...0T00:00:00.000+01:00[:00]>
	at junit.framework.Assert.assertEquals(Assert.java:81)
	at junit.framework.Assert.assertEquals(Assert.java:87)
	at org.joda.time.TestMutableDateTime_Properties.testPropertyAddDayOfWeek(TestMutableDateTime_Properties.java:470)

testPropertyAddLongDayOfWeek(org.joda.time.TestMutableDateTime_Properties)  Time elapsed: 0.001 sec  <<< FAILURE!
junit.framework.ComparisonFailure: expected:<...0T00:00:00.000+01:00[]> but was:<...0T00:00:00.000+01:00[:00]>
	at junit.framework.Assert.assertEquals(Assert.java:81)
	at junit.framework.Assert.assertEquals(Assert.java:87)
	at org.joda.time.TestMutableDateTime_Properties.testPropertyAddLongDayOfWeek(TestMutableDateTime_Properties.java:476)

testPropertyAddWrapFieldDayOfWeek(org.joda.time.TestMutableDateTime_Properties)  Time elapsed: 0 sec  <<< FAILURE!
junit.framework.ComparisonFailure: expected:<...7T00:00:00.000+01:00[]> but was:<...7T00:00:00.000+01:00[:00]>
	at junit.framework.Assert.assertEquals(Assert.java:81)
	at junit.framework.Assert.assertEquals(Assert.java:87)
	at org.joda.time.TestMutableDateTime_Properties.testPropertyAddWrapFieldDayOfWeek(TestMutableDateTime_Properties.java:482)

testPropertySetDayOfWeek(org.joda.time.TestMutableDateTime_Properties)  Time elapsed: 0.001 sec  <<< FAILURE!
junit.framework.ComparisonFailure: expected:<...0T00:00:00.000+01:00[]> but was:<...0T00:00:00.000+01:00[:00]>
	at junit.framework.Assert.assertEquals(Assert.java:81)
	at junit.framework.Assert.assertEquals(Assert.java:87)
	at org.joda.time.TestMutableDateTime_Properties.testPropertySetDayOfWeek(TestMutableDateTime_Properties.java:488)

testPropertyAddWrapFieldDayOfMonth(org.joda.time.TestMutableDateTime_Properties)  Time elapsed: 0.001 sec  <<< FAILURE!
junit.framework.ComparisonFailure: expected:<...1T00:00:00.000+01:00[]> but was:<...1T00:00:00.000+01:00[:00]>
	at junit.framework.Assert.assertEquals(Assert.java:81)
	at junit.framework.Assert.assertEquals(Assert.java:87)
	at org.joda.time.TestMutableDateTime_Properties.testPropertyAddWrapFieldDayOfMonth(TestMutableDateTime_Properties.java:324)

testPropertySetDayOfMonth(org.joda.time.TestMutableDateTime_Properties)  Time elapsed: 0 sec  <<< FAILURE!
junit.framework.ComparisonFailure: expected:<...2T00:00:00.000+01:00[]> but was:<...2T00:00:00.000+01:00[:00]>
	at junit.framework.Assert.assertEquals(Assert.java:81)
	at junit.framework.Assert.assertEquals(Assert.java:87)
	at org.joda.time.TestMutableDateTime_Properties.testPropertySetDayOfMonth(TestMutableDateTime_Properties.java:330)

testPropertySetTextDayOfMonth(org.joda.time.TestMutableDateTime_Properties)  Time elapsed: 0.001 sec  <<< FAILURE!
junit.framework.ComparisonFailure: expected:<...2T00:00:00.000+01:00[]> but was:<...2T00:00:00.000+01:00[:00]>
	at junit.framework.Assert.assertEquals(Assert.java:81)
	at junit.framework.Assert.assertEquals(Assert.java:87)
	at org.joda.time.TestMutableDateTime_Properties.testPropertySetTextDayOfMonth(TestMutableDateTime_Properties.java:336)

testPropertyAddDayOfYear(org.joda.time.TestMutableDateTime_Properties)  Time elapsed: 0 sec  <<< FAILURE!
junit.framework.ComparisonFailure: expected:<...8T00:00:00.000+01:00[]> but was:<...8T00:00:00.000+01:00[:00]>
	at junit.framework.Assert.assertEquals(Assert.java:81)
	at junit.framework.Assert.assertEquals(Assert.java:87)
	at org.joda.time.TestMutableDateTime_Properties.testPropertyAddDayOfYear(TestMutableDateTime_Properties.java:363)

testPropertySetTextDayOfWeek(org.joda.time.TestMutableDateTime_Properties)  Time elapsed: 0.001 sec  <<< FAILURE!
junit.framework.ComparisonFailure: expected:<...0T00:00:00.000+01:00[]> but was:<...0T00:00:00.000+01:00[:00]>
	at junit.framework.Assert.assertEquals(Assert.java:81)
	at junit.framework.Assert.assertEquals(Assert.java:87)
	at org.joda.time.TestMutableDateTime_Properties.testPropertySetTextDayOfWeek(TestMutableDateTime_Properties.java:494)

testPropertyRoundFloorHourOfDay(org.joda.time.TestMutableDateTime_Properties)  Time elapsed: 0 sec  <<< FAILURE!
junit.framework.ComparisonFailure: expected:<...9T13:00:00.000+01:00[]> but was:<...9T13:00:00.000+01:00[:00]>
	at junit.framework.Assert.assertEquals(Assert.java:81)
	at junit.framework.Assert.assertEquals(Assert.java:87)
	at org.joda.time.TestMutableDateTime_Properties.testPropertyRoundFloorHourOfDay(TestMutableDateTime_Properties.java:529)

testPropertyRoundCeilingHourOfDay(org.joda.time.TestMutableDateTime_Properties)  Time elapsed: 0.001 sec  <<< FAILURE!
junit.framework.ComparisonFailure: expected:<...9T14:00:00.000+01:00[]> but was:<...9T14:00:00.000+01:00[:00]>
	at junit.framework.Assert.assertEquals(Assert.java:81)
	at junit.framework.Assert.assertEquals(Assert.java:87)
	at org.joda.time.TestMutableDateTime_Properties.testPropertyRoundCeilingHourOfDay(TestMutableDateTime_Properties.java:535)

testPropertyRoundHalfFloorHourOfDay(org.joda.time.TestMutableDateTime_Properties)  Time elapsed: 0 sec  <<< FAILURE!
junit.framework.ComparisonFailure: expected:<...9T13:00:00.000+01:00[]> but was:<...9T13:00:00.000+01:00[:00]>
	at junit.framework.Assert.assertEquals(Assert.java:81)
	at junit.framework.Assert.assertEquals(Assert.java:87)
	at org.joda.time.TestMutableDateTime_Properties.testPropertyRoundHalfFloorHourOfDay(TestMutableDateTime_Properties.java:541)

testPropertyRoundHalfCeilingHourOfDay(org.joda.time.TestMutableDateTime_Properties)  Time elapsed: 0.001 sec  <<< FAILURE!
junit.framework.ComparisonFailure: expected:<...9T14:00:00.000+01:00[]> but was:<...9T14:00:00.000+01:00[:00]>
	at junit.framework.Assert.assertEquals(Assert.java:81)
	at junit.framework.Assert.assertEquals(Assert.java:87)
	at org.joda.time.TestMutableDateTime_Properties.testPropertyRoundHalfCeilingHourOfDay(TestMutableDateTime_Properties.java:555)

testPropertyRoundHalfEvenHourOfDay(org.joda.time.TestMutableDateTime_Properties)  Time elapsed: 0 sec  <<< FAILURE!
junit.framework.ComparisonFailure: expected:<...9T14:00:00.000+01:00[]> but was:<...9T14:00:00.000+01:00[:00]>
	at junit.framework.Assert.assertEquals(Assert.java:81)
	at junit.framework.Assert.assertEquals(Assert.java:87)
	at org.joda.time.TestMutableDateTime_Properties.testPropertyRoundHalfEvenHourOfDay(TestMutableDateTime_Properties.java:569)

testToString(org.joda.time.TestDateMidnight_Basics)  Time elapsed: 0 sec  <<< FAILURE!
junit.framework.ComparisonFailure: expected:<...9T00:00:00.000+01:00[]> but was:<...9T00:00:00.000+01:00[:00]>
	at junit.framework.Assert.assertEquals(Assert.java:81)
	at junit.framework.Assert.assertEquals(Assert.java:87)
	at org.joda.time.TestDateMidnight_Basics.testToString(TestDateMidnight_Basics.java:439)

testToString_String(org.joda.time.TestDateMidnight_Basics)  Time elapsed: 0 sec  <<< FAILURE!
junit.framework.ComparisonFailure: expected:<...9T00:00:00.000+01:00[]> but was:<...9T00:00:00.000+01:00[:00]>
	at junit.framework.Assert.assertEquals(Assert.java:81)
	at junit.framework.Assert.assertEquals(Assert.java:87)
	at org.joda.time.TestDateMidnight_Basics.testToString_String(TestDateMidnight_Basics.java:451)

testToString_DTFormatter(org.joda.time.TestDateMidnight_Basics)  Time elapsed: 0.001 sec  <<< FAILURE!
junit.framework.ComparisonFailure: expected:<...9T00:00:00.000+01:00[]> but was:<...9T00:00:00.000+01:00[:00]>
	at junit.framework.Assert.assertEquals(Assert.java:81)
	at junit.framework.Assert.assertEquals(Assert.java:87)
	at org.joda.time.TestDateMidnight_Basics.testToString_DTFormatter(TestDateMidnight_Basics.java:466)

testToString_String_String(org.joda.time.TestDateMidnight_Basics)  Time elapsed: 0 sec  <<< FAILURE!
junit.framework.ComparisonFailure: expected:<...9T00:00:00.000+01:00[]> but was:<...9T00:00:00.000+01:00[:00]>
	at junit.framework.Assert.assertEquals(Assert.java:81)
	at junit.framework.Assert.assertEquals(Assert.java:87)
	at org.joda.time.TestDateMidnight_Basics.testToString_String_String(TestDateMidnight_Basics.java:458)

testPropertyWithMaximumValueDayOfMonth(org.joda.time.TestDateMidnight_Properties)  Time elapsed: 0.001 sec  <<< FAILURE!
junit.framework.ComparisonFailure: expected:<...9T00:00:00.000+01:00[]> but was:<...9T00:00:00.000+01:00[:00]>
	at junit.framework.Assert.assertEquals(Assert.java:81)
	at junit.framework.Assert.assertEquals(Assert.java:87)
	at org.joda.time.TestDateMidnight_Properties.testPropertyWithMaximumValueDayOfMonth(TestDateMidnight_Properties.java:398)

testPropertyWithMinimumValueDayOfMonth(org.joda.time.TestDateMidnight_Properties)  Time elapsed: 0.007 sec  <<< FAILURE!
junit.framework.ComparisonFailure: expected:<...9T00:00:00.000+01:00[]> but was:<...9T00:00:00.000+01:00[:00]>
	at junit.framework.Assert.assertEquals(Assert.java:81)
	at junit.framework.Assert.assertEquals(Assert.java:87)
	at org.joda.time.TestDateMidnight_Properties.testPropertyWithMinimumValueDayOfMonth(TestDateMidnight_Properties.java:405)

testPropertyRoundFloorMonthOfYear(org.joda.time.TestDateMidnight_Properties)  Time elapsed: 0 sec  <<< FAILURE!
junit.framework.ComparisonFailure: expected:<...1T00:00:00.000+01:00[]> but was:<...1T00:00:00.000+01:00[:00]>
	at junit.framework.Assert.assertEquals(Assert.java:81)
	at junit.framework.Assert.assertEquals(Assert.java:87)
	at org.joda.time.TestDateMidnight_Properties.testPropertyRoundFloorMonthOfYear(TestDateMidnight_Properties.java:310)

testPropertyRoundCeilingMonthOfYear(org.joda.time.TestDateMidnight_Properties)  Time elapsed: 0 sec  <<< FAILURE!
junit.framework.ComparisonFailure: expected:<...1T00:00:00.000+01:00[]> but was:<...1T00:00:00.000+01:00[:00]>
	at junit.framework.Assert.assertEquals(Assert.java:81)
	at junit.framework.Assert.assertEquals(Assert.java:87)
	at org.joda.time.TestDateMidnight_Properties.testPropertyRoundCeilingMonthOfYear(TestDateMidnight_Properties.java:316)

testPropertyRoundHalfFloorMonthOfYear(org.joda.time.TestDateMidnight_Properties)  Time elapsed: 0.001 sec  <<< FAILURE!
junit.framework.ComparisonFailure: expected:<...1T00:00:00.000+01:00[]> but was:<...1T00:00:00.000+01:00[:00]>
	at junit.framework.Assert.assertEquals(Assert.java:81)
	at junit.framework.Assert.assertEquals(Assert.java:87)
	at org.joda.time.TestDateMidnight_Properties.testPropertyRoundHalfFloorMonthOfYear(TestDateMidnight_Properties.java:322)

testPropertyRoundHalfCeilingMonthOfYear(org.joda.time.TestDateMidnight_Properties)  Time elapsed: 0 sec  <<< FAILURE!
junit.framework.ComparisonFailure: expected:<...1T00:00:00.000+01:00[]> but was:<...1T00:00:00.000+01:00[:00]>
	at junit.framework.Assert.assertEquals(Assert.java:81)
	at junit.framework.Assert.assertEquals(Assert.java:87)
	at org.joda.time.TestDateMidnight_Properties.testPropertyRoundHalfCeilingMonthOfYear(TestDateMidnight_Properties.java:336)

testPropertyRoundHalfEvenMonthOfYear(org.joda.time.TestDateMidnight_Properties)  Time elapsed: 0.001 sec  <<< FAILURE!
junit.framework.ComparisonFailure: expected:<...1T00:00:00.000+01:00[]> but was:<...1T00:00:00.000+01:00[:00]>
	at junit.framework.Assert.assertEquals(Assert.java:81)
	at junit.framework.Assert.assertEquals(Assert.java:87)
	at org.joda.time.TestDateMidnight_Properties.testPropertyRoundHalfEvenMonthOfYear(TestDateMidnight_Properties.java:350)

testToDateTime_RI(org.joda.time.TestLocalTime_Basics)  Time elapsed: 0.001 sec  <<< FAILURE!
junit.framework.ComparisonFailure: expected:<...1T01:00:00.000+01:00[]> but was:<...1T01:00:00.000+01:00[:00]>
	at junit.framework.Assert.assertEquals(Assert.java:81)
	at junit.framework.Assert.assertEquals(Assert.java:87)
	at org.joda.time.TestLocalTime_Basics.testToDateTime_RI(TestLocalTime_Basics.java:718)

testToDateTime_nullRI(org.joda.time.TestLocalTime_Basics)  Time elapsed: 0 sec  <<< FAILURE!
junit.framework.ComparisonFailure: expected:<...2T01:02:03.004+01:00[]> but was:<...2T01:02:03.004+01:00[:00]>
	at junit.framework.Assert.assertEquals(Assert.java:81)
	at junit.framework.Assert.assertEquals(Assert.java:87)
	at org.joda.time.TestLocalTime_Basics.testToDateTime_nullRI(TestLocalTime_Basics.java:732)

testToDateTime_RI(org.joda.time.TestTimeOfDay_Basics)  Time elapsed: 0 sec  <<< FAILURE!
junit.framework.ComparisonFailure: expected:<...1T01:00:00.000+01:00[]> but was:<...1T01:00:00.000+01:00[:00]>
	at junit.framework.Assert.assertEquals(Assert.java:81)
	at junit.framework.Assert.assertEquals(Assert.java:87)
	at org.joda.time.TestTimeOfDay_Basics.testToDateTime_RI(TestTimeOfDay_Basics.java:798)

testToDateTime_nullRI(org.joda.time.TestTimeOfDay_Basics)  Time elapsed: 0.001 sec  <<< FAILURE!
junit.framework.ComparisonFailure: expected:<...2T01:02:03.004+01:00[]> but was:<...2T01:02:03.004+01:00[:00]>
	at junit.framework.Assert.assertEquals(Assert.java:81)
	at junit.framework.Assert.assertEquals(Assert.java:87)
	at org.joda.time.TestTimeOfDay_Basics.testToDateTime_nullRI(TestTimeOfDay_Basics.java:812)

testToDateTime_RI(org.joda.time.TestPartial_Basics)  Time elapsed: 0.001 sec  <<< FAILURE!
junit.framework.ComparisonFailure: expected:<...1T01:00:00.000+01:00[]> but was:<...1T01:00:00.000+01:00[:00]>
	at junit.framework.Assert.assertEquals(Assert.java:81)
	at junit.framework.Assert.assertEquals(Assert.java:87)
	at org.joda.time.TestPartial_Basics.testToDateTime_RI(TestPartial_Basics.java:745)

testToDateTime_nullRI(org.joda.time.TestPartial_Basics)  Time elapsed: 0 sec  <<< FAILURE!
junit.framework.ComparisonFailure: expected:<...2T01:02:07.008+01:00[]> but was:<...2T01:02:07.008+01:00[:00]>
	at junit.framework.Assert.assertEquals(Assert.java:81)
	at junit.framework.Assert.assertEquals(Assert.java:87)
	at org.joda.time.TestPartial_Basics.testToDateTime_nullRI(TestPartial_Basics.java:759)

test_DateTime_plusHour_Gaza(org.joda.time.TestDateTimeZoneCutover)  Time elapsed: 0.001 sec  <<< FAILURE!
junit.framework.ComparisonFailure: expected:<...1T16:00:00.000+02:00[]> but was:<...1T16:00:00.000+02:00[:00]>
	at junit.framework.Assert.assertEquals(Assert.java:81)
	at junit.framework.Assert.assertEquals(Assert.java:87)
	at org.joda.time.TestDateTimeZoneCutover.test_DateTime_plusHour_Gaza(TestDateTimeZoneCutover.java:148)

test_DateTime_minusDay_Gaza(org.joda.time.TestDateTimeZoneCutover)  Time elapsed: 0.004 sec  <<< FAILURE!
junit.framework.ComparisonFailure: expected:<...2T00:00:00.000+03:00[]> but was:<...2T00:00:00.000+03:00[:00]>
	at junit.framework.Assert.assertEquals(Assert.java:81)
	at junit.framework.Assert.assertEquals(Assert.java:87)
	at org.joda.time.TestDateTimeZoneCutover.test_DateTime_minusDay_Gaza(TestDateTimeZoneCutover.java:160)

test_DateTime_plusDay_Gaza(org.joda.time.TestDateTimeZoneCutover)  Time elapsed: 0 sec  <<< FAILURE!
junit.framework.ComparisonFailure: expected:<...1T00:00:00.000+02:00[]> but was:<...1T00:00:00.000+02:00[:00]>
	at junit.framework.Assert.assertEquals(Assert.java:81)
	at junit.framework.Assert.assertEquals(Assert.java:87)
	at org.joda.time.TestDateTimeZoneCutover.test_DateTime_plusDay_Gaza(TestDateTimeZoneCutover.java:170)

test_DateTime_plusDayMidGap_Gaza(org.joda.time.TestDateTimeZoneCutover)  Time elapsed: 0 sec  <<< FAILURE!
junit.framework.ComparisonFailure: expected:<...1T00:30:00.000+02:00[]> but was:<...1T00:30:00.000+02:00[:00]>
	at junit.framework.Assert.assertEquals(Assert.java:81)
	at junit.framework.Assert.assertEquals(Assert.java:87)
	at org.joda.time.TestDateTimeZoneCutover.test_DateTime_plusDayMidGap_Gaza(TestDateTimeZoneCutover.java:180)

test_DateTime_addWrapFieldDay_Gaza(org.joda.time.TestDateTimeZoneCutover)  Time elapsed: 0 sec  <<< FAILURE!
junit.framework.ComparisonFailure: expected:<...0T00:00:00.000+03:00[]> but was:<...0T00:00:00.000+03:00[:00]>
	at junit.framework.Assert.assertEquals(Assert.java:81)
	at junit.framework.Assert.assertEquals(Assert.java:87)
	at org.joda.time.TestDateTimeZoneCutover.test_DateTime_addWrapFieldDay_Gaza(TestDateTimeZoneCutover.java:190)

test_DateTime_withZoneRetainFields_Gaza(org.joda.time.TestDateTimeZoneCutover)  Time elapsed: 0 sec  <<< FAILURE!
junit.framework.ComparisonFailure: expected:<...1T01:00:00.000+03:00[]> but was:<...1T01:00:00.000+03:00[:00]>
	at junit.framework.Assert.assertEquals(Assert.java:81)
	at junit.framework.Assert.assertEquals(Assert.java:87)
	at org.joda.time.TestDateTimeZoneCutover.test_DateTime_withZoneRetainFields_Gaza(TestDateTimeZoneCutover.java:203)

test_MutableDateTime_withZoneRetainFields_Gaza(org.joda.time.TestDateTimeZoneCutover)  Time elapsed: 0 sec  <<< FAILURE!
junit.framework.ComparisonFailure: expected:<...1T01:00:00.000+03:00[]> but was:<...1T01:00:00.000+03:00[:00]>
	at junit.framework.Assert.assertEquals(Assert.java:81)
	at junit.framework.Assert.assertEquals(Assert.java:87)
	at org.joda.time.TestDateTimeZoneCutover.test_MutableDateTime_withZoneRetainFields_Gaza(TestDateTimeZoneCutover.java:211)

test_MockTurkIsCorrect(org.joda.time.TestDateTimeZoneCutover)  Time elapsed: 0.001 sec  <<< FAILURE!
junit.framework.ComparisonFailure: expected:<...1T23:59:59.999-05:00[]> but was:<...1T23:59:59.999-05:00[:00]>
	at junit.framework.Assert.assertEquals(Assert.java:81)
	at junit.framework.Assert.assertEquals(Assert.java:87)
	at org.joda.time.TestDateTimeZoneCutover.test_MockTurkIsCorrect(TestDateTimeZoneCutover.java:272)

test_getOffsetFromLocal_Turk(org.joda.time.TestDateTimeZoneCutover)  Time elapsed: 0.001 sec  <<< FAILURE!
junit.framework.ComparisonFailure: 2007-03-31T23:00:00.000-05:00:00 expected:<...1T23:00:00.000-05:00[]> but was:<...1T23:00:00.000-05:00[:00]>
	at junit.framework.Assert.assertEquals(Assert.java:81)
	at org.joda.time.TestDateTimeZoneCutover.doTest_getOffsetFromLocal_Turk(TestDateTimeZoneCutover.java:298)
	at org.joda.time.TestDateTimeZoneCutover.test_getOffsetFromLocal_Turk(TestDateTimeZoneCutover.java:280)

test_DateTime_roundFloor_Gaza(org.joda.time.TestDateTimeZoneCutover)  Time elapsed: 0 sec  <<< FAILURE!
junit.framework.ComparisonFailure: expected:<...1T08:00:00.000+03:00[]> but was:<...1T08:00:00.000+03:00[:00]>
	at junit.framework.Assert.assertEquals(Assert.java:81)
	at junit.framework.Assert.assertEquals(Assert.java:87)
	at org.joda.time.TestDateTimeZoneCutover.test_DateTime_roundFloor_Gaza(TestDateTimeZoneCutover.java:93)

test_DateTime_roundCeiling_Gaza(org.joda.time.TestDateTimeZoneCutover)  Time elapsed: 0.001 sec  <<< FAILURE!
junit.framework.ComparisonFailure: expected:<...1T20:00:00.000+02:00[]> but was:<...1T20:00:00.000+02:00[:00]>
	at junit.framework.Assert.assertEquals(Assert.java:81)
	at junit.framework.Assert.assertEquals(Assert.java:87)
	at org.joda.time.TestDateTimeZoneCutover.test_DateTime_roundCeiling_Gaza(TestDateTimeZoneCutover.java:100)

test_DateTime_setHourZero_Gaza(org.joda.time.TestDateTimeZoneCutover)  Time elapsed: 0 sec  <<< FAILURE!
junit.framework.ComparisonFailure: expected:<...1T08:00:00.000+03:00[]> but was:<...1T08:00:00.000+03:00[:00]>
	at junit.framework.Assert.assertEquals(Assert.java:81)
	at junit.framework.Assert.assertEquals(Assert.java:87)
	at org.joda.time.TestDateTimeZoneCutover.test_DateTime_setHourZero_Gaza(TestDateTimeZoneCutover.java:107)

test_DateTime_withHourZero_Gaza(org.joda.time.TestDateTimeZoneCutover)  Time elapsed: 0 sec  <<< FAILURE!
junit.framework.ComparisonFailure: expected:<...1T08:00:00.000+03:00[]> but was:<...1T08:00:00.000+03:00[:00]>
	at junit.framework.Assert.assertEquals(Assert.java:81)
	at junit.framework.Assert.assertEquals(Assert.java:87)
	at org.joda.time.TestDateTimeZoneCutover.test_DateTime_withHourZero_Gaza(TestDateTimeZoneCutover.java:118)

test_DateTime_withDay_Gaza(org.joda.time.TestDateTimeZoneCutover)  Time elapsed: 0.001 sec  <<< FAILURE!
junit.framework.ComparisonFailure: expected:<...2T00:00:00.000+03:00[]> but was:<...2T00:00:00.000+03:00[:00]>
	at junit.framework.Assert.assertEquals(Assert.java:81)
	at junit.framework.Assert.assertEquals(Assert.java:87)
	at org.joda.time.TestDateTimeZoneCutover.test_DateTime_withDay_Gaza(TestDateTimeZoneCutover.java:129)

test_DateTime_minusHour_Gaza(org.joda.time.TestDateTimeZoneCutover)  Time elapsed: 0 sec  <<< FAILURE!
junit.framework.ComparisonFailure: expected:<...1T08:00:00.000+03:00[]> but was:<...1T08:00:00.000+03:00[:00]>
	at junit.framework.Assert.assertEquals(Assert.java:81)
	at junit.framework.Assert.assertEquals(Assert.java:87)
	at org.joda.time.TestDateTimeZoneCutover.test_DateTime_minusHour_Gaza(TestDateTimeZoneCutover.java:136)

test_DateTime_roundCeiling_hour_NewYork_Spring_preCutover(org.joda.time.TestDateTimeZoneCutover)  Time elapsed: 0 sec  <<< FAILURE!
junit.framework.ComparisonFailure: expected:<...1T01:30:00.000-05:00[]> but was:<...1T01:30:00.000-05:00[:00]>
	at junit.framework.Assert.assertEquals(Assert.java:81)
	at junit.framework.Assert.assertEquals(Assert.java:87)
	at org.joda.time.TestDateTimeZoneCutover.test_DateTime_roundCeiling_hour_NewYork_Spring_preCutover(TestDateTimeZoneCutover.java:605)

test_DateTime_roundCeiling_hour_NewYork_Spring_postCutover(org.joda.time.TestDateTimeZoneCutover)  Time elapsed: 0.001 sec  <<< FAILURE!
junit.framework.ComparisonFailure: expected:<...1T03:30:00.000-04:00[]> but was:<...1T03:30:00.000-04:00[:00]>
	at junit.framework.Assert.assertEquals(Assert.java:81)
	at junit.framework.Assert.assertEquals(Assert.java:87)
	at org.joda.time.TestDateTimeZoneCutover.test_DateTime_roundCeiling_hour_NewYork_Spring_postCutover(TestDateTimeZoneCutover.java:612)

test_DateTime_roundCeiling_minute_NewYork_Spring_preCutover(org.joda.time.TestDateTimeZoneCutover)  Time elapsed: 0.001 sec  <<< FAILURE!
junit.framework.ComparisonFailure: expected:<...1T01:30:40.000-05:00[]> but was:<...1T01:30:40.000-05:00[:00]>
	at junit.framework.Assert.assertEquals(Assert.java:81)
	at junit.framework.Assert.assertEquals(Assert.java:87)
	at org.joda.time.TestDateTimeZoneCutover.test_DateTime_roundCeiling_minute_NewYork_Spring_preCutover(TestDateTimeZoneCutover.java:619)

test_DateTime_roundCeiling_minute_NewYork_Spring_postCutover(org.joda.time.TestDateTimeZoneCutover)  Time elapsed: 0 sec  <<< FAILURE!
junit.framework.ComparisonFailure: expected:<...1T03:30:40.000-04:00[]> but was:<...1T03:30:40.000-04:00[:00]>
	at junit.framework.Assert.assertEquals(Assert.java:81)
	at junit.framework.Assert.assertEquals(Assert.java:87)
	at org.joda.time.TestDateTimeZoneCutover.test_DateTime_roundCeiling_minute_NewYork_Spring_postCutover(TestDateTimeZoneCutover.java:626)

test_NewYorkIsCorrect_Autumn(org.joda.time.TestDateTimeZoneCutover)  Time elapsed: 0.001 sec  <<< FAILURE!
junit.framework.ComparisonFailure: expected:<...4T01:59:59.999-04:00[]> but was:<...4T01:59:59.999-04:00[:00]>
	at junit.framework.Assert.assertEquals(Assert.java:81)
	at junit.framework.Assert.assertEquals(Assert.java:87)
	at org.joda.time.TestDateTimeZoneCutover.test_NewYorkIsCorrect_Autumn(TestDateTimeZoneCutover.java:638)

test_getOffsetFromLocal_NewYork_Autumn(org.joda.time.TestDateTimeZoneCutover)  Time elapsed: 0 sec  <<< FAILURE!
junit.framework.ComparisonFailure: 2007-11-04T00:00:00.000-04:00:00 expected:<...4T00:00:00.000-04:00[]> but was:<...4T00:00:00.000-04:00[:00]>
	at junit.framework.Assert.assertEquals(Assert.java:81)
	at org.joda.time.TestDateTimeZoneCutover.doTest_getOffsetFromLocal(TestDateTimeZoneCutover.java:1371)
	at org.joda.time.TestDateTimeZoneCutover.doTest_getOffsetFromLocal(TestDateTimeZoneCutover.java:1355)
	at org.joda.time.TestDateTimeZoneCutover.test_getOffsetFromLocal_NewYork_Autumn(TestDateTimeZoneCutover.java:646)

test_DateTime_constructor_NewYork_Autumn(org.joda.time.TestDateTimeZoneCutover)  Time elapsed: 0.001 sec  <<< FAILURE!
junit.framework.ComparisonFailure: expected:<...4T01:30:00.000-04:00[]> but was:<...4T01:30:00.000-04:00[:00]>
	at junit.framework.Assert.assertEquals(Assert.java:81)
	at junit.framework.Assert.assertEquals(Assert.java:87)
	at org.joda.time.TestDateTimeZoneCutover.test_DateTime_constructor_NewYork_Autumn(TestDateTimeZoneCutover.java:665)

test_DateTime_plusHour_NewYork_Autumn(org.joda.time.TestDateTimeZoneCutover)  Time elapsed: 0 sec  <<< FAILURE!
junit.framework.ComparisonFailure: expected:<...3T18:00:00.000-04:00[]> but was:<...3T18:00:00.000-04:00[:00]>
	at junit.framework.Assert.assertEquals(Assert.java:81)
	at junit.framework.Assert.assertEquals(Assert.java:87)
	at org.joda.time.TestDateTimeZoneCutover.test_DateTime_plusHour_NewYork_Autumn(TestDateTimeZoneCutover.java:670)

test_DateTime_minusHour_NewYork_Autumn(org.joda.time.TestDateTimeZoneCutover)  Time elapsed: 0.001 sec  <<< FAILURE!
junit.framework.ComparisonFailure: expected:<...4T08:00:00.000-05:00[]> but was:<...4T08:00:00.000-05:00[:00]>
	at junit.framework.Assert.assertEquals(Assert.java:81)
	at junit.framework.Assert.assertEquals(Assert.java:87)
	at org.joda.time.TestDateTimeZoneCutover.test_DateTime_minusHour_NewYork_Autumn(TestDateTimeZoneCutover.java:684)

test_DateTime_roundFloor_day_NewYork_Autumn_preCutover(org.joda.time.TestDateTimeZoneCutover)  Time elapsed: 0.001 sec  <<< FAILURE!
junit.framework.ComparisonFailure: expected:<...4T01:30:00.000-04:00[]> but was:<...4T01:30:00.000-04:00[:00]>
	at junit.framework.Assert.assertEquals(Assert.java:81)
	at junit.framework.Assert.assertEquals(Assert.java:87)
	at org.joda.time.TestDateTimeZoneCutover.test_DateTime_roundFloor_day_NewYork_Autumn_preCutover(TestDateTimeZoneCutover.java:699)

test_DateTime_roundFloor_day_NewYork_Autumn_postCutover(org.joda.time.TestDateTimeZoneCutover)  Time elapsed: 0 sec  <<< FAILURE!
junit.framework.ComparisonFailure: expected:<...4T01:30:00.000-05:00[]> but was:<...4T01:30:00.000-05:00[:00]>
	at junit.framework.Assert.assertEquals(Assert.java:81)
	at junit.framework.Assert.assertEquals(Assert.java:87)
	at org.joda.time.TestDateTimeZoneCutover.test_DateTime_roundFloor_day_NewYork_Autumn_postCutover(TestDateTimeZoneCutover.java:706)

test_DateTime_roundFloor_hourOfDay_NewYork_Autumn_preCutover(org.joda.time.TestDateTimeZoneCutover)  Time elapsed: 0.001 sec  <<< FAILURE!
junit.framework.ComparisonFailure: expected:<...4T01:30:00.000-04:00[]> but was:<...4T01:30:00.000-04:00[:00]>
	at junit.framework.Assert.assertEquals(Assert.java:81)
	at junit.framework.Assert.assertEquals(Assert.java:87)
	at org.joda.time.TestDateTimeZoneCutover.test_DateTime_roundFloor_hourOfDay_NewYork_Autumn_preCutover(TestDateTimeZoneCutover.java:713)

test_DateTime_roundFloor_hourOfDay_NewYork_Autumn_postCutover(org.joda.time.TestDateTimeZoneCutover)  Time elapsed: 0.003 sec  <<< FAILURE!
junit.framework.ComparisonFailure: expected:<...4T01:30:00.000-05:00[]> but was:<...4T01:30:00.000-05:00[:00]>
	at junit.framework.Assert.assertEquals(Assert.java:81)
	at junit.framework.Assert.assertEquals(Assert.java:87)
	at org.joda.time.TestDateTimeZoneCutover.test_DateTime_roundFloor_hourOfDay_NewYork_Autumn_postCutover(TestDateTimeZoneCutover.java:720)

test_DateTime_roundFloor_minuteOfHour_NewYork_Autumn_preCutover(org.joda.time.TestDateTimeZoneCutover)  Time elapsed: 0 sec  <<< FAILURE!
junit.framework.ComparisonFailure: expected:<...4T01:30:40.000-04:00[]> but was:<...4T01:30:40.000-04:00[:00]>
	at junit.framework.Assert.assertEquals(Assert.java:81)
	at junit.framework.Assert.assertEquals(Assert.java:87)
	at org.joda.time.TestDateTimeZoneCutover.test_DateTime_roundFloor_minuteOfHour_NewYork_Autumn_preCutover(TestDateTimeZoneCutover.java:727)

test_DateTime_roundFloor_minuteOfHour_NewYork_Autumn_postCutover(org.joda.time.TestDateTimeZoneCutover)  Time elapsed: 0 sec  <<< FAILURE!
junit.framework.ComparisonFailure: expected:<...4T01:30:40.000-05:00[]> but was:<...4T01:30:40.000-05:00[:00]>
	at junit.framework.Assert.assertEquals(Assert.java:81)
	at junit.framework.Assert.assertEquals(Assert.java:87)
	at org.joda.time.TestDateTimeZoneCutover.test_DateTime_roundFloor_minuteOfHour_NewYork_Autumn_postCutover(TestDateTimeZoneCutover.java:734)

test_DateTime_roundFloor_secondOfMinute_NewYork_Autumn_preCutover(org.joda.time.TestDateTimeZoneCutover)  Time elapsed: 0 sec  <<< FAILURE!
junit.framework.ComparisonFailure: expected:<...4T01:30:40.500-04:00[]> but was:<...4T01:30:40.500-04:00[:00]>
	at junit.framework.Assert.assertEquals(Assert.java:81)
	at junit.framework.Assert.assertEquals(Assert.java:87)
	at org.joda.time.TestDateTimeZoneCutover.test_DateTime_roundFloor_secondOfMinute_NewYork_Autumn_preCutover(TestDateTimeZoneCutover.java:741)

test_DateTime_roundFloor_secondOfMinute_NewYork_Autumn_postCutover(org.joda.time.TestDateTimeZoneCutover)  Time elapsed: 0 sec  <<< FAILURE!
junit.framework.ComparisonFailure: expected:<...4T01:30:40.500-05:00[]> but was:<...4T01:30:40.500-05:00[:00]>
	at junit.framework.Assert.assertEquals(Assert.java:81)
	at junit.framework.Assert.assertEquals(Assert.java:87)
	at org.joda.time.TestDateTimeZoneCutover.test_DateTime_roundFloor_secondOfMinute_NewYork_Autumn_postCutover(TestDateTimeZoneCutover.java:748)

test_DateTime_roundCeiling_day_NewYork_Autumn_preCutover(org.joda.time.TestDateTimeZoneCutover)  Time elapsed: 0.004 sec  <<< FAILURE!
junit.framework.ComparisonFailure: expected:<...4T01:30:00.000-04:00[]> but was:<...4T01:30:00.000-04:00[:00]>
	at junit.framework.Assert.assertEquals(Assert.java:81)
	at junit.framework.Assert.assertEquals(Assert.java:87)
	at org.joda.time.TestDateTimeZoneCutover.test_DateTime_roundCeiling_day_NewYork_Autumn_preCutover(TestDateTimeZoneCutover.java:756)

test_DateTime_roundCeiling_day_NewYork_Autumn_postCutover(org.joda.time.TestDateTimeZoneCutover)  Time elapsed: 0 sec  <<< FAILURE!
junit.framework.ComparisonFailure: expected:<...4T01:30:00.000-05:00[]> but was:<...4T01:30:00.000-05:00[:00]>
	at junit.framework.Assert.assertEquals(Assert.java:81)
	at junit.framework.Assert.assertEquals(Assert.java:87)
	at org.joda.time.TestDateTimeZoneCutover.test_DateTime_roundCeiling_day_NewYork_Autumn_postCutover(TestDateTimeZoneCutover.java:763)

test_DateTime_roundCeiling_hourOfDay_NewYork_Autumn_preCutover(org.joda.time.TestDateTimeZoneCutover)  Time elapsed: 0 sec  <<< FAILURE!
junit.framework.ComparisonFailure: expected:<...4T01:30:00.000-04:00[]> but was:<...4T01:30:00.000-04:00[:00]>
	at junit.framework.Assert.assertEquals(Assert.java:81)
	at junit.framework.Assert.assertEquals(Assert.java:87)
	at org.joda.time.TestDateTimeZoneCutover.test_DateTime_roundCeiling_hourOfDay_NewYork_Autumn_preCutover(TestDateTimeZoneCutover.java:770)

test_DateTime_roundCeiling_hourOfDay_NewYork_Autumn_postCutover(org.joda.time.TestDateTimeZoneCutover)  Time elapsed: 0 sec  <<< FAILURE!
junit.framework.ComparisonFailure: expected:<...4T01:30:00.000-05:00[]> but was:<...4T01:30:00.000-05:00[:00]>
	at junit.framework.Assert.assertEquals(Assert.java:81)
	at junit.framework.Assert.assertEquals(Assert.java:87)
	at org.joda.time.TestDateTimeZoneCutover.test_DateTime_roundCeiling_hourOfDay_NewYork_Autumn_postCutover(TestDateTimeZoneCutover.java:777)

test_DateTime_roundCeiling_minuteOfHour_NewYork_Autumn_preCutover(org.joda.time.TestDateTimeZoneCutover)  Time elapsed: 0 sec  <<< FAILURE!
junit.framework.ComparisonFailure: expected:<...4T01:30:40.000-04:00[]> but was:<...4T01:30:40.000-04:00[:00]>
	at junit.framework.Assert.assertEquals(Assert.java:81)
	at junit.framework.Assert.assertEquals(Assert.java:87)
	at org.joda.time.TestDateTimeZoneCutover.test_DateTime_roundCeiling_minuteOfHour_NewYork_Autumn_preCutover(TestDateTimeZoneCutover.java:784)

test_DateTime_roundCeiling_minuteOfHour_NewYork_Autumn_postCutover(org.joda.time.TestDateTimeZoneCutover)  Time elapsed: 0 sec  <<< FAILURE!
junit.framework.ComparisonFailure: expected:<...4T01:30:40.000-05:00[]> but was:<...4T01:30:40.000-05:00[:00]>
	at junit.framework.Assert.assertEquals(Assert.java:81)
	at junit.framework.Assert.assertEquals(Assert.java:87)
	at org.joda.time.TestDateTimeZoneCutover.test_DateTime_roundCeiling_minuteOfHour_NewYork_Autumn_postCutover(TestDateTimeZoneCutover.java:791)

test_DateTime_roundCeiling_secondOfMinute_NewYork_Autumn_preCutover(org.joda.time.TestDateTimeZoneCutover)  Time elapsed: 0 sec  <<< FAILURE!
junit.framework.ComparisonFailure: expected:<...4T01:30:40.500-04:00[]> but was:<...4T01:30:40.500-04:00[:00]>
	at junit.framework.Assert.assertEquals(Assert.java:81)
	at junit.framework.Assert.assertEquals(Assert.java:87)
	at org.joda.time.TestDateTimeZoneCutover.test_DateTime_roundCeiling_secondOfMinute_NewYork_Autumn_preCutover(TestDateTimeZoneCutover.java:798)

test_DateTime_roundCeiling_secondOfMinute_NewYork_Autumn_postCutover(org.joda.time.TestDateTimeZoneCutover)  Time elapsed: 0.001 sec  <<< FAILURE!
junit.framework.ComparisonFailure: expected:<...4T01:30:40.500-05:00[]> but was:<...4T01:30:40.500-05:00[:00]>
	at junit.framework.Assert.assertEquals(Assert.java:81)
	at junit.framework.Assert.assertEquals(Assert.java:87)
	at org.joda.time.TestDateTimeZoneCutover.test_DateTime_roundCeiling_secondOfMinute_NewYork_Autumn_postCutover(TestDateTimeZoneCutover.java:805)

test_MoscowIsCorrect_Spring(org.joda.time.TestDateTimeZoneCutover)  Time elapsed: 0 sec  <<< FAILURE!
junit.framework.ComparisonFailure: expected:<...5T01:59:59.999+03:00[]> but was:<...5T01:59:59.999+03:00[:00]>
	at junit.framework.Assert.assertEquals(Assert.java:81)
	at junit.framework.Assert.assertEquals(Assert.java:87)
	at org.joda.time.TestDateTimeZoneCutover.test_MoscowIsCorrect_Spring(TestDateTimeZoneCutover.java:822)

test_getOffsetFromLocal_Moscow_Spring(org.joda.time.TestDateTimeZoneCutover)  Time elapsed: 0.002 sec  <<< FAILURE!
junit.framework.ComparisonFailure: 2007-03-25T01:00:00.000+03:00:00 expected:<...5T01:00:00.000+03:00[]> but was:<...5T01:00:00.000+03:00[:00]>
	at junit.framework.Assert.assertEquals(Assert.java:81)
	at org.joda.time.TestDateTimeZoneCutover.doTest_getOffsetFromLocal(TestDateTimeZoneCutover.java:1371)
	at org.joda.time.TestDateTimeZoneCutover.doTest_getOffsetFromLocal(TestDateTimeZoneCutover.java:1355)
	at org.joda.time.TestDateTimeZoneCutover.test_getOffsetFromLocal_Moscow_Spring(TestDateTimeZoneCutover.java:830)

test_DateTime_setHourAcross_Moscow_Spring(org.joda.time.TestDateTimeZoneCutover)  Time elapsed: 0 sec  <<< FAILURE!
junit.framework.ComparisonFailure: expected:<...5T00:00:00.000+03:00[]> but was:<...5T00:00:00.000+03:00[:00]>
	at junit.framework.Assert.assertEquals(Assert.java:81)
	at junit.framework.Assert.assertEquals(Assert.java:87)
	at org.joda.time.TestDateTimeZoneCutover.test_DateTime_setHourAcross_Moscow_Spring(TestDateTimeZoneCutover.java:847)

test_DateTime_setHourForward_Moscow_Spring(org.joda.time.TestDateTimeZoneCutover)  Time elapsed: 0.001 sec  <<< FAILURE!
junit.framework.ComparisonFailure: expected:<...5T00:00:00.000+03:00[]> but was:<...5T00:00:00.000+03:00[:00]>
	at junit.framework.Assert.assertEquals(Assert.java:81)
	at junit.framework.Assert.assertEquals(Assert.java:87)
	at org.joda.time.TestDateTimeZoneCutover.test_DateTime_setHourForward_Moscow_Spring(TestDateTimeZoneCutover.java:854)

test_DateTime_setHourBack_Moscow_Spring(org.joda.time.TestDateTimeZoneCutover)  Time elapsed: 0 sec  <<< FAILURE!
junit.framework.ComparisonFailure: expected:<...5T08:00:00.000+04:00[]> but was:<...5T08:00:00.000+04:00[:00]>
	at junit.framework.Assert.assertEquals(Assert.java:81)
	at junit.framework.Assert.assertEquals(Assert.java:87)
	at org.joda.time.TestDateTimeZoneCutover.test_DateTime_setHourBack_Moscow_Spring(TestDateTimeZoneCutover.java:866)

test_MoscowIsCorrect_Autumn(org.joda.time.TestDateTimeZoneCutover)  Time elapsed: 0 sec  <<< FAILURE!
junit.framework.ComparisonFailure: expected:<...8T02:59:59.999+04:00[]> but was:<...8T02:59:59.999+04:00[:00]>
	at junit.framework.Assert.assertEquals(Assert.java:81)
	at junit.framework.Assert.assertEquals(Assert.java:87)
	at org.joda.time.TestDateTimeZoneCutover.test_MoscowIsCorrect_Autumn(TestDateTimeZoneCutover.java:883)

test_getOffsetFromLocal_Moscow_Autumn(org.joda.time.TestDateTimeZoneCutover)  Time elapsed: 0.001 sec  <<< FAILURE!
junit.framework.ComparisonFailure: 2007-10-28T00:00:00.000+04:00:00 expected:<...8T00:00:00.000+04:00[]> but was:<...8T00:00:00.000+04:00[:00]>
	at junit.framework.Assert.assertEquals(Assert.java:81)
	at org.joda.time.TestDateTimeZoneCutover.doTest_getOffsetFromLocal(TestDateTimeZoneCutover.java:1371)
	at org.joda.time.TestDateTimeZoneCutover.doTest_getOffsetFromLocal(TestDateTimeZoneCutover.java:1355)
	at org.joda.time.TestDateTimeZoneCutover.test_getOffsetFromLocal_Moscow_Autumn(TestDateTimeZoneCutover.java:891)

test_getOffsetFromLocal_Moscow_Autumn_overlap_mins(org.joda.time.TestDateTimeZoneCutover)  Time elapsed: 0 sec  <<< FAILURE!
junit.framework.ComparisonFailure: 2007-10-28T02:00:00.000+04:00:00 expected:<...8T02:00:00.000+04:00[]> but was:<...8T02:00:00.000+04:00[:00]>
	at junit.framework.Assert.assertEquals(Assert.java:81)
	at org.joda.time.TestDateTimeZoneCutover.doTest_getOffsetFromLocal(TestDateTimeZoneCutover.java:1371)
	at org.joda.time.TestDateTimeZoneCutover.doTest_getOffsetFromLocal(TestDateTimeZoneCutover.java:1355)
	at org.joda.time.TestDateTimeZoneCutover.test_getOffsetFromLocal_Moscow_Autumn_overlap_mins(TestDateTimeZoneCutover.java:914)

test_DateTime_constructor_Moscow_Autumn(org.joda.time.TestDateTimeZoneCutover)  Time elapsed: 0.001 sec  <<< FAILURE!
junit.framework.ComparisonFailure: expected:<...8T02:30:00.000+04:00[]> but was:<...8T02:30:00.000+04:00[:00]>
	at junit.framework.Assert.assertEquals(Assert.java:81)
	at junit.framework.Assert.assertEquals(Assert.java:87)
	at org.joda.time.TestDateTimeZoneCutover.test_DateTime_constructor_Moscow_Autumn(TestDateTimeZoneCutover.java:923)

test_DateTime_plusHour_Moscow_Autumn(org.joda.time.TestDateTimeZoneCutover)  Time elapsed: 0 sec  <<< FAILURE!
junit.framework.ComparisonFailure: expected:<...7T19:00:00.000+04:00[]> but was:<...7T19:00:00.000+04:00[:00]>
	at junit.framework.Assert.assertEquals(Assert.java:81)
	at junit.framework.Assert.assertEquals(Assert.java:87)
	at org.joda.time.TestDateTimeZoneCutover.test_DateTime_plusHour_Moscow_Autumn(TestDateTimeZoneCutover.java:928)

test_DateTime_minusHour_Moscow_Autumn(org.joda.time.TestDateTimeZoneCutover)  Time elapsed: 0.001 sec  <<< FAILURE!
junit.framework.ComparisonFailure: expected:<...8T09:00:00.000+03:00[]> but was:<...8T09:00:00.000+03:00[:00]>
	at junit.framework.Assert.assertEquals(Assert.java:81)
	at junit.framework.Assert.assertEquals(Assert.java:87)
	at org.joda.time.TestDateTimeZoneCutover.test_DateTime_minusHour_Moscow_Autumn(TestDateTimeZoneCutover.java:942)

test_GuatemataIsCorrect_Autumn(org.joda.time.TestDateTimeZoneCutover)  Time elapsed: 0.001 sec  <<< FAILURE!
junit.framework.ComparisonFailure: expected:<...0T23:59:59.999-05:00[]> but was:<...0T23:59:59.999-05:00[:00]>
	at junit.framework.Assert.assertEquals(Assert.java:81)
	at junit.framework.Assert.assertEquals(Assert.java:87)
	at org.joda.time.TestDateTimeZoneCutover.test_GuatemataIsCorrect_Autumn(TestDateTimeZoneCutover.java:964)

test_getOffsetFromLocal_Guatemata_Autumn(org.joda.time.TestDateTimeZoneCutover)  Time elapsed: 0 sec  <<< FAILURE!
junit.framework.ComparisonFailure: 2006-09-30T23:00:00.000-05:00:00 expected:<...0T23:00:00.000-05:00[]> but was:<...0T23:00:00.000-05:00[:00]>
	at junit.framework.Assert.assertEquals(Assert.java:81)
	at org.joda.time.TestDateTimeZoneCutover.doTest_getOffsetFromLocal(TestDateTimeZoneCutover.java:1371)
	at org.joda.time.TestDateTimeZoneCutover.doTest_getOffsetFromLocal(TestDateTimeZoneCutover.java:1363)
	at org.joda.time.TestDateTimeZoneCutover.test_getOffsetFromLocal_Guatemata_Autumn(TestDateTimeZoneCutover.java:972)

test_DateTime_plusHour_Guatemata_Autumn(org.joda.time.TestDateTimeZoneCutover)  Time elapsed: 0.001 sec  <<< FAILURE!
junit.framework.ComparisonFailure: expected:<...0T20:00:00.000-05:00[]> but was:<...0T20:00:00.000-05:00[:00]>
	at junit.framework.Assert.assertEquals(Assert.java:81)
	at junit.framework.Assert.assertEquals(Assert.java:87)
	at org.joda.time.TestDateTimeZoneCutover.test_DateTime_plusHour_Guatemata_Autumn(TestDateTimeZoneCutover.java:1014)

test_DateTime_minusHour_Guatemata_Autumn(org.joda.time.TestDateTimeZoneCutover)  Time elapsed: 0 sec  <<< FAILURE!
junit.framework.ComparisonFailure: expected:<...1T02:00:00.000-06:00[]> but was:<...1T02:00:00.000-06:00[:00]>
	at junit.framework.Assert.assertEquals(Assert.java:81)
	at junit.framework.Assert.assertEquals(Assert.java:87)
	at org.joda.time.TestDateTimeZoneCutover.test_DateTime_minusHour_Guatemata_Autumn(TestDateTimeZoneCutover.java:1034)

test_RioBrancoIsCorrect_Spring(org.joda.time.TestDateTimeZoneCutover)  Time elapsed: 0.002 sec  <<< FAILURE!
junit.framework.ComparisonFailure: expected:<...3T23:59:59.999-05:00[]> but was:<...3T23:59:59.999-05:00[:00]>
	at junit.framework.Assert.assertEquals(Assert.java:81)
	at junit.framework.Assert.assertEquals(Assert.java:87)
	at org.joda.time.TestDateTimeZoneCutover.test_RioBrancoIsCorrect_Spring(TestDateTimeZoneCutover.java:1062)

test_getOffsetFromLocal_RioBranco_Spring(org.joda.time.TestDateTimeZoneCutover)  Time elapsed: 0 sec  <<< FAILURE!
junit.framework.ComparisonFailure: 2008-06-23T23:00:00.000-05:00:00 expected:<...3T23:00:00.000-05:00[]> but was:<...3T23:00:00.000-05:00[:00]>
	at junit.framework.Assert.assertEquals(Assert.java:81)
	at org.joda.time.TestDateTimeZoneCutover.doTest_getOffsetFromLocal(TestDateTimeZoneCutover.java:1371)
	at org.joda.time.TestDateTimeZoneCutover.doTest_getOffsetFromLocal(TestDateTimeZoneCutover.java:1363)
	at org.joda.time.TestDateTimeZoneCutover.test_getOffsetFromLocal_RioBranco_Spring(TestDateTimeZoneCutover.java:1070)

test_DateTime_JustAfterLastEverOverlap(org.joda.time.TestDateTimeZoneCutover)  Time elapsed: 0.004 sec  <<< FAILURE!
junit.framework.ComparisonFailure: expected:<...0T00:00:00.000-03:00[]> but was:<...0T00:00:00.000-03:00[:00]>
	at junit.framework.Assert.assertEquals(Assert.java:81)
	at junit.framework.Assert.assertEquals(Assert.java:87)
	at org.joda.time.TestDateTimeZoneCutover.test_DateTime_JustAfterLastEverOverlap(TestDateTimeZoneCutover.java:1102)

testWithMinuteOfHourInDstChange_mockZone(org.joda.time.TestDateTimeZoneCutover)  Time elapsed: 0.001 sec  <<< FAILURE!
junit.framework.ComparisonFailure: expected:<...1T01:15:00.000+00:30[]> but was:<...1T01:15:00.000+00:30[:00]>
	at junit.framework.Assert.assertEquals(Assert.java:81)
	at junit.framework.Assert.assertEquals(Assert.java:87)
	at org.joda.time.TestDateTimeZoneCutover.testWithMinuteOfHourInDstChange_mockZone(TestDateTimeZoneCutover.java:1120)

testWithHourOfDayInDstChange(org.joda.time.TestDateTimeZoneCutover)  Time elapsed: 0.001 sec  <<< FAILURE!
junit.framework.ComparisonFailure: expected:<...1T02:30:10.123+02:00[]> but was:<...1T02:30:10.123+02:00[:00]>
	at junit.framework.Assert.assertEquals(Assert.java:81)
	at junit.framework.Assert.assertEquals(Assert.java:87)
	at org.joda.time.TestDateTimeZoneCutover.testWithHourOfDayInDstChange(TestDateTimeZoneCutover.java:1140)

testWithMinuteOfHourInDstChange(org.joda.time.TestDateTimeZoneCutover)  Time elapsed: 0.001 sec  <<< FAILURE!
junit.framework.ComparisonFailure: expected:<...1T02:30:10.123+02:00[]> but was:<...1T02:30:10.123+02:00[:00]>
	at junit.framework.Assert.assertEquals(Assert.java:81)
	at junit.framework.Assert.assertEquals(Assert.java:87)
	at org.joda.time.TestDateTimeZoneCutover.testWithMinuteOfHourInDstChange(TestDateTimeZoneCutover.java:1147)

testWithSecondOfMinuteInDstChange(org.joda.time.TestDateTimeZoneCutover)  Time elapsed: 0.001 sec  <<< FAILURE!
junit.framework.ComparisonFailure: expected:<...1T02:30:10.123+02:00[]> but was:<...1T02:30:10.123+02:00[:00]>
	at junit.framework.Assert.assertEquals(Assert.java:81)
	at junit.framework.Assert.assertEquals(Assert.java:87)
	at org.joda.time.TestDateTimeZoneCutover.testWithSecondOfMinuteInDstChange(TestDateTimeZoneCutover.java:1154)

testWithMillisOfSecondInDstChange_Paris_summer(org.joda.time.TestDateTimeZoneCutover)  Time elapsed: 0.001 sec  <<< FAILURE!
junit.framework.ComparisonFailure: expected:<...1T02:30:10.123+02:00[]> but was:<...1T02:30:10.123+02:00[:00]>
	at junit.framework.Assert.assertEquals(Assert.java:81)
	at junit.framework.Assert.assertEquals(Assert.java:87)
	at org.joda.time.TestDateTimeZoneCutover.testWithMillisOfSecondInDstChange_Paris_summer(TestDateTimeZoneCutover.java:1161)

testWithMillisOfSecondInDstChange_Paris_winter(org.joda.time.TestDateTimeZoneCutover)  Time elapsed: 0 sec  <<< FAILURE!
junit.framework.ComparisonFailure: expected:<...1T02:30:10.123+01:00[]> but was:<...1T02:30:10.123+01:00[:00]>
	at junit.framework.Assert.assertEquals(Assert.java:81)
	at junit.framework.Assert.assertEquals(Assert.java:87)
	at org.joda.time.TestDateTimeZoneCutover.testWithMillisOfSecondInDstChange_Paris_winter(TestDateTimeZoneCutover.java:1168)

testWithMillisOfSecondInDstChange_NewYork_summer(org.joda.time.TestDateTimeZoneCutover)  Time elapsed: 0.001 sec  <<< FAILURE!
junit.framework.ComparisonFailure: expected:<...4T01:30:00.123-04:00[]> but was:<...4T01:30:00.123-04:00[:00]>
	at junit.framework.Assert.assertEquals(Assert.java:81)
	at junit.framework.Assert.assertEquals(Assert.java:87)
	at org.joda.time.TestDateTimeZoneCutover.testWithMillisOfSecondInDstChange_NewYork_summer(TestDateTimeZoneCutover.java:1175)

testWithMillisOfSecondInDstChange_NewYork_winter(org.joda.time.TestDateTimeZoneCutover)  Time elapsed: 0.001 sec  <<< FAILURE!
junit.framework.ComparisonFailure: expected:<...4T01:30:00.123-05:00[]> but was:<...4T01:30:00.123-05:00[:00]>
	at junit.framework.Assert.assertEquals(Assert.java:81)
	at junit.framework.Assert.assertEquals(Assert.java:87)
	at org.joda.time.TestDateTimeZoneCutover.testWithMillisOfSecondInDstChange_NewYork_winter(TestDateTimeZoneCutover.java:1182)

testPlusMinutesInDstChange(org.joda.time.TestDateTimeZoneCutover)  Time elapsed: 0 sec  <<< FAILURE!
junit.framework.ComparisonFailure: expected:<...1T02:30:10.123+02:00[]> but was:<...1T02:30:10.123+02:00[:00]>
	at junit.framework.Assert.assertEquals(Assert.java:81)
	at junit.framework.Assert.assertEquals(Assert.java:87)
	at org.joda.time.TestDateTimeZoneCutover.testPlusMinutesInDstChange(TestDateTimeZoneCutover.java:1189)

testPlusSecondsInDstChange(org.joda.time.TestDateTimeZoneCutover)  Time elapsed: 0.001 sec  <<< FAILURE!
junit.framework.ComparisonFailure: expected:<...1T02:30:10.123+02:00[]> but was:<...1T02:30:10.123+02:00[:00]>
	at junit.framework.Assert.assertEquals(Assert.java:81)
	at junit.framework.Assert.assertEquals(Assert.java:87)
	at org.joda.time.TestDateTimeZoneCutover.testPlusSecondsInDstChange(TestDateTimeZoneCutover.java:1196)

testPlusMillisInDstChange(org.joda.time.TestDateTimeZoneCutover)  Time elapsed: 0.001 sec  <<< FAILURE!
junit.framework.ComparisonFailure: expected:<...1T02:30:10.123+02:00[]> but was:<...1T02:30:10.123+02:00[:00]>
	at junit.framework.Assert.assertEquals(Assert.java:81)
	at junit.framework.Assert.assertEquals(Assert.java:87)
	at org.joda.time.TestDateTimeZoneCutover.testPlusMillisInDstChange(TestDateTimeZoneCutover.java:1203)

testDateTimeCreation_athens(org.joda.time.TestDateTimeZoneCutover)  Time elapsed: 0 sec  <<< FAILURE!
junit.framework.ComparisonFailure: expected:<...0T03:15:00.000+03:00[]> but was:<...0T03:15:00.000+03:00[:00]>
	at junit.framework.Assert.assertEquals(Assert.java:81)
	at junit.framework.Assert.assertEquals(Assert.java:87)
	at org.joda.time.TestDateTimeZoneCutover.testDateTimeCreation_athens(TestDateTimeZoneCutover.java:1319)

testDateTimeCreation_paris(org.joda.time.TestDateTimeZoneCutover)  Time elapsed: 0.001 sec  <<< FAILURE!
junit.framework.ComparisonFailure: expected:<...0T02:15:00.000+02:00[]> but was:<...0T02:15:00.000+02:00[:00]>
	at junit.framework.Assert.assertEquals(Assert.java:81)
	at junit.framework.Assert.assertEquals(Assert.java:87)
	at org.joda.time.TestDateTimeZoneCutover.testDateTimeCreation_paris(TestDateTimeZoneCutover.java:1326)

testDateTimeCreation_london(org.joda.time.TestDateTimeZoneCutover)  Time elapsed: 0.001 sec  <<< FAILURE!
junit.framework.ComparisonFailure: expected:<...0T01:15:00.000+01:00[]> but was:<...0T01:15:00.000+01:00[:00]>
	at junit.framework.Assert.assertEquals(Assert.java:81)
	at junit.framework.Assert.assertEquals(Assert.java:87)
	at org.joda.time.TestDateTimeZoneCutover.testDateTimeCreation_london(TestDateTimeZoneCutover.java:1333)

testDateTimeCreation_newYork(org.joda.time.TestDateTimeZoneCutover)  Time elapsed: 0 sec  <<< FAILURE!
junit.framework.ComparisonFailure: expected:<...7T01:15:00.000-04:00[]> but was:<...7T01:15:00.000-04:00[:00]>
	at junit.framework.Assert.assertEquals(Assert.java:81)
	at junit.framework.Assert.assertEquals(Assert.java:87)
	at org.joda.time.TestDateTimeZoneCutover.testDateTimeCreation_newYork(TestDateTimeZoneCutover.java:1340)

testDateTimeCreation_losAngeles(org.joda.time.TestDateTimeZoneCutover)  Time elapsed: 0.001 sec  <<< FAILURE!
junit.framework.ComparisonFailure: expected:<...7T01:15:00.000-07:00[]> but was:<...7T01:15:00.000-07:00[:00]>
	at junit.framework.Assert.assertEquals(Assert.java:81)
	at junit.framework.Assert.assertEquals(Assert.java:87)
	at org.joda.time.TestDateTimeZoneCutover.testDateTimeCreation_losAngeles(TestDateTimeZoneCutover.java:1347)

test_DateTime_roundFloor_Turk(org.joda.time.TestDateTimeZoneCutover)  Time elapsed: 0 sec  <<< FAILURE!
junit.framework.ComparisonFailure: expected:<...1T08:00:00.000-04:00[]> but was:<...1T08:00:00.000-04:00[:00]>
	at junit.framework.Assert.assertEquals(Assert.java:81)
	at junit.framework.Assert.assertEquals(Assert.java:87)
	at org.joda.time.TestDateTimeZoneCutover.test_DateTime_roundFloor_Turk(TestDateTimeZoneCutover.java:303)

test_DateTime_roundFloorNotDST_Turk(org.joda.time.TestDateTimeZoneCutover)  Time elapsed: 0 sec  <<< FAILURE!
junit.framework.ComparisonFailure: expected:<...2T08:00:00.000-04:00[]> but was:<...2T08:00:00.000-04:00[:00]>
	at junit.framework.Assert.assertEquals(Assert.java:81)
	at junit.framework.Assert.assertEquals(Assert.java:87)
	at org.joda.time.TestDateTimeZoneCutover.test_DateTime_roundFloorNotDST_Turk(TestDateTimeZoneCutover.java:310)

test_DateTime_roundCeiling_Turk(org.joda.time.TestDateTimeZoneCutover)  Time elapsed: 0.001 sec  <<< FAILURE!
junit.framework.ComparisonFailure: expected:<...1T20:00:00.000-05:00[]> but was:<...1T20:00:00.000-05:00[:00]>
	at junit.framework.Assert.assertEquals(Assert.java:81)
	at junit.framework.Assert.assertEquals(Assert.java:87)
	at org.joda.time.TestDateTimeZoneCutover.test_DateTime_roundCeiling_Turk(TestDateTimeZoneCutover.java:317)

test_DateTime_setHourZero_Turk(org.joda.time.TestDateTimeZoneCutover)  Time elapsed: 0 sec  <<< FAILURE!
junit.framework.ComparisonFailure: expected:<...1T08:00:00.000-04:00[]> but was:<...1T08:00:00.000-04:00[:00]>
	at junit.framework.Assert.assertEquals(Assert.java:81)
	at junit.framework.Assert.assertEquals(Assert.java:87)
	at org.joda.time.TestDateTimeZoneCutover.test_DateTime_setHourZero_Turk(TestDateTimeZoneCutover.java:324)

test_DateTime_withHourZero_Turk(org.joda.time.TestDateTimeZoneCutover)  Time elapsed: 0.001 sec  <<< FAILURE!
junit.framework.ComparisonFailure: expected:<...1T08:00:00.000-04:00[]> but was:<...1T08:00:00.000-04:00[:00]>
	at junit.framework.Assert.assertEquals(Assert.java:81)
	at junit.framework.Assert.assertEquals(Assert.java:87)
	at org.joda.time.TestDateTimeZoneCutover.test_DateTime_withHourZero_Turk(TestDateTimeZoneCutover.java:335)

test_DateTime_withDay_Turk(org.joda.time.TestDateTimeZoneCutover)  Time elapsed: 0 sec  <<< FAILURE!
junit.framework.ComparisonFailure: expected:<...2T00:00:00.000-04:00[]> but was:<...2T00:00:00.000-04:00[:00]>
	at junit.framework.Assert.assertEquals(Assert.java:81)
	at junit.framework.Assert.assertEquals(Assert.java:87)
	at org.joda.time.TestDateTimeZoneCutover.test_DateTime_withDay_Turk(TestDateTimeZoneCutover.java:346)

test_DateTime_minusHour_Turk(org.joda.time.TestDateTimeZoneCutover)  Time elapsed: 0 sec  <<< FAILURE!
junit.framework.ComparisonFailure: expected:<...1T08:00:00.000-04:00[]> but was:<...1T08:00:00.000-04:00[:00]>
	at junit.framework.Assert.assertEquals(Assert.java:81)
	at junit.framework.Assert.assertEquals(Assert.java:87)
	at org.joda.time.TestDateTimeZoneCutover.test_DateTime_minusHour_Turk(TestDateTimeZoneCutover.java:353)

test_DateTime_plusHour_Turk(org.joda.time.TestDateTimeZoneCutover)  Time elapsed: 0 sec  <<< FAILURE!
junit.framework.ComparisonFailure: expected:<...1T16:00:00.000-05:00[]> but was:<...1T16:00:00.000-05:00[:00]>
	at junit.framework.Assert.assertEquals(Assert.java:81)
	at junit.framework.Assert.assertEquals(Assert.java:87)
	at org.joda.time.TestDateTimeZoneCutover.test_DateTime_plusHour_Turk(TestDateTimeZoneCutover.java:365)

test_DateTime_minusDay_Turk(org.joda.time.TestDateTimeZoneCutover)  Time elapsed: 0.001 sec  <<< FAILURE!
junit.framework.ComparisonFailure: expected:<...2T00:00:00.000-04:00[]> but was:<...2T00:00:00.000-04:00[:00]>
	at junit.framework.Assert.assertEquals(Assert.java:81)
	at junit.framework.Assert.assertEquals(Assert.java:87)
	at org.joda.time.TestDateTimeZoneCutover.test_DateTime_minusDay_Turk(TestDateTimeZoneCutover.java:377)

test_DateTime_plusDay_Turk(org.joda.time.TestDateTimeZoneCutover)  Time elapsed: 0 sec  <<< FAILURE!
junit.framework.ComparisonFailure: expected:<...1T00:00:00.000-05:00[]> but was:<...1T00:00:00.000-05:00[:00]>
	at junit.framework.Assert.assertEquals(Assert.java:81)
	at junit.framework.Assert.assertEquals(Assert.java:87)
	at org.joda.time.TestDateTimeZoneCutover.test_DateTime_plusDay_Turk(TestDateTimeZoneCutover.java:387)

test_DateTime_plusDayMidGap_Turk(org.joda.time.TestDateTimeZoneCutover)  Time elapsed: 0.001 sec  <<< FAILURE!
junit.framework.ComparisonFailure: expected:<...1T00:30:00.000-05:00[]> but was:<...1T00:30:00.000-05:00[:00]>
	at junit.framework.Assert.assertEquals(Assert.java:81)
	at junit.framework.Assert.assertEquals(Assert.java:87)
	at org.joda.time.TestDateTimeZoneCutover.test_DateTime_plusDayMidGap_Turk(TestDateTimeZoneCutover.java:397)

test_DateTime_addWrapFieldDay_Turk(org.joda.time.TestDateTimeZoneCutover)  Time elapsed: 0 sec  <<< FAILURE!
junit.framework.ComparisonFailure: expected:<...0T00:00:00.000-04:00[]> but was:<...0T00:00:00.000-04:00[:00]>
	at junit.framework.Assert.assertEquals(Assert.java:81)
	at junit.framework.Assert.assertEquals(Assert.java:87)
	at org.joda.time.TestDateTimeZoneCutover.test_DateTime_addWrapFieldDay_Turk(TestDateTimeZoneCutover.java:407)

test_DateTime_withZoneRetainFields_Turk(org.joda.time.TestDateTimeZoneCutover)  Time elapsed: 0.001 sec  <<< FAILURE!
junit.framework.ComparisonFailure: expected:<...1T01:00:00.000-04:00[]> but was:<...1T01:00:00.000-04:00[:00]>
	at junit.framework.Assert.assertEquals(Assert.java:81)
	at junit.framework.Assert.assertEquals(Assert.java:87)
	at org.joda.time.TestDateTimeZoneCutover.test_DateTime_withZoneRetainFields_Turk(TestDateTimeZoneCutover.java:420)

test_MutableDateTime_setZoneRetainFields_Turk(org.joda.time.TestDateTimeZoneCutover)  Time elapsed: 0.001 sec  <<< FAILURE!
junit.framework.ComparisonFailure: expected:<...1T01:00:00.000-04:00[]> but was:<...1T01:00:00.000-04:00[:00]>
	at junit.framework.Assert.assertEquals(Assert.java:81)
	at junit.framework.Assert.assertEquals(Assert.java:87)
	at org.joda.time.TestDateTimeZoneCutover.test_MutableDateTime_setZoneRetainFields_Turk(TestDateTimeZoneCutover.java:428)

test_NewYorkIsCorrect_Spring(org.joda.time.TestDateTimeZoneCutover)  Time elapsed: 0.001 sec  <<< FAILURE!
junit.framework.ComparisonFailure: expected:<...1T01:59:59.999-05:00[]> but was:<...1T01:59:59.999-05:00[:00]>
	at junit.framework.Assert.assertEquals(Assert.java:81)
	at junit.framework.Assert.assertEquals(Assert.java:87)
	at org.joda.time.TestDateTimeZoneCutover.test_NewYorkIsCorrect_Spring(TestDateTimeZoneCutover.java:491)

test_getOffsetFromLocal_NewYork_Spring(org.joda.time.TestDateTimeZoneCutover)  Time elapsed: 0.001 sec  <<< FAILURE!
junit.framework.ComparisonFailure: 2007-03-11T01:00:00.000-05:00:00 expected:<...1T01:00:00.000-05:00[]> but was:<...1T01:00:00.000-05:00[:00]>
	at junit.framework.Assert.assertEquals(Assert.java:81)
	at org.joda.time.TestDateTimeZoneCutover.doTest_getOffsetFromLocal(TestDateTimeZoneCutover.java:1371)
	at org.joda.time.TestDateTimeZoneCutover.doTest_getOffsetFromLocal(TestDateTimeZoneCutover.java:1355)
	at org.joda.time.TestDateTimeZoneCutover.test_getOffsetFromLocal_NewYork_Spring(TestDateTimeZoneCutover.java:499)

test_DateTime_setHourAcross_NewYork_Spring(org.joda.time.TestDateTimeZoneCutover)  Time elapsed: 0 sec  <<< FAILURE!
junit.framework.ComparisonFailure: expected:<...1T00:00:00.000-05:00[]> but was:<...1T00:00:00.000-05:00[:00]>
	at junit.framework.Assert.assertEquals(Assert.java:81)
	at junit.framework.Assert.assertEquals(Assert.java:87)
	at org.joda.time.TestDateTimeZoneCutover.test_DateTime_setHourAcross_NewYork_Spring(TestDateTimeZoneCutover.java:516)

test_DateTime_setHourForward_NewYork_Spring(org.joda.time.TestDateTimeZoneCutover)  Time elapsed: 0.001 sec  <<< FAILURE!
junit.framework.ComparisonFailure: expected:<...1T00:00:00.000-05:00[]> but was:<...1T00:00:00.000-05:00[:00]>
	at junit.framework.Assert.assertEquals(Assert.java:81)
	at junit.framework.Assert.assertEquals(Assert.java:87)
	at org.joda.time.TestDateTimeZoneCutover.test_DateTime_setHourForward_NewYork_Spring(TestDateTimeZoneCutover.java:523)

test_DateTime_setHourBack_NewYork_Spring(org.joda.time.TestDateTimeZoneCutover)  Time elapsed: 0.001 sec  <<< FAILURE!
junit.framework.ComparisonFailure: expected:<...1T08:00:00.000-04:00[]> but was:<...1T08:00:00.000-04:00[:00]>
	at junit.framework.Assert.assertEquals(Assert.java:81)
	at junit.framework.Assert.assertEquals(Assert.java:87)
	at org.joda.time.TestDateTimeZoneCutover.test_DateTime_setHourBack_NewYork_Spring(TestDateTimeZoneCutover.java:535)

test_DateTime_roundFloor_day_NewYork_Spring_preCutover(org.joda.time.TestDateTimeZoneCutover)  Time elapsed: 0 sec  <<< FAILURE!
junit.framework.ComparisonFailure: expected:<...1T01:30:00.000-05:00[]> but was:<...1T01:30:00.000-05:00[:00]>
	at junit.framework.Assert.assertEquals(Assert.java:81)
	at junit.framework.Assert.assertEquals(Assert.java:87)
	at org.joda.time.TestDateTimeZoneCutover.test_DateTime_roundFloor_day_NewYork_Spring_preCutover(TestDateTimeZoneCutover.java:548)

test_DateTime_roundFloor_day_NewYork_Spring_postCutover(org.joda.time.TestDateTimeZoneCutover)  Time elapsed: 0 sec  <<< FAILURE!
junit.framework.ComparisonFailure: expected:<...1T03:30:00.000-04:00[]> but was:<...1T03:30:00.000-04:00[:00]>
	at junit.framework.Assert.assertEquals(Assert.java:81)
	at junit.framework.Assert.assertEquals(Assert.java:87)
	at org.joda.time.TestDateTimeZoneCutover.test_DateTime_roundFloor_day_NewYork_Spring_postCutover(TestDateTimeZoneCutover.java:555)

test_DateTime_roundFloor_hour_NewYork_Spring_preCutover(org.joda.time.TestDateTimeZoneCutover)  Time elapsed: 0.001 sec  <<< FAILURE!
junit.framework.ComparisonFailure: expected:<...1T01:30:00.000-05:00[]> but was:<...1T01:30:00.000-05:00[:00]>
	at junit.framework.Assert.assertEquals(Assert.java:81)
	at junit.framework.Assert.assertEquals(Assert.java:87)
	at org.joda.time.TestDateTimeZoneCutover.test_DateTime_roundFloor_hour_NewYork_Spring_preCutover(TestDateTimeZoneCutover.java:562)

test_DateTime_roundFloor_hour_NewYork_Spring_postCutover(org.joda.time.TestDateTimeZoneCutover)  Time elapsed: 0.001 sec  <<< FAILURE!
junit.framework.ComparisonFailure: expected:<...1T03:30:00.000-04:00[]> but was:<...1T03:30:00.000-04:00[:00]>
	at junit.framework.Assert.assertEquals(Assert.java:81)
	at junit.framework.Assert.assertEquals(Assert.java:87)
	at org.joda.time.TestDateTimeZoneCutover.test_DateTime_roundFloor_hour_NewYork_Spring_postCutover(TestDateTimeZoneCutover.java:569)

test_DateTime_roundFloor_minute_NewYork_Spring_preCutover(org.joda.time.TestDateTimeZoneCutover)  Time elapsed: 0 sec  <<< FAILURE!
junit.framework.ComparisonFailure: expected:<...1T01:30:40.000-05:00[]> but was:<...1T01:30:40.000-05:00[:00]>
	at junit.framework.Assert.assertEquals(Assert.java:81)
	at junit.framework.Assert.assertEquals(Assert.java:87)
	at org.joda.time.TestDateTimeZoneCutover.test_DateTime_roundFloor_minute_NewYork_Spring_preCutover(TestDateTimeZoneCutover.java:576)

test_DateTime_roundFloor_minute_NewYork_Spring_postCutover(org.joda.time.TestDateTimeZoneCutover)  Time elapsed: 0.001 sec  <<< FAILURE!
junit.framework.ComparisonFailure: expected:<...1T03:30:40.000-04:00[]> but was:<...1T03:30:40.000-04:00[:00]>
	at junit.framework.Assert.assertEquals(Assert.java:81)
	at junit.framework.Assert.assertEquals(Assert.java:87)
	at org.joda.time.TestDateTimeZoneCutover.test_DateTime_roundFloor_minute_NewYork_Spring_postCutover(TestDateTimeZoneCutover.java:583)

test_DateTime_roundCeiling_day_NewYork_Spring_preCutover(org.joda.time.TestDateTimeZoneCutover)  Time elapsed: 0 sec  <<< FAILURE!
junit.framework.ComparisonFailure: expected:<...1T01:30:00.000-05:00[]> but was:<...1T01:30:00.000-05:00[:00]>
	at junit.framework.Assert.assertEquals(Assert.java:81)
	at junit.framework.Assert.assertEquals(Assert.java:87)
	at org.joda.time.TestDateTimeZoneCutover.test_DateTime_roundCeiling_day_NewYork_Spring_preCutover(TestDateTimeZoneCutover.java:591)

test_DateTime_roundCeiling_day_NewYork_Spring_postCutover(org.joda.time.TestDateTimeZoneCutover)  Time elapsed: 0.001 sec  <<< FAILURE!
junit.framework.ComparisonFailure: expected:<...1T03:30:00.000-04:00[]> but was:<...1T03:30:00.000-04:00[:00]>
	at junit.framework.Assert.assertEquals(Assert.java:81)
	at junit.framework.Assert.assertEquals(Assert.java:87)
	at org.joda.time.TestDateTimeZoneCutover.test_DateTime_roundCeiling_day_NewYork_Spring_postCutover(TestDateTimeZoneCutover.java:598)

test_MockGazaIsCorrect(org.joda.time.TestDateTimeZoneCutover)  Time elapsed: 0 sec  <<< FAILURE!
junit.framework.ComparisonFailure: expected:<...1T23:59:59.999+02:00[]> but was:<...1T23:59:59.999+02:00[:00]>
	at junit.framework.Assert.assertEquals(Assert.java:81)
	at junit.framework.Assert.assertEquals(Assert.java:87)
	at org.joda.time.TestDateTimeZoneCutover.test_MockGazaIsCorrect(TestDateTimeZoneCutover.java:63)

test_getOffsetFromLocal_Gaza(org.joda.time.TestDateTimeZoneCutover)  Time elapsed: 0.001 sec  <<< FAILURE!
junit.framework.ComparisonFailure: 2007-03-31T23:00:00.000+02:00:00 expected:<...1T23:00:00.000+02:00[]> but was:<...1T23:00:00.000+02:00[:00]>
	at junit.framework.Assert.assertEquals(Assert.java:81)
	at org.joda.time.TestDateTimeZoneCutover.doTest_getOffsetFromLocal_Gaza(TestDateTimeZoneCutover.java:88)
	at org.joda.time.TestDateTimeZoneCutover.test_getOffsetFromLocal_Gaza(TestDateTimeZoneCutover.java:71)

testDateMidnight(org.joda.time.TestStringConvert)  Time elapsed: 0.004 sec  <<< FAILURE!
junit.framework.ComparisonFailure: expected:<...0T00:00:00.000+02:00[]> but was:<...0T00:00:00.000+02:00[:00]>
	at junit.framework.Assert.assertEquals(Assert.java:81)
	at junit.framework.Assert.assertEquals(Assert.java:87)
	at org.joda.time.TestStringConvert.testDateMidnight(TestStringConvert.java:56)

testDateTime(org.joda.time.TestStringConvert)  Time elapsed: 0.002 sec  <<< FAILURE!
junit.framework.ComparisonFailure: expected:<...0T02:30:50.678+02:00[]> but was:<...0T02:30:50.678+02:00[:00]>
	at junit.framework.Assert.assertEquals(Assert.java:81)
	at junit.framework.Assert.assertEquals(Assert.java:87)
	at org.joda.time.TestStringConvert.testDateTime(TestStringConvert.java:63)

testMutableDateTime(org.joda.time.TestStringConvert)  Time elapsed: 0.001 sec  <<< FAILURE!
junit.framework.ComparisonFailure: expected:<...0T02:30:50.678+02:00[]> but was:<...0T02:30:50.678+02:00[:00]>
	at junit.framework.Assert.assertEquals(Assert.java:81)
	at junit.framework.Assert.assertEquals(Assert.java:87)
	at org.joda.time.TestStringConvert.testMutableDateTime(TestStringConvert.java:70)

test_lenientChrononolgy_Chicago(org.joda.time.chrono.TestLenientChronology)  Time elapsed: 0.002 sec  <<< FAILURE!
junit.framework.ComparisonFailure: expected:<...1T03:30:00.000-05:00[]> but was:<...1T03:30:00.000-05:00[:00]>
	at junit.framework.Assert.assertEquals(Assert.java:81)
	at junit.framework.Assert.assertEquals(Assert.java:87)
	at org.joda.time.chrono.TestLenientChronology.test_lenientChrononolgy_Chicago(TestLenientChronology.java:139)

test_lenientChrononolgy_Turk(org.joda.time.chrono.TestLenientChronology)  Time elapsed: 0.001 sec  <<< FAILURE!
junit.framework.ComparisonFailure: expected:<...1T01:30:00.000-04:00[]> but was:<...1T01:30:00.000-04:00[:00]>
	at junit.framework.Assert.assertEquals(Assert.java:81)
	at junit.framework.Assert.assertEquals(Assert.java:87)
	at org.joda.time.chrono.TestLenientChronology.test_lenientChrononolgy_Turk(TestLenientChronology.java:145)

test_MockTurkIsCorrect(org.joda.time.chrono.TestLenientChronology)  Time elapsed: 0.001 sec  <<< FAILURE!
junit.framework.ComparisonFailure: expected:<...1T23:59:59.999-05:00[]> but was:<...1T23:59:59.999-05:00[:00]>
	at junit.framework.Assert.assertEquals(Assert.java:81)
	at junit.framework.Assert.assertEquals(Assert.java:87)
	at org.joda.time.chrono.TestLenientChronology.test_MockTurkIsCorrect(TestLenientChronology.java:128)

testPrint_zone(org.joda.time.format.TestDateTimeFormatter)  Time elapsed: 0.001 sec  <<< FAILURE!
junit.framework.ComparisonFailure: expected:<...06-09T06:20:30-04:00[]> but was:<...06-09T06:20:30-04:00[:00]>
	at junit.framework.Assert.assertEquals(Assert.java:81)
	at junit.framework.Assert.assertEquals(Assert.java:87)
	at org.joda.time.format.TestDateTimeFormatter.testPrint_zone(TestDateTimeFormatter.java:134)

testPrint_chrono(org.joda.time.format.TestDateTimeFormatter)  Time elapsed: 0.001 sec  <<< FAILURE!
junit.framework.ComparisonFailure: expected:<...06-09T12:20:30+02:00[]> but was:<...06-09T12:20:30+02:00[:00]>
	at junit.framework.Assert.assertEquals(Assert.java:81)
	at junit.framework.Assert.assertEquals(Assert.java:87)
	at org.joda.time.format.TestDateTimeFormatter.testPrint_chrono(TestDateTimeFormatter.java:148)

testPrint_bufferMethods(org.joda.time.format.TestDateTimeFormatter)  Time elapsed: 0 sec  <<< FAILURE!
junit.framework.ComparisonFailure: expected:<...06-09T11:20:30+01:00[]> but was:<...06-09T11:20:30+01:00[:00]>
	at junit.framework.Assert.assertEquals(Assert.java:81)
	at junit.framework.Assert.assertEquals(Assert.java:87)
	at org.joda.time.format.TestDateTimeFormatter.testPrint_bufferMethods(TestDateTimeFormatter.java:168)

testPrint_writerMethods(org.joda.time.format.TestDateTimeFormatter)  Time elapsed: 0.001 sec  <<< FAILURE!
junit.framework.ComparisonFailure: expected:<...06-09T11:20:30+01:00[]> but was:<...06-09T11:20:30+01:00[:00]>
	at junit.framework.Assert.assertEquals(Assert.java:81)
	at junit.framework.Assert.assertEquals(Assert.java:87)
	at org.joda.time.format.TestDateTimeFormatter.testPrint_writerMethods(TestDateTimeFormatter.java:190)

testPrint_appendableMethods(org.joda.time.format.TestDateTimeFormatter)  Time elapsed: 0.001 sec  <<< FAILURE!
junit.framework.ComparisonFailure: expected:<...06-09T11:20:30+01:00[]> but was:<...06-09T11:20:30+01:00[:00]>
	at junit.framework.Assert.assertEquals(Assert.java:81)
	at junit.framework.Assert.assertEquals(Assert.java:87)
	at org.joda.time.format.TestDateTimeFormatter.testPrint_appendableMethods(TestDateTimeFormatter.java:212)

testPrint_chrono_and_zone(org.joda.time.format.TestDateTimeFormatter)  Time elapsed: 0 sec  <<< FAILURE!
junit.framework.ComparisonFailure: expected:<...06-09T12:20:30+02:00[]> but was:<...06-09T12:20:30+02:00[:00]>
	at junit.framework.Assert.assertEquals(Assert.java:81)
	at junit.framework.Assert.assertEquals(Assert.java:87)
	at org.joda.time.format.TestDateTimeFormatter.testPrint_chrono_and_zone(TestDateTimeFormatter.java:230)

testPrint_simple(org.joda.time.format.TestDateTimeFormatter)  Time elapsed: 0.001 sec  <<< FAILURE!
junit.framework.ComparisonFailure: expected:<...06-09T12:20:30+02:00[]> but was:<...06-09T12:20:30+02:00[:00]>
	at junit.framework.Assert.assertEquals(Assert.java:81)
	at junit.framework.Assert.assertEquals(Assert.java:87)
	at org.joda.time.format.TestDateTimeFormatter.testPrint_simple(TestDateTimeFormatter.java:115)

testFormat_time(org.joda.time.format.TestISODateTimeFormat)  Time elapsed: 0 sec  <<< FAILURE!
junit.framework.ComparisonFailure: expected:<11:20:30.040+01:00[]> but was:<11:20:30.040+01:00[:00]>
	at junit.framework.Assert.assertEquals(Assert.java:81)
	at junit.framework.Assert.assertEquals(Assert.java:87)
	at org.joda.time.format.TestISODateTimeFormat.testFormat_time(TestISODateTimeFormat.java:119)

testFormat_timeNoMillis(org.joda.time.format.TestISODateTimeFormat)  Time elapsed: 0 sec  <<< FAILURE!
junit.framework.ComparisonFailure: expected:<11:20:30+01:00[]> but was:<11:20:30+01:00[:00]>
	at junit.framework.Assert.assertEquals(Assert.java:81)
	at junit.framework.Assert.assertEquals(Assert.java:87)
	at org.joda.time.format.TestISODateTimeFormat.testFormat_timeNoMillis(TestISODateTimeFormat.java:138)

testFormat_tTime(org.joda.time.format.TestISODateTimeFormat)  Time elapsed: 0.001 sec  <<< FAILURE!
junit.framework.ComparisonFailure: expected:<T11:20:30.040+01:00[]> but was:<T11:20:30.040+01:00[:00]>
	at junit.framework.Assert.assertEquals(Assert.java:81)
	at junit.framework.Assert.assertEquals(Assert.java:87)
	at org.joda.time.format.TestISODateTimeFormat.testFormat_tTime(TestISODateTimeFormat.java:157)

testFormat_tTimeNoMillis(org.joda.time.format.TestISODateTimeFormat)  Time elapsed: 0 sec  <<< FAILURE!
junit.framework.ComparisonFailure: expected:<T11:20:30+01:00[]> but was:<T11:20:30+01:00[:00]>
	at junit.framework.Assert.assertEquals(Assert.java:81)
	at junit.framework.Assert.assertEquals(Assert.java:87)
	at org.joda.time.format.TestISODateTimeFormat.testFormat_tTimeNoMillis(TestISODateTimeFormat.java:168)

testFormat_dateTime(org.joda.time.format.TestISODateTimeFormat)  Time elapsed: 0.001 sec  <<< FAILURE!
junit.framework.ComparisonFailure: expected:<...9T11:20:30.040+01:00[]> but was:<...9T11:20:30.040+01:00[:00]>
	at junit.framework.Assert.assertEquals(Assert.java:81)
	at junit.framework.Assert.assertEquals(Assert.java:87)
	at org.joda.time.format.TestISODateTimeFormat.testFormat_dateTime(TestISODateTimeFormat.java:179)

testFormat_dateTimeNoMillis(org.joda.time.format.TestISODateTimeFormat)  Time elapsed: 0.001 sec  <<< FAILURE!
junit.framework.ComparisonFailure: expected:<...06-09T11:20:30+01:00[]> but was:<...06-09T11:20:30+01:00[:00]>
	at junit.framework.Assert.assertEquals(Assert.java:81)
	at junit.framework.Assert.assertEquals(Assert.java:87)
	at org.joda.time.format.TestISODateTimeFormat.testFormat_dateTimeNoMillis(TestISODateTimeFormat.java:202)

testFormat_ordinalDateTime(org.joda.time.format.TestISODateTimeFormat)  Time elapsed: 0.001 sec  <<< FAILURE!
junit.framework.ComparisonFailure: expected:<...1T11:20:30.040+01:00[]> but was:<...1T11:20:30.040+01:00[:00]>
	at junit.framework.Assert.assertEquals(Assert.java:81)
	at junit.framework.Assert.assertEquals(Assert.java:87)
	at org.joda.time.format.TestISODateTimeFormat.testFormat_ordinalDateTime(TestISODateTimeFormat.java:224)

testFormat_ordinalDateTimeNoMillis(org.joda.time.format.TestISODateTimeFormat)  Time elapsed: 0 sec  <<< FAILURE!
junit.framework.ComparisonFailure: expected:<...4-161T11:20:30+01:00[]> but was:<...4-161T11:20:30+01:00[:00]>
	at junit.framework.Assert.assertEquals(Assert.java:81)
	at junit.framework.Assert.assertEquals(Assert.java:87)
	at org.joda.time.format.TestISODateTimeFormat.testFormat_ordinalDateTimeNoMillis(TestISODateTimeFormat.java:235)

testFormat_weekDateTime(org.joda.time.format.TestISODateTimeFormat)  Time elapsed: 0.001 sec  <<< FAILURE!
junit.framework.ComparisonFailure: expected:<...3T11:20:30.040+01:00[]> but was:<...3T11:20:30.040+01:00[:00]>
	at junit.framework.Assert.assertEquals(Assert.java:81)
	at junit.framework.Assert.assertEquals(Assert.java:87)
	at org.joda.time.format.TestISODateTimeFormat.testFormat_weekDateTime(TestISODateTimeFormat.java:257)

testFormat_weekDateTimeNoMillis(org.joda.time.format.TestISODateTimeFormat)  Time elapsed: 0.001 sec  <<< FAILURE!
junit.framework.ComparisonFailure: expected:<...W24-3T11:20:30+01:00[]> but was:<...W24-3T11:20:30+01:00[:00]>
	at junit.framework.Assert.assertEquals(Assert.java:81)
	at junit.framework.Assert.assertEquals(Assert.java:87)
	at org.joda.time.format.TestISODateTimeFormat.testFormat_weekDateTimeNoMillis(TestISODateTimeFormat.java:268)

test_appendTimeZoneOffset_print_min1max3(org.joda.time.format.TestDateTimeFormatterBuilder)  Time elapsed: 0.001 sec  <<< FAILURE!
junit.framework.ComparisonFailure: expected:<+02:30[:12]> but was:<+02:30[]>
	at junit.framework.Assert.assertEquals(Assert.java:81)
	at junit.framework.Assert.assertEquals(Assert.java:87)
	at org.joda.time.format.TestDateTimeFormatterBuilder.assertPrint(TestDateTimeFormatterBuilder.java:672)
	at org.joda.time.format.TestDateTimeFormatterBuilder.test_appendTimeZoneOffset_print_min1max3(TestDateTimeFormatterBuilder.java:351)

test_appendTimeZoneOffset_print_min2max3(org.joda.time.format.TestDateTimeFormatterBuilder)  Time elapsed: 0.001 sec  <<< FAILURE!
junit.framework.ComparisonFailure: expected:<+02:00[]> but was:<+02:00[:00]>
	at junit.framework.Assert.assertEquals(Assert.java:81)
	at junit.framework.Assert.assertEquals(Assert.java:87)
	at org.joda.time.format.TestDateTimeFormatterBuilder.assertPrint(TestDateTimeFormatterBuilder.java:672)
	at org.joda.time.format.TestDateTimeFormatterBuilder.test_appendTimeZoneOffset_print_min2max3(TestDateTimeFormatterBuilder.java:362)


Results :

Failed tests: 
  org.joda.time.TestDateMidnight_Basics#testToString ComparisonFailure expected:...
  org.joda.time.TestDateMidnight_Basics#testToString_DTFormatter ComparisonFailure
  org.joda.time.TestDateMidnight_Basics#testToString_String ComparisonFailure ex...
  org.joda.time.TestDateMidnight_Basics#testToString_String_String ComparisonFailure
  org.joda.time.TestDateMidnight_Properties#testPropertyRoundCeilingMonthOfYear ComparisonFailure
  org.joda.time.TestDateMidnight_Properties#testPropertyRoundFloorMonthOfYear ComparisonFailure
  org.joda.time.TestDateMidnight_Properties#testPropertyRoundHalfCeilingMonthOfYear ComparisonFailure
  org.joda.time.TestDateMidnight_Properties#testPropertyRoundHalfEvenMonthOfYear ComparisonFailure
  org.joda.time.TestDateMidnight_Properties#testPropertyRoundHalfFloorMonthOfYear ComparisonFailure
  org.joda.time.TestDateMidnight_Properties#testPropertyWithMaximumValueDayOfMonth ComparisonFailure
  org.joda.time.TestDateMidnight_Properties#testPropertyWithMinimumValueDayOfMonth ComparisonFailure
  org.joda.time.TestDateTimeZoneCutover#testDateTimeCreation_athens ComparisonFailure
  org.joda.time.TestDateTimeZoneCutover#testDateTimeCreation_london ComparisonFailure
  org.joda.time.TestDateTimeZoneCutover#testDateTimeCreation_losAngeles ComparisonFailure
  org.joda.time.TestDateTimeZoneCutover#testDateTimeCreation_newYork ComparisonFailure
  org.joda.time.TestDateTimeZoneCutover#testDateTimeCreation_paris ComparisonFailure
  org.joda.time.TestDateTimeZoneCutover#testPlusMillisInDstChange ComparisonFailure
  org.joda.time.TestDateTimeZoneCutover#testPlusMinutesInDstChange ComparisonFailure
  org.joda.time.TestDateTimeZoneCutover#testPlusSecondsInDstChange ComparisonFailure
  org.joda.time.TestDateTimeZoneCutover#testWithHourOfDayInDstChange ComparisonFailure
  org.joda.time.TestDateTimeZoneCutover#testWithMillisOfSecondInDstChange_NewYork_summer ComparisonFailure
  org.joda.time.TestDateTimeZoneCutover#testWithMillisOfSecondInDstChange_NewYork_winter ComparisonFailure
  org.joda.time.TestDateTimeZoneCutover#testWithMillisOfSecondInDstChange_Paris_summer ComparisonFailure
  org.joda.time.TestDateTimeZoneCutover#testWithMillisOfSecondInDstChange_Paris_winter ComparisonFailure
  org.joda.time.TestDateTimeZoneCutover#testWithMinuteOfHourInDstChange ComparisonFailure
  org.joda.time.TestDateTimeZoneCutover#testWithMinuteOfHourInDstChange_mockZone ComparisonFailure
  org.joda.time.TestDateTimeZoneCutover#testWithSecondOfMinuteInDstChange ComparisonFailure
  org.joda.time.TestDateTimeZoneCutover#test_DateTime_JustAfterLastEverOverlap ComparisonFailure
  org.joda.time.TestDateTimeZoneCutover#test_DateTime_addWrapFieldDay_Gaza ComparisonFailure
  org.joda.time.TestDateTimeZoneCutover#test_DateTime_addWrapFieldDay_Turk ComparisonFailure
  org.joda.time.TestDateTimeZoneCutover#test_DateTime_constructor_Moscow_Autumn ComparisonFailure
  org.joda.time.TestDateTimeZoneCutover#test_DateTime_constructor_NewYork_Autumn ComparisonFailure
  org.joda.time.TestDateTimeZoneCutover#test_DateTime_minusDay_Gaza ComparisonFailure
  org.joda.time.TestDateTimeZoneCutover#test_DateTime_minusDay_Turk ComparisonFailure
  org.joda.time.TestDateTimeZoneCutover#test_DateTime_minusHour_Gaza ComparisonFailure
  org.joda.time.TestDateTimeZoneCutover#test_DateTime_minusHour_Guatemata_Autumn ComparisonFailure
  org.joda.time.TestDateTimeZoneCutover#test_DateTime_minusHour_Moscow_Autumn ComparisonFailure
  org.joda.time.TestDateTimeZoneCutover#test_DateTime_minusHour_NewYork_Autumn ComparisonFailure
  org.joda.time.TestDateTimeZoneCutover#test_DateTime_minusHour_Turk ComparisonFailure
  org.joda.time.TestDateTimeZoneCutover#test_DateTime_plusDayMidGap_Gaza ComparisonFailure
  org.joda.time.TestDateTimeZoneCutover#test_DateTime_plusDayMidGap_Turk ComparisonFailure
  org.joda.time.TestDateTimeZoneCutover#test_DateTime_plusDay_Gaza ComparisonFailure
  org.joda.time.TestDateTimeZoneCutover#test_DateTime_plusDay_Turk ComparisonFailure
  org.joda.time.TestDateTimeZoneCutover#test_DateTime_plusHour_Gaza ComparisonFailure
  org.joda.time.TestDateTimeZoneCutover#test_DateTime_plusHour_Guatemata_Autumn ComparisonFailure
  org.joda.time.TestDateTimeZoneCutover#test_DateTime_plusHour_Moscow_Autumn ComparisonFailure
  org.joda.time.TestDateTimeZoneCutover#test_DateTime_plusHour_NewYork_Autumn ComparisonFailure
  org.joda.time.TestDateTimeZoneCutover#test_DateTime_plusHour_Turk ComparisonFailure
  org.joda.time.TestDateTimeZoneCutover#test_DateTime_roundCeiling_Gaza ComparisonFailure
  org.joda.time.TestDateTimeZoneCutover#test_DateTime_roundCeiling_Turk ComparisonFailure
  org.joda.time.TestDateTimeZoneCutover#test_DateTime_roundCeiling_day_NewYork_Autumn_postCutover ComparisonFailure
  org.joda.time.TestDateTimeZoneCutover#test_DateTime_roundCeiling_day_NewYork_Autumn_preCutover ComparisonFailure
  org.joda.time.TestDateTimeZoneCutover#test_DateTime_roundCeiling_day_NewYork_Spring_postCutover ComparisonFailure
  org.joda.time.TestDateTimeZoneCutover#test_DateTime_roundCeiling_day_NewYork_Spring_preCutover ComparisonFailure
  org.joda.time.TestDateTimeZoneCutover#test_DateTime_roundCeiling_hourOfDay_NewYork_Autumn_postCutover ComparisonFailure
  org.joda.time.TestDateTimeZoneCutover#test_DateTime_roundCeiling_hourOfDay_NewYork_Autumn_preCutover ComparisonFailure
  org.joda.time.TestDateTimeZoneCutover#test_DateTime_roundCeiling_hour_NewYork_Spring_postCutover ComparisonFailure
  org.joda.time.TestDateTimeZoneCutover#test_DateTime_roundCeiling_hour_NewYork_Spring_preCutover ComparisonFailure
  org.joda.time.TestDateTimeZoneCutover#test_DateTime_roundCeiling_minuteOfHour_NewYork_Autumn_postCutover ComparisonFailure
  org.joda.time.TestDateTimeZoneCutover#test_DateTime_roundCeiling_minuteOfHour_NewYork_Autumn_preCutover ComparisonFailure
  org.joda.time.TestDateTimeZoneCutover#test_DateTime_roundCeiling_minute_NewYork_Spring_postCutover ComparisonFailure
  org.joda.time.TestDateTimeZoneCutover#test_DateTime_roundCeiling_minute_NewYork_Spring_preCutover ComparisonFailure
  org.joda.time.TestDateTimeZoneCutover#test_DateTime_roundCeiling_secondOfMinute_NewYork_Autumn_postCutover ComparisonFailure
  org.joda.time.TestDateTimeZoneCutover#test_DateTime_roundCeiling_secondOfMinute_NewYork_Autumn_preCutover ComparisonFailure
  org.joda.time.TestDateTimeZoneCutover#test_DateTime_roundFloorNotDST_Turk ComparisonFailure
  org.joda.time.TestDateTimeZoneCutover#test_DateTime_roundFloor_Gaza ComparisonFailure
  org.joda.time.TestDateTimeZoneCutover#test_DateTime_roundFloor_Turk ComparisonFailure
  org.joda.time.TestDateTimeZoneCutover#test_DateTime_roundFloor_day_NewYork_Autumn_postCutover ComparisonFailure
  org.joda.time.TestDateTimeZoneCutover#test_DateTime_roundFloor_day_NewYork_Autumn_preCutover ComparisonFailure
  org.joda.time.TestDateTimeZoneCutover#test_DateTime_roundFloor_day_NewYork_Spring_postCutover ComparisonFailure
  org.joda.time.TestDateTimeZoneCutover#test_DateTime_roundFloor_day_NewYork_Spring_preCutover ComparisonFailure
  org.joda.time.TestDateTimeZoneCutover#test_DateTime_roundFloor_hourOfDay_NewYork_Autumn_postCutover ComparisonFailure
  org.joda.time.TestDateTimeZoneCutover#test_DateTime_roundFloor_hourOfDay_NewYork_Autumn_preCutover ComparisonFailure
  org.joda.time.TestDateTimeZoneCutover#test_DateTime_roundFloor_hour_NewYork_Spring_postCutover ComparisonFailure
  org.joda.time.TestDateTimeZoneCutover#test_DateTime_roundFloor_hour_NewYork_Spring_preCutover ComparisonFailure
  org.joda.time.TestDateTimeZoneCutover#test_DateTime_roundFloor_minuteOfHour_NewYork_Autumn_postCutover ComparisonFailure
  org.joda.time.TestDateTimeZoneCutover#test_DateTime_roundFloor_minuteOfHour_NewYork_Autumn_preCutover ComparisonFailure
  org.joda.time.TestDateTimeZoneCutover#test_DateTime_roundFloor_minute_NewYork_Spring_postCutover ComparisonFailure
  org.joda.time.TestDateTimeZoneCutover#test_DateTime_roundFloor_minute_NewYork_Spring_preCutover ComparisonFailure
  org.joda.time.TestDateTimeZoneCutover#test_DateTime_roundFloor_secondOfMinute_NewYork_Autumn_postCutover ComparisonFailure
  org.joda.time.TestDateTimeZoneCutover#test_DateTime_roundFloor_secondOfMinute_NewYork_Autumn_preCutover ComparisonFailure
  org.joda.time.TestDateTimeZoneCutover#test_DateTime_setHourAcross_Moscow_Spring ComparisonFailure
  org.joda.time.TestDateTimeZoneCutover#test_DateTime_setHourAcross_NewYork_Spring ComparisonFailure
  org.joda.time.TestDateTimeZoneCutover#test_DateTime_setHourBack_Moscow_Spring ComparisonFailure
  org.joda.time.TestDateTimeZoneCutover#test_DateTime_setHourBack_NewYork_Spring ComparisonFailure
  org.joda.time.TestDateTimeZoneCutover#test_DateTime_setHourForward_Moscow_Spring ComparisonFailure
  org.joda.time.TestDateTimeZoneCutover#test_DateTime_setHourForward_NewYork_Spring ComparisonFailure
  org.joda.time.TestDateTimeZoneCutover#test_DateTime_setHourZero_Gaza ComparisonFailure
  org.joda.time.TestDateTimeZoneCutover#test_DateTime_setHourZero_Turk ComparisonFailure
  org.joda.time.TestDateTimeZoneCutover#test_DateTime_withDay_Gaza ComparisonFailure
  org.joda.time.TestDateTimeZoneCutover#test_DateTime_withDay_Turk ComparisonFailure
  org.joda.time.TestDateTimeZoneCutover#test_DateTime_withHourZero_Gaza ComparisonFailure
  org.joda.time.TestDateTimeZoneCutover#test_DateTime_withHourZero_Turk ComparisonFailure
  org.joda.time.TestDateTimeZoneCutover#test_DateTime_withZoneRetainFields_Gaza ComparisonFailure
  org.joda.time.TestDateTimeZoneCutover#test_DateTime_withZoneRetainFields_Turk ComparisonFailure
  org.joda.time.TestDateTimeZoneCutover#test_GuatemataIsCorrect_Autumn ComparisonFailure
  org.joda.time.TestDateTimeZoneCutover#test_MockGazaIsCorrect ComparisonFailure
  org.joda.time.TestDateTimeZoneCutover#test_MockTurkIsCorrect ComparisonFailure
  org.joda.time.TestDateTimeZoneCutover#test_MoscowIsCorrect_Autumn ComparisonFailure
  org.joda.time.TestDateTimeZoneCutover#test_MoscowIsCorrect_Spring ComparisonFailure
  org.joda.time.TestDateTimeZoneCutover#test_MutableDateTime_setZoneRetainFields_Turk ComparisonFailure
  org.joda.time.TestDateTimeZoneCutover#test_MutableDateTime_withZoneRetainFields_Gaza ComparisonFailure
  org.joda.time.TestDateTimeZoneCutover#test_NewYorkIsCorrect_Autumn ComparisonFailure
  org.joda.time.TestDateTimeZoneCutover#test_NewYorkIsCorrect_Spring ComparisonFailure
  org.joda.time.TestDateTimeZoneCutover#test_RioBrancoIsCorrect_Spring ComparisonFailure
  org.joda.time.TestDateTimeZoneCutover#test_getOffsetFromLocal_Gaza ComparisonFailure
  org.joda.time.TestDateTimeZoneCutover#test_getOffsetFromLocal_Guatemata_Autumn ComparisonFailure
  org.joda.time.TestDateTimeZoneCutover#test_getOffsetFromLocal_Moscow_Autumn ComparisonFailure
  org.joda.time.TestDateTimeZoneCutover#test_getOffsetFromLocal_Moscow_Autumn_overlap_mins ComparisonFailure
  org.joda.time.TestDateTimeZoneCutover#test_getOffsetFromLocal_Moscow_Spring ComparisonFailure
  org.joda.time.TestDateTimeZoneCutover#test_getOffsetFromLocal_NewYork_Autumn ComparisonFailure
  org.joda.time.TestDateTimeZoneCutover#test_getOffsetFromLocal_NewYork_Spring ComparisonFailure
  org.joda.time.TestDateTimeZoneCutover#test_getOffsetFromLocal_RioBranco_Spring ComparisonFailure
  org.joda.time.TestDateTimeZoneCutover#test_getOffsetFromLocal_Turk ComparisonFailure
  org.joda.time.TestDateTime_Basics#testToString ComparisonFailure expected:<......
  org.joda.time.TestDateTime_Basics#testToString_DTFormatter ComparisonFailure e...
  org.joda.time.TestDateTime_Basics#testToString_String ComparisonFailure expect...
  org.joda.time.TestDateTime_Basics#testToString_String_Locale ComparisonFailure
  org.joda.time.TestDateTime_Properties#testPropertyAddDayOfMonth ComparisonFailure
  org.joda.time.TestDateTime_Properties#testPropertyAddDayOfWeek ComparisonFailure
  org.joda.time.TestDateTime_Properties#testPropertyAddDayOfYear ComparisonFailure
  org.joda.time.TestDateTime_Properties#testPropertyAddLongDayOfWeek ComparisonFailure
  org.joda.time.TestDateTime_Properties#testPropertyAddMonthOfYear ComparisonFailure
  org.joda.time.TestDateTime_Properties#testPropertyAddWeekOfWeekyear ComparisonFailure
  org.joda.time.TestDateTime_Properties#testPropertyAddWrapFieldDayOfMonth ComparisonFailure
  org.joda.time.TestDateTime_Properties#testPropertyAddWrapFieldDayOfWeek ComparisonFailure
  org.joda.time.TestDateTime_Properties#testPropertyAddWrapFieldDayOfYear ComparisonFailure
  org.joda.time.TestDateTime_Properties#testPropertyAddWrapFieldMonthOfYear ComparisonFailure
  org.joda.time.TestDateTime_Properties#testPropertyAddWrapFieldWeekOfWeekyear ComparisonFailure
  org.joda.time.TestDateTime_Properties#testPropertyAddWrapFieldYear ComparisonFailure
  org.joda.time.TestDateTime_Properties#testPropertyAddYear ComparisonFailure ex...
  org.joda.time.TestDateTime_Properties#testPropertyRoundCeilingHourOfDay ComparisonFailure
  org.joda.time.TestDateTime_Properties#testPropertyRoundFloorHourOfDay ComparisonFailure
  org.joda.time.TestDateTime_Properties#testPropertyRoundHalfCeilingHourOfDay ComparisonFailure
  org.joda.time.TestDateTime_Properties#testPropertyRoundHalfEvenHourOfDay ComparisonFailure
  org.joda.time.TestDateTime_Properties#testPropertyRoundHalfFloorHourOfDay ComparisonFailure
  org.joda.time.TestDateTime_Properties#testPropertySetDayOfMonth ComparisonFailure
  org.joda.time.TestDateTime_Properties#testPropertySetDayOfWeek ComparisonFailure
  org.joda.time.TestDateTime_Properties#testPropertySetDayOfYear ComparisonFailure
  org.joda.time.TestDateTime_Properties#testPropertySetMonthOfYear ComparisonFailure
  org.joda.time.TestDateTime_Properties#testPropertySetTextDayOfMonth ComparisonFailure
  org.joda.time.TestDateTime_Properties#testPropertySetTextDayOfWeek ComparisonFailure
  org.joda.time.TestDateTime_Properties#testPropertySetTextDayOfYear ComparisonFailure
  org.joda.time.TestDateTime_Properties#testPropertySetTextMonthOfYear ComparisonFailure
  org.joda.time.TestDateTime_Properties#testPropertySetTextWeekOfWeekyear ComparisonFailure
  org.joda.time.TestDateTime_Properties#testPropertySetTextYear ComparisonFailure
  org.joda.time.TestDateTime_Properties#testPropertySetWeekOfWeekyear ComparisonFailure
  org.joda.time.TestDateTime_Properties#testPropertySetYear ComparisonFailure ex...
  org.joda.time.TestDateTime_Properties#testPropertyWithMaximumValueDayOfMonth ComparisonFailure
  org.joda.time.TestDateTime_Properties#testPropertyWithMinimumValueDayOfMonth ComparisonFailure
  org.joda.time.TestDateTime_Properties#testPropertyWithMinimumValueMillisOfDayDSTGap ComparisonFailure
  org.joda.time.TestLocalTime_Basics#testToDateTime_RI ComparisonFailure expecte...
  org.joda.time.TestLocalTime_Basics#testToDateTime_nullRI ComparisonFailure exp...
  org.joda.time.TestMutableDateTime_Adds#testAddDays_int1 ComparisonFailure expe...
  org.joda.time.TestMutableDateTime_Adds#testAddDays_int_dstOverlapSummer_addZero ComparisonFailure
  org.joda.time.TestMutableDateTime_Adds#testAddDays_int_dstOverlapWinter_addZero ComparisonFailure
  org.joda.time.TestMutableDateTime_Adds#testAddHours_int1 ComparisonFailure exp...
  org.joda.time.TestMutableDateTime_Adds#testAddHours_int_dstOverlapSummer_addZero ComparisonFailure
  org.joda.time.TestMutableDateTime_Adds#testAddHours_int_dstOverlapWinter_addZero ComparisonFailure
  org.joda.time.TestMutableDateTime_Adds#testAddMillis_int1 ComparisonFailure ex...
  org.joda.time.TestMutableDateTime_Adds#testAddMillis_int_dstOverlapSummer_addZero ComparisonFailure
  org.joda.time.TestMutableDateTime_Adds#testAddMillis_int_dstOverlapWinter_addZero ComparisonFailure
  org.joda.time.TestMutableDateTime_Adds#testAddMinutes_int1 ComparisonFailure e...
  org.joda.time.TestMutableDateTime_Adds#testAddMinutes_int_dstOverlapSummer_addZero ComparisonFailure
  org.joda.time.TestMutableDateTime_Adds#testAddMinutes_int_dstOverlapWinter_addZero ComparisonFailure
  org.joda.time.TestMutableDateTime_Adds#testAddMonths_int_dstOverlapSummer_addZero ComparisonFailure
  org.joda.time.TestMutableDateTime_Adds#testAddMonths_int_dstOverlapWinter_addZero ComparisonFailure
  org.joda.time.TestMutableDateTime_Adds#testAddSeconds_int1 ComparisonFailure e...
  org.joda.time.TestMutableDateTime_Adds#testAddSeconds_int_dstOverlapSummer_addZero ComparisonFailure
  org.joda.time.TestMutableDateTime_Adds#testAddSeconds_int_dstOverlapWinter_addZero ComparisonFailure
  org.joda.time.TestMutableDateTime_Adds#testAddWeeks_int_dstOverlapSummer_addZero ComparisonFailure
  org.joda.time.TestMutableDateTime_Adds#testAddWeeks_int_dstOverlapWinter_addZero ComparisonFailure
  org.joda.time.TestMutableDateTime_Adds#testAddWeekyears_int1 ComparisonFailure
  org.joda.time.TestMutableDateTime_Adds#testAddYears_int1 ComparisonFailure exp...
  org.joda.time.TestMutableDateTime_Adds#testAddYears_int_dstOverlapSummer_addZero ComparisonFailure
  org.joda.time.TestMutableDateTime_Adds#testAddYears_int_dstOverlapWinter_addZero ComparisonFailure
  org.joda.time.TestMutableDateTime_Adds#testAdd_DurationFieldType_int_dstOverlapSummer_addZero ComparisonFailure
  org.joda.time.TestMutableDateTime_Adds#testAdd_DurationFieldType_int_dstOverlapWinter_addZero ComparisonFailure
  org.joda.time.TestMutableDateTime_Adds#testAdd_RP1 ComparisonFailure expected:...
  org.joda.time.TestMutableDateTime_Basics#testRounding1 ComparisonFailure expec...
  org.joda.time.TestMutableDateTime_Basics#testRounding2 ComparisonFailure expec...
  org.joda.time.TestMutableDateTime_Basics#testRounding3 ComparisonFailure expec...
  org.joda.time.TestMutableDateTime_Basics#testRounding4 ComparisonFailure expec...
  org.joda.time.TestMutableDateTime_Basics#testRounding5 ComparisonFailure expec...
  org.joda.time.TestMutableDateTime_Basics#testRounding6 ComparisonFailure expec...
  org.joda.time.TestMutableDateTime_Basics#testToString ComparisonFailure expect...
  org.joda.time.TestMutableDateTime_Basics#testToString_DTFormatter ComparisonFailure
  org.joda.time.TestMutableDateTime_Basics#testToString_String ComparisonFailure
  org.joda.time.TestMutableDateTime_Basics#testToString_String_String ComparisonFailure
  org.joda.time.TestMutableDateTime_Properties#testPropertyAddDayOfMonth ComparisonFailure
  org.joda.time.TestMutableDateTime_Properties#testPropertyAddDayOfWeek ComparisonFailure
  org.joda.time.TestMutableDateTime_Properties#testPropertyAddDayOfYear ComparisonFailure
  org.joda.time.TestMutableDateTime_Properties#testPropertyAddLongDayOfWeek ComparisonFailure
  org.joda.time.TestMutableDateTime_Properties#testPropertyAddWeekOfWeekyear ComparisonFailure
  org.joda.time.TestMutableDateTime_Properties#testPropertyAddWrapFieldDayOfMonth ComparisonFailure
  org.joda.time.TestMutableDateTime_Properties#testPropertyAddWrapFieldDayOfWeek ComparisonFailure
  org.joda.time.TestMutableDateTime_Properties#testPropertyAddWrapFieldYear ComparisonFailure
  org.joda.time.TestMutableDateTime_Properties#testPropertyAddYear ComparisonFailure
  org.joda.time.TestMutableDateTime_Properties#testPropertyRoundCeilingHourOfDay ComparisonFailure
  org.joda.time.TestMutableDateTime_Properties#testPropertyRoundFloorHourOfDay ComparisonFailure
  org.joda.time.TestMutableDateTime_Properties#testPropertyRoundHalfCeilingHourOfDay ComparisonFailure
  org.joda.time.TestMutableDateTime_Properties#testPropertyRoundHalfEvenHourOfDay ComparisonFailure
  org.joda.time.TestMutableDateTime_Properties#testPropertyRoundHalfFloorHourOfDay ComparisonFailure
  org.joda.time.TestMutableDateTime_Properties#testPropertySetDayOfMonth ComparisonFailure
  org.joda.time.TestMutableDateTime_Properties#testPropertySetDayOfWeek ComparisonFailure
  org.joda.time.TestMutableDateTime_Properties#testPropertySetTextDayOfMonth ComparisonFailure
  org.joda.time.TestMutableDateTime_Properties#testPropertySetTextDayOfWeek ComparisonFailure
  org.joda.time.TestMutableDateTime_Properties#testPropertySetTextYear ComparisonFailure
  org.joda.time.TestMutableDateTime_Properties#testPropertySetYear ComparisonFailure
  org.joda.time.TestMutableDateTime_Sets#testSetDayOfMonth_int1 ComparisonFailure
  org.joda.time.TestMutableDateTime_Sets#testSetDayOfMonth_int2 ComparisonFailure
  org.joda.time.TestMutableDateTime_Sets#testSetDayOfMonth_int_dstOverlapSummer_addZero ComparisonFailure
  org.joda.time.TestMutableDateTime_Sets#testSetDayOfMonth_int_dstOverlapWinter_addZero ComparisonFailure
  org.joda.time.TestMutableDateTime_Sets#testSetDayOfWeek_int1 ComparisonFailure
  org.joda.time.TestMutableDateTime_Sets#testSetDayOfWeek_int2 ComparisonFailure
  org.joda.time.TestMutableDateTime_Sets#testSetDayOfYear_int2 ComparisonFailure
  org.joda.time.TestMutableDateTime_Sets#testSetDayOfYear_int_dstOverlapSummer_addZero ComparisonFailure
  org.joda.time.TestMutableDateTime_Sets#testSetDayOfYear_int_dstOverlapWinter_addZero ComparisonFailure
  org.joda.time.TestMutableDateTime_Sets#testSetHourOfDay_int1 ComparisonFailure
  org.joda.time.TestMutableDateTime_Sets#testSetHourOfDay_int2 ComparisonFailure
  org.joda.time.TestMutableDateTime_Sets#testSetMilliOfDay_int1 ComparisonFailure
  org.joda.time.TestMutableDateTime_Sets#testSetMilliOfDay_int2 ComparisonFailure
  org.joda.time.TestMutableDateTime_Sets#testSetMilliOfSecond_int1 ComparisonFailure
  org.joda.time.TestMutableDateTime_Sets#testSetMilliOfSecond_int2 ComparisonFailure
  org.joda.time.TestMutableDateTime_Sets#testSetMinuteOfDay_int1 ComparisonFailure
  org.joda.time.TestMutableDateTime_Sets#testSetMinuteOfDay_int2 ComparisonFailure
  org.joda.time.TestMutableDateTime_Sets#testSetMinuteOfHour_int1 ComparisonFailure
  org.joda.time.TestMutableDateTime_Sets#testSetMinuteOfHour_int2 ComparisonFailure
  org.joda.time.TestMutableDateTime_Sets#testSetMonthOfYear_int2 ComparisonFailure
  org.joda.time.TestMutableDateTime_Sets#testSetMonthOfYear_int_dstOverlapSummer_addZero ComparisonFailure
  org.joda.time.TestMutableDateTime_Sets#testSetMonthOfYear_int_dstOverlapWinter_addZero ComparisonFailure
  org.joda.time.TestMutableDateTime_Sets#testSetSecondOfDay_int1 ComparisonFailure
  org.joda.time.TestMutableDateTime_Sets#testSetSecondOfDay_int2 ComparisonFailure
  org.joda.time.TestMutableDateTime_Sets#testSetSecondOfMinute_int1 ComparisonFailure
  org.joda.time.TestMutableDateTime_Sets#testSetSecondOfMinute_int2 ComparisonFailure
  org.joda.time.TestMutableDateTime_Sets#testSetWeekOfWeekyear_int2 ComparisonFailure
  org.joda.time.TestMutableDateTime_Sets#testSetWeekyear_int1 ComparisonFailure ...
  org.joda.time.TestMutableDateTime_Sets#testSetYear_int1 ComparisonFailure expe...
  org.joda.time.TestPartial_Basics#testToDateTime_RI ComparisonFailure expected:...
  org.joda.time.TestPartial_Basics#testToDateTime_nullRI ComparisonFailure expec...
  org.joda.time.TestStringConvert#testDateMidnight ComparisonFailure expected:<....
  org.joda.time.TestStringConvert#testDateTime ComparisonFailure expected:<...0T...
  org.joda.time.TestStringConvert#testMutableDateTime ComparisonFailure expected...
  org.joda.time.TestTimeOfDay_Basics#testToDateTime_RI ComparisonFailure expecte...
  org.joda.time.TestTimeOfDay_Basics#testToDateTime_nullRI ComparisonFailure exp...
  org.joda.time.chrono.TestLenientChronology#test_MockTurkIsCorrect ComparisonFailure
  org.joda.time.chrono.TestLenientChronology#test_lenientChrononolgy_Chicago ComparisonFailure
  org.joda.time.chrono.TestLenientChronology#test_lenientChrononolgy_Turk ComparisonFailure
  org.joda.time.format.TestDateTimeFormatter#testPrint_appendableMethods ComparisonFailure
  org.joda.time.format.TestDateTimeFormatter#testPrint_bufferMethods ComparisonFailure
  org.joda.time.format.TestDateTimeFormatter#testPrint_chrono ComparisonFailure ...
  org.joda.time.format.TestDateTimeFormatter#testPrint_chrono_and_zone ComparisonFailure
  org.joda.time.format.TestDateTimeFormatter#testPrint_simple ComparisonFailure ...
  org.joda.time.format.TestDateTimeFormatter#testPrint_writerMethods ComparisonFailure
  org.joda.time.format.TestDateTimeFormatter#testPrint_zone ComparisonFailure ex...
  org.joda.time.format.TestDateTimeFormatterBuilder#test_appendTimeZoneOffset_print_min1max3 ComparisonFailure
  org.joda.time.format.TestDateTimeFormatterBuilder#test_appendTimeZoneOffset_print_min2max3 ComparisonFailure
  org.joda.time.format.TestISODateTimeFormat#testFormat_dateTime ComparisonFailure
  org.joda.time.format.TestISODateTimeFormat#testFormat_dateTimeNoMillis ComparisonFailure
  org.joda.time.format.TestISODateTimeFormat#testFormat_ordinalDateTime ComparisonFailure
  org.joda.time.format.TestISODateTimeFormat#testFormat_ordinalDateTimeNoMillis ComparisonFailure
  org.joda.time.format.TestISODateTimeFormat#testFormat_tTime ComparisonFailure ...
  org.joda.time.format.TestISODateTimeFormat#testFormat_tTimeNoMillis ComparisonFailure
  org.joda.time.format.TestISODateTimeFormat#testFormat_time ComparisonFailure e...
  org.joda.time.format.TestISODateTimeFormat#testFormat_timeNoMillis ComparisonFailure
  org.joda.time.format.TestISODateTimeFormat#testFormat_weekDateTime ComparisonFailure
  org.joda.time.format.TestISODateTimeFormat#testFormat_weekDateTimeNoMillis ComparisonFailure

Tests run: 4157, Failures: 267, Errors: 0, Skipped: 0

[INFO] ------------------------------------------------------------------------
[INFO] BUILD FAILURE
[INFO] ------------------------------------------------------------------------
[INFO] Total time: 16.852s
[INFO] Finished at: Thu Aug 06 07:39:32 BST 2015
[INFO] Final Memory: 8M/213M
[INFO] ------------------------------------------------------------------------
[ERROR] Failed to execute goal org.apache.maven.plugins:maven-surefire-plugin:2.18.1:test (default-test) on project joda-time: There are test failures.
[ERROR] 
[ERROR] Please refer to /home/perham/Study/LittleDarwin/Cases/joda-time-2.8.1/target/surefire-reports for the individual test results.
[ERROR] -> [Help 1]
[ERROR] 
[ERROR] To see the full stack trace of the errors, re-run Maven with the -e switch.
[ERROR] Re-run Maven using the -X switch to enable full debug logging.
[ERROR] 
[ERROR] For more information about the errors and possible solutions, please read the following articles:
[ERROR] [Help 1] http://cwiki.apache.org/confluence/display/MAVEN/MojoFailureException
