[INFO] Scanning for projects...
[INFO]                                                                         
[INFO] ------------------------------------------------------------------------
[INFO] Building Joda-Time 2.8.1
[INFO] ------------------------------------------------------------------------
[INFO] 
[INFO] --- maven-resources-plugin:2.7:resources (default-resources) @ joda-time ---
[INFO] Using 'UTF-8' encoding to copy filtered resources.
[INFO] Copying 2 resources to META-INF
[INFO] Copying 10 resources
[INFO] 
[INFO] --- maven-compiler-plugin:3.3:compile (default-compile) @ joda-time ---
[INFO] Changes detected - recompiling the module!
[INFO] Compiling 166 source files to /home/perham/Study/LittleDarwin/Cases/joda-time-2.8.1/target/classes
[INFO] 
[INFO] --- exec-maven-plugin:1.4.0:java (compile-tzdb) @ joda-time ---
Writing zoneinfo files
Writing ZoneInfoMap
[INFO] 
[INFO] --- maven-resources-plugin:2.7:testResources (default-testResources) @ joda-time ---
[INFO] Using 'UTF-8' encoding to copy filtered resources.
[INFO] Copying 34 resources
[INFO] 
[INFO] --- maven-compiler-plugin:3.3:testCompile (default-testCompile) @ joda-time ---
[INFO] Nothing to compile - all classes are up to date
[INFO] 
[INFO] --- maven-surefire-plugin:2.18.1:test (default-test) @ joda-time ---
[INFO] Surefire report directory: /home/perham/Study/LittleDarwin/Cases/joda-time-2.8.1/target/surefire-reports

-------------------------------------------------------
 T E S T S
-------------------------------------------------------
Running org.joda.time.TestAllPackages

TestBuddhistChronology.testCalendar

TestCopticChronology.testCalendar

TestEthiopicChronology.testCalendar

TestIslamicChronology.testCalendar

Testing Gregorian chronology over 1000 iterations
100% complete (i=1000)

Testing Julian chronology over 1000 iterations
100% complete (i=1000)
Writing zoneinfo files
Writing ZoneInfoMap
Tests run: 4157, Failures: 5, Errors: 42, Skipped: 0, Time elapsed: 5.385 sec <<< FAILURE! - in org.joda.time.TestAllPackages
testMinYear(org.joda.time.chrono.TestISOChronology)  Time elapsed: 0.004 sec  <<< ERROR!
java.lang.IllegalArgumentException: Invalid format: "-292275054-01-01T00:00:00.000Z" is malformed at "Z"
	at org.joda.time.format.DateTimeParserBucket.doParseMillis(DateTimeParserBucket.java:187)
	at org.joda.time.format.DateTimeFormatter.parseMillis(DateTimeFormatter.java:780)
	at org.joda.time.convert.StringConverter.getInstantMillis(StringConverter.java:65)
	at org.joda.time.base.BaseDateTime.<init>(BaseDateTime.java:175)
	at org.joda.time.DateTime.<init>(DateTime.java:302)
	at org.joda.time.chrono.TestISOChronology.testMinYear(TestISOChronology.java:357)

testMaxYear(org.joda.time.chrono.TestISOChronology)  Time elapsed: 0.001 sec  <<< ERROR!
java.lang.IllegalArgumentException: Invalid format: "292278993-01-01T00:00:00.000Z" is malformed at "Z"
	at org.joda.time.format.DateTimeParserBucket.doParseMillis(DateTimeParserBucket.java:187)
	at org.joda.time.format.DateTimeFormatter.parseMillis(DateTimeFormatter.java:780)
	at org.joda.time.convert.StringConverter.getInstantMillis(StringConverter.java:65)
	at org.joda.time.base.BaseDateTime.<init>(BaseDateTime.java:175)
	at org.joda.time.DateTime.<init>(DateTime.java:302)
	at org.joda.time.chrono.TestISOChronology.testMaxYear(TestISOChronology.java:324)

testPrinterParserMethods(org.joda.time.format.TestDateTimeFormatter)  Time elapsed: 0.002 sec  <<< ERROR!
java.lang.IllegalArgumentException: Invalid format: "Thu 1970-01-01T00:00:00Z" is malformed at "0Z"
	at org.joda.time.format.DateTimeFormatter.parseDateTime(DateTimeFormatter.java:899)
	at org.joda.time.format.TestDateTimeFormatter.testPrinterParserMethods(TestDateTimeFormatter.java:338)

testParseLocalDate_simple(org.joda.time.format.TestDateTimeFormatter)  Time elapsed: 0 sec  <<< ERROR!
java.lang.IllegalArgumentException: Invalid format: "2004-06-09T10:20:30Z" is malformed at "0Z"
	at org.joda.time.format.DateTimeFormatter.parseLocalDateTime(DateTimeFormatter.java:854)
	at org.joda.time.format.DateTimeFormatter.parseLocalDate(DateTimeFormatter.java:798)
	at org.joda.time.format.TestDateTimeFormatter.testParseLocalDate_simple(TestDateTimeFormatter.java:365)

testParseLocalTime_simple(org.joda.time.format.TestDateTimeFormatter)  Time elapsed: 0 sec  <<< ERROR!
java.lang.IllegalArgumentException: Invalid format: "2004-06-09T10:20:30Z" is malformed at "0Z"
	at org.joda.time.format.DateTimeFormatter.parseLocalDateTime(DateTimeFormatter.java:854)
	at org.joda.time.format.DateTimeFormatter.parseLocalTime(DateTimeFormatter.java:816)
	at org.joda.time.format.TestDateTimeFormatter.testParseLocalTime_simple(TestDateTimeFormatter.java:495)

testParseLocalDateTime_simple(org.joda.time.format.TestDateTimeFormatter)  Time elapsed: 0.001 sec  <<< ERROR!
java.lang.IllegalArgumentException: Invalid format: "2004-06-09T10:20:30Z" is malformed at "0Z"
	at org.joda.time.format.DateTimeFormatter.parseLocalDateTime(DateTimeFormatter.java:854)
	at org.joda.time.format.TestDateTimeFormatter.testParseLocalDateTime_simple(TestDateTimeFormatter.java:508)

testParseDateTime_simple(org.joda.time.format.TestDateTimeFormatter)  Time elapsed: 0.002 sec  <<< ERROR!
java.lang.IllegalArgumentException: Invalid format: "2004-06-09T10:20:30Z" is malformed at "0Z"
	at org.joda.time.format.DateTimeFormatter.parseDateTime(DateTimeFormatter.java:899)
	at org.joda.time.format.TestDateTimeFormatter.testParseDateTime_simple(TestDateTimeFormatter.java:544)

testParseDateTime_zone(org.joda.time.format.TestDateTimeFormatter)  Time elapsed: 0 sec  <<< ERROR!
java.lang.IllegalArgumentException: Invalid format: "2004-06-09T10:20:30Z" is malformed at "0Z"
	at org.joda.time.format.DateTimeFormatter.parseDateTime(DateTimeFormatter.java:899)
	at org.joda.time.format.TestDateTimeFormatter.testParseDateTime_zone(TestDateTimeFormatter.java:555)

testParseDateTime_simple_precedence(org.joda.time.format.TestDateTimeFormatter)  Time elapsed: 0 sec  <<< ERROR!
java.lang.IllegalArgumentException: Invalid format: "Wed 2004-06-09T10:20:30Z" is malformed at "0Z"
	at org.joda.time.format.DateTimeFormatter.parseDateTime(DateTimeFormatter.java:899)
	at org.joda.time.format.TestDateTimeFormatter.testParseDateTime_simple_precedence(TestDateTimeFormatter.java:598)

testParseDateTime_offsetParsed(org.joda.time.format.TestDateTimeFormatter)  Time elapsed: 0 sec  <<< ERROR!
java.lang.IllegalArgumentException: Invalid format: "2004-06-09T10:20:30Z" is malformed at "0Z"
	at org.joda.time.format.DateTimeFormatter.parseDateTime(DateTimeFormatter.java:899)
	at org.joda.time.format.TestDateTimeFormatter.testParseDateTime_offsetParsed(TestDateTimeFormatter.java:609)

testParseDateTime_chrono(org.joda.time.format.TestDateTimeFormatter)  Time elapsed: 0.001 sec  <<< ERROR!
java.lang.IllegalArgumentException: Invalid format: "2004-06-09T10:20:30Z" is malformed at "0Z"
	at org.joda.time.format.DateTimeFormatter.parseDateTime(DateTimeFormatter.java:899)
	at org.joda.time.format.TestDateTimeFormatter.testParseDateTime_chrono(TestDateTimeFormatter.java:623)

testParseMutableDateTime_simple(org.joda.time.format.TestDateTimeFormatter)  Time elapsed: 0.001 sec  <<< ERROR!
java.lang.IllegalArgumentException: Invalid format: "2004-06-09T10:20:30Z" is malformed at "0Z"
	at org.joda.time.format.DateTimeFormatter.parseMutableDateTime(DateTimeFormatter.java:944)
	at org.joda.time.format.TestDateTimeFormatter.testParseMutableDateTime_simple(TestDateTimeFormatter.java:639)

testParseMutableDateTime_zone(org.joda.time.format.TestDateTimeFormatter)  Time elapsed: 0 sec  <<< ERROR!
java.lang.IllegalArgumentException: Invalid format: "2004-06-09T10:20:30Z" is malformed at "0Z"
	at org.joda.time.format.DateTimeFormatter.parseMutableDateTime(DateTimeFormatter.java:944)
	at org.joda.time.format.TestDateTimeFormatter.testParseMutableDateTime_zone(TestDateTimeFormatter.java:650)

testParseMutableDateTime_simple_precedence(org.joda.time.format.TestDateTimeFormatter)  Time elapsed: 0.001 sec  <<< ERROR!
java.lang.IllegalArgumentException: Invalid format: "Wed 2004-06-09T10:20:30Z" is malformed at "0Z"
	at org.joda.time.format.DateTimeFormatter.parseDateTime(DateTimeFormatter.java:899)
	at org.joda.time.format.TestDateTimeFormatter.testParseMutableDateTime_simple_precedence(TestDateTimeFormatter.java:693)

testParseMutableDateTime_offsetParsed(org.joda.time.format.TestDateTimeFormatter)  Time elapsed: 0.001 sec  <<< ERROR!
java.lang.IllegalArgumentException: Invalid format: "2004-06-09T10:20:30Z" is malformed at "0Z"
	at org.joda.time.format.DateTimeFormatter.parseMutableDateTime(DateTimeFormatter.java:944)
	at org.joda.time.format.TestDateTimeFormatter.testParseMutableDateTime_offsetParsed(TestDateTimeFormatter.java:704)

testParseMutableDateTime_chrono(org.joda.time.format.TestDateTimeFormatter)  Time elapsed: 0.001 sec  <<< ERROR!
java.lang.IllegalArgumentException: Invalid format: "2004-06-09T10:20:30Z" is malformed at "0Z"
	at org.joda.time.format.DateTimeFormatter.parseMutableDateTime(DateTimeFormatter.java:944)
	at org.joda.time.format.TestDateTimeFormatter.testParseMutableDateTime_chrono(TestDateTimeFormatter.java:718)

testParseInto_simple(org.joda.time.format.TestDateTimeFormatter)  Time elapsed: 0.001 sec  <<< FAILURE!
junit.framework.AssertionFailedError: expected:<20> but was:<18>
	at junit.framework.Assert.fail(Assert.java:47)
	at junit.framework.Assert.failNotEquals(Assert.java:280)
	at junit.framework.Assert.assertEquals(Assert.java:64)
	at junit.framework.Assert.assertEquals(Assert.java:198)
	at junit.framework.Assert.assertEquals(Assert.java:204)
	at org.joda.time.format.TestDateTimeFormatter.testParseInto_simple(TestDateTimeFormatter.java:735)

testParseInto_zone(org.joda.time.format.TestDateTimeFormatter)  Time elapsed: 0 sec  <<< FAILURE!
junit.framework.AssertionFailedError: expected:<20> but was:<18>
	at junit.framework.Assert.fail(Assert.java:47)
	at junit.framework.Assert.failNotEquals(Assert.java:280)
	at junit.framework.Assert.assertEquals(Assert.java:64)
	at junit.framework.Assert.assertEquals(Assert.java:198)
	at junit.framework.Assert.assertEquals(Assert.java:204)
	at org.joda.time.format.TestDateTimeFormatter.testParseInto_zone(TestDateTimeFormatter.java:753)

testParseInto_simple_precedence(org.joda.time.format.TestDateTimeFormatter)  Time elapsed: 0 sec  <<< FAILURE!
junit.framework.AssertionFailedError: expected:<24> but was:<22>
	at junit.framework.Assert.fail(Assert.java:47)
	at junit.framework.Assert.failNotEquals(Assert.java:280)
	at junit.framework.Assert.assertEquals(Assert.java:64)
	at junit.framework.Assert.assertEquals(Assert.java:198)
	at junit.framework.Assert.assertEquals(Assert.java:204)
	at org.joda.time.format.TestDateTimeFormatter.testParseInto_simple_precedence(TestDateTimeFormatter.java:815)

testParseInto_offsetParsed(org.joda.time.format.TestDateTimeFormatter)  Time elapsed: 0.001 sec  <<< FAILURE!
junit.framework.AssertionFailedError: expected:<20> but was:<18>
	at junit.framework.Assert.fail(Assert.java:47)
	at junit.framework.Assert.failNotEquals(Assert.java:280)
	at junit.framework.Assert.assertEquals(Assert.java:64)
	at junit.framework.Assert.assertEquals(Assert.java:198)
	at junit.framework.Assert.assertEquals(Assert.java:204)
	at org.joda.time.format.TestDateTimeFormatter.testParseInto_offsetParsed(TestDateTimeFormatter.java:824)

testParseInto_chrono(org.joda.time.format.TestDateTimeFormatter)  Time elapsed: 0 sec  <<< FAILURE!
junit.framework.AssertionFailedError: expected:<20> but was:<18>
	at junit.framework.Assert.fail(Assert.java:47)
	at junit.framework.Assert.failNotEquals(Assert.java:280)
	at junit.framework.Assert.assertEquals(Assert.java:64)
	at junit.framework.Assert.assertEquals(Assert.java:198)
	at junit.framework.Assert.assertEquals(Assert.java:204)
	at org.joda.time.format.TestDateTimeFormatter.testParseInto_chrono(TestDateTimeFormatter.java:847)

testFormatParse_zoneId_noColon_parseZ(org.joda.time.format.TestDateTimeFormat)  Time elapsed: 0 sec  <<< ERROR!
java.lang.IllegalArgumentException: Invalid format: "01:02 Z" is malformed at " Z"
	at org.joda.time.format.DateTimeFormatter.parseDateTime(DateTimeFormatter.java:899)
	at org.joda.time.format.TestDateTimeFormat.testFormatParse_zoneId_noColon_parseZ(TestDateTimeFormat.java:1150)

testFormatParse_zoneId_colon_parseZ(org.joda.time.format.TestDateTimeFormat)  Time elapsed: 0.001 sec  <<< ERROR!
java.lang.IllegalArgumentException: Invalid format: "01:02 Z" is malformed at " Z"
	at org.joda.time.format.DateTimeFormatter.parseDateTime(DateTimeFormatter.java:899)
	at org.joda.time.format.TestDateTimeFormat.testFormatParse_zoneId_colon_parseZ(TestDateTimeFormat.java:1166)

test_time(org.joda.time.format.TestISODateTimeFormatParsing)  Time elapsed: 0.001 sec  <<< ERROR!
java.lang.IllegalArgumentException: Invalid format: "10:20:30.400999999Z" is malformed at "9Z"
	at org.joda.time.format.DateTimeFormatter.parseDateTime(DateTimeFormatter.java:899)
	at org.joda.time.format.TestISODateTimeFormatParsing.assertParse(TestISODateTimeFormatParsing.java:840)
	at org.joda.time.format.TestISODateTimeFormatParsing.test_time(TestISODateTimeFormatParsing.java:375)

test_timeNoMillis(org.joda.time.format.TestISODateTimeFormatParsing)  Time elapsed: 0 sec  <<< ERROR!
java.lang.IllegalArgumentException: Invalid format: "10:20:30Z" is malformed at "0Z"
	at org.joda.time.format.DateTimeFormatter.parseDateTime(DateTimeFormatter.java:899)
	at org.joda.time.format.TestISODateTimeFormatParsing.assertParse(TestISODateTimeFormatParsing.java:840)
	at org.joda.time.format.TestISODateTimeFormatParsing.test_timeNoMillis(TestISODateTimeFormatParsing.java:390)

test_tTime(org.joda.time.format.TestISODateTimeFormatParsing)  Time elapsed: 0.001 sec  <<< ERROR!
java.lang.IllegalArgumentException: Invalid format: "T10:20:30.400999999Z" is malformed at "9Z"
	at org.joda.time.format.DateTimeFormatter.parseDateTime(DateTimeFormatter.java:899)
	at org.joda.time.format.TestISODateTimeFormatParsing.assertParse(TestISODateTimeFormatParsing.java:840)
	at org.joda.time.format.TestISODateTimeFormatParsing.test_tTime(TestISODateTimeFormatParsing.java:402)

test_tTimeNoMillis(org.joda.time.format.TestISODateTimeFormatParsing)  Time elapsed: 0 sec  <<< ERROR!
java.lang.IllegalArgumentException: Invalid format: "T10:20:30Z" is malformed at "0Z"
	at org.joda.time.format.DateTimeFormatter.parseDateTime(DateTimeFormatter.java:899)
	at org.joda.time.format.TestISODateTimeFormatParsing.assertParse(TestISODateTimeFormatParsing.java:840)
	at org.joda.time.format.TestISODateTimeFormatParsing.test_tTimeNoMillis(TestISODateTimeFormatParsing.java:417)

test_dateTime(org.joda.time.format.TestISODateTimeFormatParsing)  Time elapsed: 0.001 sec  <<< ERROR!
java.lang.IllegalArgumentException: Invalid format: "2006-02-04T10:20:30.400999999Z" is malformed at "9Z"
	at org.joda.time.format.DateTimeFormatter.parseDateTime(DateTimeFormatter.java:899)
	at org.joda.time.format.TestISODateTimeFormatParsing.assertParse(TestISODateTimeFormatParsing.java:840)
	at org.joda.time.format.TestISODateTimeFormatParsing.test_dateTime(TestISODateTimeFormatParsing.java:429)

test_dateTimeNoMillis(org.joda.time.format.TestISODateTimeFormatParsing)  Time elapsed: 0 sec  <<< ERROR!
java.lang.IllegalArgumentException: Invalid format: "2006-02-04T10:20:30Z" is malformed at "0Z"
	at org.joda.time.format.DateTimeFormatter.parseDateTime(DateTimeFormatter.java:899)
	at org.joda.time.format.TestISODateTimeFormatParsing.assertParse(TestISODateTimeFormatParsing.java:840)
	at org.joda.time.format.TestISODateTimeFormatParsing.test_dateTimeNoMillis(TestISODateTimeFormatParsing.java:454)

test_ordinalDateTime(org.joda.time.format.TestISODateTimeFormatParsing)  Time elapsed: 0 sec  <<< ERROR!
java.lang.IllegalArgumentException: Invalid format: "2006-123T10:20:30.400999999Z" is malformed at "9Z"
	at org.joda.time.format.DateTimeFormatter.parseDateTime(DateTimeFormatter.java:899)
	at org.joda.time.format.TestISODateTimeFormatParsing.assertParse(TestISODateTimeFormatParsing.java:840)
	at org.joda.time.format.TestISODateTimeFormatParsing.test_ordinalDateTime(TestISODateTimeFormatParsing.java:486)

test_ordinalDateTimeNoMillis(org.joda.time.format.TestISODateTimeFormatParsing)  Time elapsed: 0.001 sec  <<< ERROR!
java.lang.IllegalArgumentException: Invalid format: "2006-123T10:20:30Z" is malformed at "0Z"
	at org.joda.time.format.DateTimeFormatter.parseDateTime(DateTimeFormatter.java:899)
	at org.joda.time.format.TestISODateTimeFormatParsing.assertParse(TestISODateTimeFormatParsing.java:840)
	at org.joda.time.format.TestISODateTimeFormatParsing.test_ordinalDateTimeNoMillis(TestISODateTimeFormatParsing.java:505)

test_weekDateTime(org.joda.time.format.TestISODateTimeFormatParsing)  Time elapsed: 0.001 sec  <<< ERROR!
java.lang.IllegalArgumentException: Invalid format: "2006-W27-3T10:20:30.400999999Z" is malformed at "9Z"
	at org.joda.time.format.DateTimeFormatter.parseDateTime(DateTimeFormatter.java:899)
	at org.joda.time.format.TestISODateTimeFormatParsing.assertParse(TestISODateTimeFormatParsing.java:840)
	at org.joda.time.format.TestISODateTimeFormatParsing.test_weekDateTime(TestISODateTimeFormatParsing.java:533)

test_weekDateTimeNoMillis(org.joda.time.format.TestISODateTimeFormatParsing)  Time elapsed: 0.001 sec  <<< ERROR!
java.lang.IllegalArgumentException: Invalid format: "2006-W27-3T10:20:30Z" is malformed at "0Z"
	at org.joda.time.format.DateTimeFormatter.parseDateTime(DateTimeFormatter.java:899)
	at org.joda.time.format.TestISODateTimeFormatParsing.assertParse(TestISODateTimeFormatParsing.java:840)
	at org.joda.time.format.TestISODateTimeFormatParsing.test_weekDateTimeNoMillis(TestISODateTimeFormatParsing.java:553)

test_basicTime(org.joda.time.format.TestISODateTimeFormatParsing)  Time elapsed: 0.001 sec  <<< ERROR!
java.lang.IllegalArgumentException: Invalid format: "102030.400999999Z" is malformed at "9Z"
	at org.joda.time.format.DateTimeFormatter.parseDateTime(DateTimeFormatter.java:899)
	at org.joda.time.format.TestISODateTimeFormatParsing.assertParse(TestISODateTimeFormatParsing.java:840)
	at org.joda.time.format.TestISODateTimeFormatParsing.test_basicTime(TestISODateTimeFormatParsing.java:582)

test_basicTimeNoMillis(org.joda.time.format.TestISODateTimeFormatParsing)  Time elapsed: 0.001 sec  <<< ERROR!
java.lang.IllegalArgumentException: Invalid format: "102030Z" is malformed at "0Z"
	at org.joda.time.format.DateTimeFormatter.parseDateTime(DateTimeFormatter.java:899)
	at org.joda.time.format.TestISODateTimeFormatParsing.assertParse(TestISODateTimeFormatParsing.java:840)
	at org.joda.time.format.TestISODateTimeFormatParsing.test_basicTimeNoMillis(TestISODateTimeFormatParsing.java:597)

test_basicTTime(org.joda.time.format.TestISODateTimeFormatParsing)  Time elapsed: 0 sec  <<< ERROR!
java.lang.IllegalArgumentException: Invalid format: "T102030.400999999Z" is malformed at "9Z"
	at org.joda.time.format.DateTimeFormatter.parseDateTime(DateTimeFormatter.java:899)
	at org.joda.time.format.TestISODateTimeFormatParsing.assertParse(TestISODateTimeFormatParsing.java:840)
	at org.joda.time.format.TestISODateTimeFormatParsing.test_basicTTime(TestISODateTimeFormatParsing.java:609)

test_basicTTimeNoMillis(org.joda.time.format.TestISODateTimeFormatParsing)  Time elapsed: 0.001 sec  <<< ERROR!
java.lang.IllegalArgumentException: Invalid format: "T102030Z" is malformed at "0Z"
	at org.joda.time.format.DateTimeFormatter.parseDateTime(DateTimeFormatter.java:899)
	at org.joda.time.format.TestISODateTimeFormatParsing.assertParse(TestISODateTimeFormatParsing.java:840)
	at org.joda.time.format.TestISODateTimeFormatParsing.test_basicTTimeNoMillis(TestISODateTimeFormatParsing.java:624)

test_basicDateTime(org.joda.time.format.TestISODateTimeFormatParsing)  Time elapsed: 0.001 sec  <<< ERROR!
java.lang.IllegalArgumentException: Invalid format: "20061204T102030.400999999Z" is malformed at "9Z"
	at org.joda.time.format.DateTimeFormatter.parseDateTime(DateTimeFormatter.java:899)
	at org.joda.time.format.TestISODateTimeFormatParsing.assertParse(TestISODateTimeFormatParsing.java:840)
	at org.joda.time.format.TestISODateTimeFormatParsing.test_basicDateTime(TestISODateTimeFormatParsing.java:636)

test_basicDateTimeNoMillis(org.joda.time.format.TestISODateTimeFormatParsing)  Time elapsed: 0 sec  <<< ERROR!
java.lang.IllegalArgumentException: Invalid format: "20061204T102030Z" is malformed at "0Z"
	at org.joda.time.format.DateTimeFormatter.parseDateTime(DateTimeFormatter.java:899)
	at org.joda.time.format.TestISODateTimeFormatParsing.assertParse(TestISODateTimeFormatParsing.java:840)
	at org.joda.time.format.TestISODateTimeFormatParsing.test_basicDateTimeNoMillis(TestISODateTimeFormatParsing.java:658)

test_basicOrdinalDateTime(org.joda.time.format.TestISODateTimeFormatParsing)  Time elapsed: 0 sec  <<< ERROR!
java.lang.IllegalArgumentException: Invalid format: "2006123T102030.400999999Z" is malformed at "9Z"
	at org.joda.time.format.DateTimeFormatter.parseDateTime(DateTimeFormatter.java:899)
	at org.joda.time.format.TestISODateTimeFormatParsing.assertParse(TestISODateTimeFormatParsing.java:840)
	at org.joda.time.format.TestISODateTimeFormatParsing.test_basicOrdinalDateTime(TestISODateTimeFormatParsing.java:686)

test_basicOrdinalDateTimeNoMillis(org.joda.time.format.TestISODateTimeFormatParsing)  Time elapsed: 0 sec  <<< ERROR!
java.lang.IllegalArgumentException: Invalid format: "2006123T102030Z" is malformed at "0Z"
	at org.joda.time.format.DateTimeFormatter.parseDateTime(DateTimeFormatter.java:899)
	at org.joda.time.format.TestISODateTimeFormatParsing.assertParse(TestISODateTimeFormatParsing.java:840)
	at org.joda.time.format.TestISODateTimeFormatParsing.test_basicOrdinalDateTimeNoMillis(TestISODateTimeFormatParsing.java:707)

test_basicWeekDateTime(org.joda.time.format.TestISODateTimeFormatParsing)  Time elapsed: 0.001 sec  <<< ERROR!
java.lang.IllegalArgumentException: Invalid format: "2006W273T102030.400999999Z" is malformed at "9Z"
	at org.joda.time.format.DateTimeFormatter.parseDateTime(DateTimeFormatter.java:899)
	at org.joda.time.format.TestISODateTimeFormatParsing.assertParse(TestISODateTimeFormatParsing.java:840)
	at org.joda.time.format.TestISODateTimeFormatParsing.test_basicWeekDateTime(TestISODateTimeFormatParsing.java:734)

test_basicWeekDateTimeNoMillis(org.joda.time.format.TestISODateTimeFormatParsing)  Time elapsed: 0.001 sec  <<< ERROR!
java.lang.IllegalArgumentException: Invalid format: "2006W273T102030Z" is malformed at "0Z"
	at org.joda.time.format.DateTimeFormatter.parseDateTime(DateTimeFormatter.java:899)
	at org.joda.time.format.TestISODateTimeFormatParsing.assertParse(TestISODateTimeFormatParsing.java:840)
	at org.joda.time.format.TestISODateTimeFormatParsing.test_basicWeekDateTimeNoMillis(TestISODateTimeFormatParsing.java:751)

testSerialization(org.joda.time.tz.TestBuilder)  Time elapsed: 0.007 sec  <<< ERROR!
java.lang.IllegalArgumentException: Invalid format: "1883-11-18T19:52:58.000Z" is malformed at "Z"
	at org.joda.time.format.DateTimeParserBucket.doParseMillis(DateTimeParserBucket.java:187)
	at org.joda.time.format.DateTimeFormatter.parseMillis(DateTimeFormatter.java:780)
	at org.joda.time.convert.StringConverter.getInstantMillis(StringConverter.java:65)
	at org.joda.time.base.BaseDateTime.<init>(BaseDateTime.java:175)
	at org.joda.time.DateTime.<init>(DateTime.java:257)
	at org.joda.time.tz.TestBuilder.testForwardTransitions(TestBuilder.java:241)
	at org.joda.time.tz.TestBuilder.testSerialization(TestBuilder.java:282)

testForwardTransitions(org.joda.time.tz.TestBuilder)  Time elapsed: 0.008 sec  <<< ERROR!
java.lang.IllegalArgumentException: Invalid format: "1883-11-18T19:52:58.000Z" is malformed at "Z"
	at org.joda.time.format.DateTimeParserBucket.doParseMillis(DateTimeParserBucket.java:187)
	at org.joda.time.format.DateTimeFormatter.parseMillis(DateTimeFormatter.java:780)
	at org.joda.time.convert.StringConverter.getInstantMillis(StringConverter.java:65)
	at org.joda.time.base.BaseDateTime.<init>(BaseDateTime.java:175)
	at org.joda.time.DateTime.<init>(DateTime.java:257)
	at org.joda.time.tz.TestBuilder.testForwardTransitions(TestBuilder.java:241)
	at org.joda.time.tz.TestBuilder.testForwardTransitions(TestBuilder.java:217)

testReverseTransitions(org.joda.time.tz.TestBuilder)  Time elapsed: 0.019 sec  <<< ERROR!
java.lang.IllegalArgumentException: Invalid format: "1945-08-14T23:00:00.000Z" is malformed at "Z"
	at org.joda.time.format.DateTimeParserBucket.doParseMillis(DateTimeParserBucket.java:187)
	at org.joda.time.format.DateTimeFormatter.parseMillis(DateTimeFormatter.java:780)
	at org.joda.time.convert.StringConverter.getInstantMillis(StringConverter.java:65)
	at org.joda.time.base.BaseDateTime.<init>(BaseDateTime.java:175)
	at org.joda.time.DateTime.<init>(DateTime.java:257)
	at org.joda.time.tz.TestBuilder.testReverseTransitions(TestBuilder.java:265)
	at org.joda.time.tz.TestBuilder.testReverseTransitions(TestBuilder.java:255)

testCompile(org.joda.time.tz.TestCompiler)  Time elapsed: 0.026 sec  <<< ERROR!
java.lang.IllegalArgumentException: Invalid format: "1883-11-18T19:52:58.000Z" is malformed at "Z"
	at org.joda.time.format.DateTimeParserBucket.doParseMillis(DateTimeParserBucket.java:187)
	at org.joda.time.format.DateTimeFormatter.parseMillis(DateTimeFormatter.java:780)
	at org.joda.time.convert.StringConverter.getInstantMillis(StringConverter.java:65)
	at org.joda.time.base.BaseDateTime.<init>(BaseDateTime.java:175)
	at org.joda.time.DateTime.<init>(DateTime.java:257)
	at org.joda.time.tz.TestBuilder.testForwardTransitions(TestBuilder.java:241)
	at org.joda.time.tz.TestCompiler.testCompile(TestCompiler.java:117)


Results :

Failed tests: 
  org.joda.time.format.TestDateTimeFormatter#testParseInto_chrono AssertionFailedError
  org.joda.time.format.TestDateTimeFormatter#testParseInto_offsetParsed AssertionFailedError
  org.joda.time.format.TestDateTimeFormatter#testParseInto_simple AssertionFailedError
  org.joda.time.format.TestDateTimeFormatter#testParseInto_simple_precedence AssertionFailedError
  org.joda.time.format.TestDateTimeFormatter#testParseInto_zone AssertionFailedError
Tests in error: 
  org.joda.time.chrono.TestISOChronology#testMaxYear IllegalArgumentException In...
  org.joda.time.chrono.TestISOChronology#testMinYear IllegalArgumentException In...
  org.joda.time.format.TestDateTimeFormat#testFormatParse_zoneId_colon_parseZ IllegalArgumentException
  org.joda.time.format.TestDateTimeFormat#testFormatParse_zoneId_noColon_parseZ IllegalArgumentException
  org.joda.time.format.TestDateTimeFormatter#testParseDateTime_chrono IllegalArgumentException
  org.joda.time.format.TestDateTimeFormatter#testParseDateTime_offsetParsed IllegalArgumentException
  org.joda.time.format.TestDateTimeFormatter#testParseDateTime_simple IllegalArgumentException
  org.joda.time.format.TestDateTimeFormatter#testParseDateTime_simple_precedence IllegalArgumentException
  org.joda.time.format.TestDateTimeFormatter#testParseDateTime_zone IllegalArgumentException
  org.joda.time.format.TestDateTimeFormatter#testParseLocalDateTime_simple IllegalArgumentException
  org.joda.time.format.TestDateTimeFormatter#testParseLocalDate_simple IllegalArgumentException
  org.joda.time.format.TestDateTimeFormatter#testParseLocalTime_simple IllegalArgumentException
  org.joda.time.format.TestDateTimeFormatter#testParseMutableDateTime_chrono IllegalArgumentException
  org.joda.time.format.TestDateTimeFormatter#testParseMutableDateTime_offsetParsed IllegalArgumentException
  org.joda.time.format.TestDateTimeFormatter#testParseMutableDateTime_simple IllegalArgumentException
  org.joda.time.format.TestDateTimeFormatter#testParseMutableDateTime_simple_precedence IllegalArgumentException
  org.joda.time.format.TestDateTimeFormatter#testParseMutableDateTime_zone IllegalArgumentException
  org.joda.time.format.TestDateTimeFormatter#testPrinterParserMethods IllegalArgumentException
  org.joda.time.format.TestISODateTimeFormatParsing#test_basicDateTime IllegalArgumentException
  org.joda.time.format.TestISODateTimeFormatParsing#test_basicDateTimeNoMillis IllegalArgumentException
  org.joda.time.format.TestISODateTimeFormatParsing#test_basicOrdinalDateTime IllegalArgumentException
  org.joda.time.format.TestISODateTimeFormatParsing#test_basicOrdinalDateTimeNoMillis IllegalArgumentException
  org.joda.time.format.TestISODateTimeFormatParsing#test_basicTTime IllegalArgumentException
  org.joda.time.format.TestISODateTimeFormatParsing#test_basicTTimeNoMillis IllegalArgumentException
  org.joda.time.format.TestISODateTimeFormatParsing#test_basicTime IllegalArgumentException
  org.joda.time.format.TestISODateTimeFormatParsing#test_basicTimeNoMillis IllegalArgumentException
  org.joda.time.format.TestISODateTimeFormatParsing#test_basicWeekDateTime IllegalArgumentException
  org.joda.time.format.TestISODateTimeFormatParsing#test_basicWeekDateTimeNoMillis IllegalArgumentException
  org.joda.time.format.TestISODateTimeFormatParsing#test_dateTime IllegalArgumentException
  org.joda.time.format.TestISODateTimeFormatParsing#test_dateTimeNoMillis IllegalArgumentException
  org.joda.time.format.TestISODateTimeFormatParsing#test_ordinalDateTime IllegalArgumentException
  org.joda.time.format.TestISODateTimeFormatParsing#test_ordinalDateTimeNoMillis IllegalArgumentException
  org.joda.time.format.TestISODateTimeFormatParsing#test_tTime IllegalArgumentException
  org.joda.time.format.TestISODateTimeFormatParsing#test_tTimeNoMillis IllegalArgumentException
  org.joda.time.format.TestISODateTimeFormatParsing#test_time IllegalArgumentException
  org.joda.time.format.TestISODateTimeFormatParsing#test_timeNoMillis IllegalArgumentException
  org.joda.time.format.TestISODateTimeFormatParsing#test_weekDateTime IllegalArgumentException
  org.joda.time.format.TestISODateTimeFormatParsing#test_weekDateTimeNoMillis IllegalArgumentException
  org.joda.time.tz.TestBuilder#testForwardTransitions IllegalArgumentException I...
  org.joda.time.tz.TestBuilder#testReverseTransitions IllegalArgumentException I...
  org.joda.time.tz.TestBuilder#testSerialization IllegalArgumentException Invali...
  org.joda.time.tz.TestCompiler#testCompile IllegalArgumentException Invalid for...

Tests run: 4157, Failures: 5, Errors: 42, Skipped: 0

[INFO] ------------------------------------------------------------------------
[INFO] BUILD FAILURE
[INFO] ------------------------------------------------------------------------
[INFO] Total time: 15.302s
[INFO] Finished at: Thu Aug 06 06:41:21 BST 2015
[INFO] Final Memory: 9M/214M
[INFO] ------------------------------------------------------------------------
[ERROR] Failed to execute goal org.apache.maven.plugins:maven-surefire-plugin:2.18.1:test (default-test) on project joda-time: There are test failures.
[ERROR] 
[ERROR] Please refer to /home/perham/Study/LittleDarwin/Cases/joda-time-2.8.1/target/surefire-reports for the individual test results.
[ERROR] -> [Help 1]
[ERROR] 
[ERROR] To see the full stack trace of the errors, re-run Maven with the -e switch.
[ERROR] Re-run Maven using the -X switch to enable full debug logging.
[ERROR] 
[ERROR] For more information about the errors and possible solutions, please read the following articles:
[ERROR] [Help 1] http://cwiki.apache.org/confluence/display/MAVEN/MojoFailureException
