[INFO] Scanning for projects...
[INFO]                                                                         
[INFO] ------------------------------------------------------------------------
[INFO] Building Joda-Time 2.8.1
[INFO] ------------------------------------------------------------------------
[INFO] 
[INFO] --- maven-resources-plugin:2.7:resources (default-resources) @ joda-time ---
[INFO] Using 'UTF-8' encoding to copy filtered resources.
[INFO] Copying 2 resources to META-INF
[INFO] Copying 10 resources
[INFO] 
[INFO] --- maven-compiler-plugin:3.3:compile (default-compile) @ joda-time ---
[INFO] Changes detected - recompiling the module!
[INFO] Compiling 166 source files to /home/perham/Study/LittleDarwin/Cases/joda-time-2.8.1/target/classes
[INFO] 
[INFO] --- exec-maven-plugin:1.4.0:java (compile-tzdb) @ joda-time ---
Writing zoneinfo files
Writing ZoneInfoMap
[INFO] 
[INFO] --- maven-resources-plugin:2.7:testResources (default-testResources) @ joda-time ---
[INFO] Using 'UTF-8' encoding to copy filtered resources.
[INFO] Copying 34 resources
[INFO] 
[INFO] --- maven-compiler-plugin:3.3:testCompile (default-testCompile) @ joda-time ---
[INFO] Nothing to compile - all classes are up to date
[INFO] 
[INFO] --- maven-surefire-plugin:2.18.1:test (default-test) @ joda-time ---
[INFO] Surefire report directory: /home/perham/Study/LittleDarwin/Cases/joda-time-2.8.1/target/surefire-reports

-------------------------------------------------------
 T E S T S
-------------------------------------------------------
Running org.joda.time.TestAllPackages

TestBuddhistChronology.testCalendar

TestCopticChronology.testCalendar

TestEthiopicChronology.testCalendar

TestIslamicChronology.testCalendar

Testing Gregorian chronology over 1000 iterations
100% complete (i=1000)

Testing Julian chronology over 1000 iterations
100% complete (i=1000)
Writing zoneinfo files
Writing ZoneInfoMap
Tests run: 4157, Failures: 85, Errors: 0, Skipped: 0, Time elapsed: 5.237 sec <<< FAILURE! - in org.joda.time.TestAllPackages
testToString(org.joda.time.TestLocalDateTime_Basics)  Time elapsed: 0.005 sec  <<< FAILURE!
junit.framework.ComparisonFailure: expected:<[2002-06-09T10:20:30.040]> but was:<[]>
	at junit.framework.Assert.assertEquals(Assert.java:81)
	at junit.framework.Assert.assertEquals(Assert.java:87)
	at org.joda.time.TestLocalDateTime_Basics.testToString(TestLocalDateTime_Basics.java:1072)

testToString_String(org.joda.time.TestLocalDateTime_Basics)  Time elapsed: 0 sec  <<< FAILURE!
junit.framework.ComparisonFailure: expected:<[2002 10]> but was:<[]>
	at junit.framework.Assert.assertEquals(Assert.java:81)
	at junit.framework.Assert.assertEquals(Assert.java:87)
	at org.joda.time.TestLocalDateTime_Basics.testToString_String(TestLocalDateTime_Basics.java:1078)

testToString_String_Locale(org.joda.time.TestLocalDateTime_Basics)  Time elapsed: 0 sec  <<< FAILURE!
junit.framework.ComparisonFailure: expected:<[Tue 9/6]> but was:<[]>
	at junit.framework.Assert.assertEquals(Assert.java:81)
	at junit.framework.Assert.assertEquals(Assert.java:87)
	at org.joda.time.TestLocalDateTime_Basics.testToString_String_Locale(TestLocalDateTime_Basics.java:1085)

testToString_DTFormatter(org.joda.time.TestLocalDateTime_Basics)  Time elapsed: 0.001 sec  <<< FAILURE!
junit.framework.ComparisonFailure: expected:<[2002 10]> but was:<[]>
	at junit.framework.Assert.assertEquals(Assert.java:81)
	at junit.framework.Assert.assertEquals(Assert.java:87)
	at org.joda.time.TestLocalDateTime_Basics.testToString_DTFormatter(TestLocalDateTime_Basics.java:1095)

testToString(org.joda.time.TestLocalDate_Basics)  Time elapsed: 0 sec  <<< FAILURE!
junit.framework.ComparisonFailure: expected:<[2002-06-09]> but was:<[]>
	at junit.framework.Assert.assertEquals(Assert.java:81)
	at junit.framework.Assert.assertEquals(Assert.java:87)
	at org.joda.time.TestLocalDate_Basics.testToString(TestLocalDate_Basics.java:1126)

testToString_String(org.joda.time.TestLocalDate_Basics)  Time elapsed: 0 sec  <<< FAILURE!
junit.framework.ComparisonFailure: expected:<[2002 ��]> but was:<[]>
	at junit.framework.Assert.assertEquals(Assert.java:81)
	at junit.framework.Assert.assertEquals(Assert.java:87)
	at org.joda.time.TestLocalDate_Basics.testToString_String(TestLocalDate_Basics.java:1132)

testToString_String_Locale(org.joda.time.TestLocalDate_Basics)  Time elapsed: 0.001 sec  <<< FAILURE!
junit.framework.ComparisonFailure: expected:<[Tue 9/6]> but was:<[]>
	at junit.framework.Assert.assertEquals(Assert.java:81)
	at junit.framework.Assert.assertEquals(Assert.java:87)
	at org.joda.time.TestLocalDate_Basics.testToString_String_Locale(TestLocalDate_Basics.java:1139)

testToString_DTFormatter(org.joda.time.TestLocalDate_Basics)  Time elapsed: 0 sec  <<< FAILURE!
junit.framework.ComparisonFailure: expected:<[2002 ��]> but was:<[]>
	at junit.framework.Assert.assertEquals(Assert.java:81)
	at junit.framework.Assert.assertEquals(Assert.java:87)
	at org.joda.time.TestLocalDate_Basics.testToString_DTFormatter(TestLocalDate_Basics.java:1149)

testToString(org.joda.time.TestLocalTime_Basics)  Time elapsed: 0.001 sec  <<< FAILURE!
junit.framework.ComparisonFailure: expected:<[10:20:30.040]> but was:<[]>
	at junit.framework.Assert.assertEquals(Assert.java:81)
	at junit.framework.Assert.assertEquals(Assert.java:87)
	at org.joda.time.TestLocalTime_Basics.testToString(TestLocalTime_Basics.java:786)

testToString_String(org.joda.time.TestLocalTime_Basics)  Time elapsed: 0 sec  <<< FAILURE!
junit.framework.ComparisonFailure: expected:<[���� 10]> but was:<[]>
	at junit.framework.Assert.assertEquals(Assert.java:81)
	at junit.framework.Assert.assertEquals(Assert.java:87)
	at org.joda.time.TestLocalTime_Basics.testToString_String(TestLocalTime_Basics.java:792)

testToString_String_Locale(org.joda.time.TestLocalTime_Basics)  Time elapsed: 0.001 sec  <<< FAILURE!
junit.framework.ComparisonFailure: expected:<[10 20]> but was:<[]>
	at junit.framework.Assert.assertEquals(Assert.java:81)
	at junit.framework.Assert.assertEquals(Assert.java:87)
	at org.joda.time.TestLocalTime_Basics.testToString_String_Locale(TestLocalTime_Basics.java:799)

testToString_DTFormatter(org.joda.time.TestLocalTime_Basics)  Time elapsed: 0 sec  <<< FAILURE!
junit.framework.ComparisonFailure: expected:<[���� 10]> but was:<[]>
	at junit.framework.Assert.assertEquals(Assert.java:81)
	at junit.framework.Assert.assertEquals(Assert.java:87)
	at org.joda.time.TestLocalTime_Basics.testToString_DTFormatter(TestLocalTime_Basics.java:808)

testToString(org.joda.time.TestTimeOfDay_Basics)  Time elapsed: 0.001 sec  <<< FAILURE!
junit.framework.ComparisonFailure: expected:<[T10:20:30.040]> but was:<[]>
	at junit.framework.Assert.assertEquals(Assert.java:81)
	at junit.framework.Assert.assertEquals(Assert.java:87)
	at org.joda.time.TestTimeOfDay_Basics.testToString(TestTimeOfDay_Basics.java:873)

testToString_String(org.joda.time.TestTimeOfDay_Basics)  Time elapsed: 0 sec  <<< FAILURE!
junit.framework.ComparisonFailure: expected:<[���� 10]> but was:<[]>
	at junit.framework.Assert.assertEquals(Assert.java:81)
	at junit.framework.Assert.assertEquals(Assert.java:87)
	at org.joda.time.TestTimeOfDay_Basics.testToString_String(TestTimeOfDay_Basics.java:879)

testToString_String_Locale(org.joda.time.TestTimeOfDay_Basics)  Time elapsed: 0.001 sec  <<< FAILURE!
junit.framework.ComparisonFailure: expected:<[10 20]> but was:<[]>
	at junit.framework.Assert.assertEquals(Assert.java:81)
	at junit.framework.Assert.assertEquals(Assert.java:87)
	at org.joda.time.TestTimeOfDay_Basics.testToString_String_Locale(TestTimeOfDay_Basics.java:886)

testToString_DTFormatter(org.joda.time.TestTimeOfDay_Basics)  Time elapsed: 0.001 sec  <<< FAILURE!
junit.framework.ComparisonFailure: expected:<[���� 10]> but was:<[]>
	at junit.framework.Assert.assertEquals(Assert.java:81)
	at junit.framework.Assert.assertEquals(Assert.java:87)
	at org.joda.time.TestTimeOfDay_Basics.testToString_DTFormatter(TestTimeOfDay_Basics.java:895)

testToString(org.joda.time.TestYearMonthDay_Basics)  Time elapsed: 0 sec  <<< FAILURE!
junit.framework.ComparisonFailure: expected:<[2002-06-09]> but was:<[]>
	at junit.framework.Assert.assertEquals(Assert.java:81)
	at junit.framework.Assert.assertEquals(Assert.java:87)
	at org.joda.time.TestYearMonthDay_Basics.testToString(TestYearMonthDay_Basics.java:799)

testToString_String(org.joda.time.TestYearMonthDay_Basics)  Time elapsed: 0 sec  <<< FAILURE!
junit.framework.ComparisonFailure: expected:<[2002 ��]> but was:<[]>
	at junit.framework.Assert.assertEquals(Assert.java:81)
	at junit.framework.Assert.assertEquals(Assert.java:87)
	at org.joda.time.TestYearMonthDay_Basics.testToString_String(TestYearMonthDay_Basics.java:805)

testToString_String_Locale(org.joda.time.TestYearMonthDay_Basics)  Time elapsed: 0 sec  <<< FAILURE!
junit.framework.ComparisonFailure: expected:<[� 9/6]> but was:<[]>
	at junit.framework.Assert.assertEquals(Assert.java:81)
	at junit.framework.Assert.assertEquals(Assert.java:87)
	at org.joda.time.TestYearMonthDay_Basics.testToString_String_Locale(TestYearMonthDay_Basics.java:812)

testToString_DTFormatter(org.joda.time.TestYearMonthDay_Basics)  Time elapsed: 0 sec  <<< FAILURE!
junit.framework.ComparisonFailure: expected:<[2002 ��]> but was:<[]>
	at junit.framework.Assert.assertEquals(Assert.java:81)
	at junit.framework.Assert.assertEquals(Assert.java:87)
	at org.joda.time.TestYearMonthDay_Basics.testToString_DTFormatter(TestYearMonthDay_Basics.java:822)

testToString(org.joda.time.TestYearMonth_Basics)  Time elapsed: 0.001 sec  <<< FAILURE!
junit.framework.ComparisonFailure: expected:<[2002-06]> but was:<[]>
	at junit.framework.Assert.assertEquals(Assert.java:81)
	at junit.framework.Assert.assertEquals(Assert.java:87)
	at org.joda.time.TestYearMonth_Basics.testToString(TestYearMonth_Basics.java:623)

testToString_String(org.joda.time.TestYearMonth_Basics)  Time elapsed: 0 sec  <<< FAILURE!
junit.framework.ComparisonFailure: expected:<[2002 ��]> but was:<[]>
	at junit.framework.Assert.assertEquals(Assert.java:81)
	at junit.framework.Assert.assertEquals(Assert.java:87)
	at org.joda.time.TestYearMonth_Basics.testToString_String(TestYearMonth_Basics.java:629)

testToString_String_Locale(org.joda.time.TestYearMonth_Basics)  Time elapsed: 0.001 sec  <<< FAILURE!
junit.framework.ComparisonFailure: expected:<[� �/6]> but was:<[]>
	at junit.framework.Assert.assertEquals(Assert.java:81)
	at junit.framework.Assert.assertEquals(Assert.java:87)
	at org.joda.time.TestYearMonth_Basics.testToString_String_Locale(TestYearMonth_Basics.java:636)

testToString_DTFormatter(org.joda.time.TestYearMonth_Basics)  Time elapsed: 0 sec  <<< FAILURE!
junit.framework.ComparisonFailure: expected:<[2002 ��]> but was:<[]>
	at junit.framework.Assert.assertEquals(Assert.java:81)
	at junit.framework.Assert.assertEquals(Assert.java:87)
	at org.joda.time.TestYearMonth_Basics.testToString_DTFormatter(TestYearMonth_Basics.java:646)

testToString(org.joda.time.TestMonthDay_Basics)  Time elapsed: 0 sec  <<< FAILURE!
junit.framework.ComparisonFailure: expected:<[--05-06]> but was:<[]>
	at junit.framework.Assert.assertEquals(Assert.java:81)
	at junit.framework.Assert.assertEquals(Assert.java:87)
	at org.joda.time.TestMonthDay_Basics.testToString(TestMonthDay_Basics.java:789)

testToString_String(org.joda.time.TestMonthDay_Basics)  Time elapsed: 0 sec  <<< FAILURE!
junit.framework.ComparisonFailure: expected:<[05 ��]> but was:<[]>
	at junit.framework.Assert.assertEquals(Assert.java:81)
	at junit.framework.Assert.assertEquals(Assert.java:87)
	at org.joda.time.TestMonthDay_Basics.testToString_String(TestMonthDay_Basics.java:795)

testToString_String_Locale(org.joda.time.TestMonthDay_Basics)  Time elapsed: 0.001 sec  <<< FAILURE!
junit.framework.ComparisonFailure: expected:<[� 6/5]> but was:<[]>
	at junit.framework.Assert.assertEquals(Assert.java:81)
	at junit.framework.Assert.assertEquals(Assert.java:87)
	at org.joda.time.TestMonthDay_Basics.testToString_String_Locale(TestMonthDay_Basics.java:802)

testToString_DTFormatter(org.joda.time.TestMonthDay_Basics)  Time elapsed: 0 sec  <<< FAILURE!
junit.framework.ComparisonFailure: expected:<[05 ��]> but was:<[]>
	at junit.framework.Assert.assertEquals(Assert.java:81)
	at junit.framework.Assert.assertEquals(Assert.java:87)
	at org.joda.time.TestMonthDay_Basics.testToString_DTFormatter(TestMonthDay_Basics.java:812)

testToString_String(org.joda.time.TestPartial_Basics)  Time elapsed: 0.001 sec  <<< FAILURE!
junit.framework.ComparisonFailure: expected:<[���� 10]> but was:<[]>
	at junit.framework.Assert.assertEquals(Assert.java:81)
	at junit.framework.Assert.assertEquals(Assert.java:87)
	at org.joda.time.TestPartial_Basics.testToString_String(TestPartial_Basics.java:877)

testToString_String_Locale(org.joda.time.TestPartial_Basics)  Time elapsed: 0 sec  <<< FAILURE!
junit.framework.ComparisonFailure: expected:<[10 20]> but was:<[]>
	at junit.framework.Assert.assertEquals(Assert.java:81)
	at junit.framework.Assert.assertEquals(Assert.java:87)
	at org.joda.time.TestPartial_Basics.testToString_String_Locale(TestPartial_Basics.java:884)

testToString_DTFormatter(org.joda.time.TestPartial_Basics)  Time elapsed: 0.001 sec  <<< FAILURE!
junit.framework.ComparisonFailure: expected:<[���� 10]> but was:<[]>
	at junit.framework.Assert.assertEquals(Assert.java:81)
	at junit.framework.Assert.assertEquals(Assert.java:87)
	at org.joda.time.TestPartial_Basics.testToString_DTFormatter(TestPartial_Basics.java:893)

testGetFormatter1(org.joda.time.TestPartial_Basics)  Time elapsed: 0.001 sec  <<< FAILURE!
junit.framework.ComparisonFailure: expected:<[2005-06]> but was:<[]>
	at junit.framework.Assert.assertEquals(Assert.java:81)
	at junit.framework.Assert.assertEquals(Assert.java:87)
	at org.joda.time.TestPartial_Basics.testGetFormatter1(TestPartial_Basics.java:804)

testGetFormatter3(org.joda.time.TestPartial_Basics)  Time elapsed: 0.001 sec  <<< FAILURE!
junit.framework.ComparisonFailure: expected:<[-W-5]> but was:<[]>
	at junit.framework.Assert.assertEquals(Assert.java:81)
	at junit.framework.Assert.assertEquals(Assert.java:87)
	at org.joda.time.TestPartial_Basics.testGetFormatter3(TestPartial_Basics.java:826)

testToString1(org.joda.time.TestPartial_Basics)  Time elapsed: 0 sec  <<< FAILURE!
junit.framework.ComparisonFailure: expected:<[10:20]> but was:<[]>
	at junit.framework.Assert.assertEquals(Assert.java:81)
	at junit.framework.Assert.assertEquals(Assert.java:87)
	at org.joda.time.TestPartial_Basics.testToString1(TestPartial_Basics.java:836)

testToString3(org.joda.time.TestPartial_Basics)  Time elapsed: 0 sec  <<< FAILURE!
junit.framework.ComparisonFailure: expected:<[2005-06]> but was:<[]>
	at junit.framework.Assert.assertEquals(Assert.java:81)
	at junit.framework.Assert.assertEquals(Assert.java:87)
	at org.joda.time.TestPartial_Basics.testToString3(TestPartial_Basics.java:849)

testToString4(org.joda.time.TestPartial_Basics)  Time elapsed: 0.001 sec  <<< FAILURE!
junit.framework.ComparisonFailure: expected:<[-W-5]> but was:<[]>
	at junit.framework.Assert.assertEquals(Assert.java:81)
	at junit.framework.Assert.assertEquals(Assert.java:87)
	at org.joda.time.TestPartial_Basics.testToString4(TestPartial_Basics.java:860)

test_LocalDate_new_Turk(org.joda.time.TestDateTimeZoneCutover)  Time elapsed: 0.001 sec  <<< FAILURE!
junit.framework.ComparisonFailure: expected:<[2007-04-01]> but was:<[]>
	at junit.framework.Assert.assertEquals(Assert.java:81)
	at junit.framework.Assert.assertEquals(Assert.java:87)
	at org.joda.time.TestDateTimeZoneCutover.test_LocalDate_new_Turk(TestDateTimeZoneCutover.java:433)

test_LocalDate_new_Gaza(org.joda.time.TestDateTimeZoneCutover)  Time elapsed: 0.001 sec  <<< FAILURE!
junit.framework.ComparisonFailure: expected:<[2007-04-01]> but was:<[]>
	at junit.framework.Assert.assertEquals(Assert.java:81)
	at junit.framework.Assert.assertEquals(Assert.java:87)
	at org.joda.time.TestDateTimeZoneCutover.test_LocalDate_new_Gaza(TestDateTimeZoneCutover.java:216)

test_DateTime_JustAfterLastEverOverlap(org.joda.time.TestDateTimeZoneCutover)  Time elapsed: 0.004 sec  <<< FAILURE!
junit.framework.ComparisonFailure: expected:<[2008-08-10]> but was:<[]>
	at junit.framework.Assert.assertEquals(Assert.java:81)
	at junit.framework.Assert.assertEquals(Assert.java:87)
	at org.joda.time.TestDateTimeZoneCutover.test_DateTime_JustAfterLastEverOverlap(TestDateTimeZoneCutover.java:1099)

testLocalDateTime(org.joda.time.TestStringConvert)  Time elapsed: 0.001 sec  <<< FAILURE!
junit.framework.ComparisonFailure: expected:<[2010-06-30T02:30:00.000]> but was:<[]>
	at junit.framework.Assert.assertEquals(Assert.java:81)
	at junit.framework.Assert.assertEquals(Assert.java:87)
	at org.joda.time.TestStringConvert.testLocalDateTime(TestStringConvert.java:77)

testLocalDate(org.joda.time.TestStringConvert)  Time elapsed: 0.002 sec  <<< FAILURE!
junit.framework.ComparisonFailure: expected:<[2010-06-30]> but was:<[]>
	at junit.framework.Assert.assertEquals(Assert.java:81)
	at junit.framework.Assert.assertEquals(Assert.java:87)
	at org.joda.time.TestStringConvert.testLocalDate(TestStringConvert.java:84)

testLocalTime(org.joda.time.TestStringConvert)  Time elapsed: 0.001 sec  <<< FAILURE!
junit.framework.ComparisonFailure: expected:<[02:30:50.678]> but was:<[]>
	at junit.framework.Assert.assertEquals(Assert.java:81)
	at junit.framework.Assert.assertEquals(Assert.java:87)
	at org.joda.time.TestStringConvert.testLocalTime(TestStringConvert.java:91)

testYearMonth(org.joda.time.TestStringConvert)  Time elapsed: 0.001 sec  <<< FAILURE!
junit.framework.ComparisonFailure: expected:<[2010-06]> but was:<[]>
	at junit.framework.Assert.assertEquals(Assert.java:81)
	at junit.framework.Assert.assertEquals(Assert.java:87)
	at org.joda.time.TestStringConvert.testYearMonth(TestStringConvert.java:98)

testMonthDay(org.joda.time.TestStringConvert)  Time elapsed: 0.002 sec  <<< FAILURE!
junit.framework.ComparisonFailure: expected:<[--06-30]> but was:<[]>
	at junit.framework.Assert.assertEquals(Assert.java:81)
	at junit.framework.Assert.assertEquals(Assert.java:87)
	at org.joda.time.TestStringConvert.testMonthDay(TestStringConvert.java:105)

testMonthDay_leapDay(org.joda.time.TestStringConvert)  Time elapsed: 0 sec  <<< FAILURE!
junit.framework.ComparisonFailure: expected:<[--02-29]> but was:<[]>
	at junit.framework.Assert.assertEquals(Assert.java:81)
	at junit.framework.Assert.assertEquals(Assert.java:87)
	at org.joda.time.TestStringConvert.testMonthDay_leapDay(TestStringConvert.java:112)

testPrint_bufferMethods(org.joda.time.format.TestDateTimeFormatter)  Time elapsed: 0.001 sec  <<< FAILURE!
junit.framework.ComparisonFailure: expected:<[2004-06-09]> but was:<[]>
	at junit.framework.Assert.assertEquals(Assert.java:81)
	at junit.framework.Assert.assertEquals(Assert.java:87)
	at org.joda.time.format.TestDateTimeFormatter.testPrint_bufferMethods(TestDateTimeFormatter.java:172)

testPrint_writerMethods(org.joda.time.format.TestDateTimeFormatter)  Time elapsed: 0.004 sec  <<< FAILURE!
junit.framework.ComparisonFailure: expected:<[2004-06-09]> but was:<[]>
	at junit.framework.Assert.assertEquals(Assert.java:81)
	at junit.framework.Assert.assertEquals(Assert.java:87)
	at org.joda.time.format.TestDateTimeFormatter.testPrint_writerMethods(TestDateTimeFormatter.java:194)

testPrint_appendableMethods(org.joda.time.format.TestDateTimeFormatter)  Time elapsed: 0 sec  <<< FAILURE!
junit.framework.ComparisonFailure: expected:<[2004-06-09]> but was:<[]>
	at junit.framework.Assert.assertEquals(Assert.java:81)
	at junit.framework.Assert.assertEquals(Assert.java:87)
	at org.joda.time.format.TestDateTimeFormatter.testPrint_appendableMethods(TestDateTimeFormatter.java:216)

testFormat_timeNoMillis_partial(org.joda.time.format.TestISODateTimeFormat)  Time elapsed: 0.001 sec  <<< FAILURE!
junit.framework.ComparisonFailure: expected:<[10:20:30]> but was:<[]>
	at junit.framework.Assert.assertEquals(Assert.java:81)
	at junit.framework.Assert.assertEquals(Assert.java:87)
	at org.joda.time.format.TestISODateTimeFormat.testFormat_timeNoMillis_partial(TestISODateTimeFormat.java:149)

testFormat_date_partial(org.joda.time.format.TestISODateTimeFormat)  Time elapsed: 0 sec  <<< FAILURE!
junit.framework.ComparisonFailure: expected:<[2004-06-09]> but was:<[]>
	at junit.framework.Assert.assertEquals(Assert.java:81)
	at junit.framework.Assert.assertEquals(Assert.java:87)
	at org.joda.time.format.TestISODateTimeFormat.testFormat_date_partial(TestISODateTimeFormat.java:111)

testFormat_time_partial(org.joda.time.format.TestISODateTimeFormat)  Time elapsed: 0.001 sec  <<< FAILURE!
junit.framework.ComparisonFailure: expected:<[10:20:30.040]> but was:<[]>
	at junit.framework.Assert.assertEquals(Assert.java:81)
	at junit.framework.Assert.assertEquals(Assert.java:87)
	at org.joda.time.format.TestISODateTimeFormat.testFormat_time_partial(TestISODateTimeFormat.java:130)

testForFields_weekBased_W(org.joda.time.format.TestISODateTimeFormat_Fields)  Time elapsed: 0 sec  <<< FAILURE!
junit.framework.ComparisonFailure: expected:<[-W08]> but was:<[]>
	at junit.framework.Assert.assertEquals(Assert.java:81)
	at junit.framework.Assert.assertEquals(Assert.java:87)
	at org.joda.time.format.TestISODateTimeFormat_Fields.testForFields_weekBased_W(TestISODateTimeFormat_Fields.java:379)

testForFields_weekBased_D(org.joda.time.format.TestISODateTimeFormat_Fields)  Time elapsed: 0.001 sec  <<< FAILURE!
junit.framework.ComparisonFailure: expected:<[-W-5]> but was:<[]>
	at junit.framework.Assert.assertEquals(Assert.java:81)
	at junit.framework.Assert.assertEquals(Assert.java:87)
	at org.joda.time.format.TestISODateTimeFormat_Fields.testForFields_weekBased_D(TestISODateTimeFormat_Fields.java:406)

testForFields_weekBased_YW(org.joda.time.format.TestISODateTimeFormat_Fields)  Time elapsed: 0 sec  <<< FAILURE!
junit.framework.ComparisonFailure: expected:<[2005-W08]> but was:<[]>
	at junit.framework.Assert.assertEquals(Assert.java:81)
	at junit.framework.Assert.assertEquals(Assert.java:87)
	at org.joda.time.format.TestISODateTimeFormat_Fields.testForFields_weekBased_YW(TestISODateTimeFormat_Fields.java:434)

testForFields_weekBased_WD(org.joda.time.format.TestISODateTimeFormat_Fields)  Time elapsed: 0.001 sec  <<< FAILURE!
junit.framework.ComparisonFailure: expected:<[-W08-5]> but was:<[]>
	at junit.framework.Assert.assertEquals(Assert.java:81)
	at junit.framework.Assert.assertEquals(Assert.java:87)
	at org.joda.time.format.TestISODateTimeFormat_Fields.testForFields_weekBased_WD(TestISODateTimeFormat_Fields.java:462)

testForFields_weekBased_YD(org.joda.time.format.TestISODateTimeFormat_Fields)  Time elapsed: 0.001 sec  <<< FAILURE!
junit.framework.ComparisonFailure: expected:<[2005-W-5]> but was:<[]>
	at junit.framework.Assert.assertEquals(Assert.java:81)
	at junit.framework.Assert.assertEquals(Assert.java:87)
	at org.joda.time.format.TestISODateTimeFormat_Fields.testForFields_weekBased_YD(TestISODateTimeFormat_Fields.java:490)

testForFields_ordinalBased_YD(org.joda.time.format.TestISODateTimeFormat_Fields)  Time elapsed: 0 sec  <<< FAILURE!
junit.framework.ComparisonFailure: expected:<[2005-177]> but was:<[]>
	at junit.framework.Assert.assertEquals(Assert.java:81)
	at junit.framework.Assert.assertEquals(Assert.java:87)
	at org.joda.time.format.TestISODateTimeFormat_Fields.testForFields_ordinalBased_YD(TestISODateTimeFormat_Fields.java:522)

testForFields_ordinalBased_D(org.joda.time.format.TestISODateTimeFormat_Fields)  Time elapsed: 0.001 sec  <<< FAILURE!
junit.framework.ComparisonFailure: expected:<[-177]> but was:<[]>
	at junit.framework.Assert.assertEquals(Assert.java:81)
	at junit.framework.Assert.assertEquals(Assert.java:87)
	at org.joda.time.format.TestISODateTimeFormat_Fields.testForFields_ordinalBased_D(TestISODateTimeFormat_Fields.java:576)

testForFields_time_HMSm(org.joda.time.format.TestISODateTimeFormat_Fields)  Time elapsed: 0 sec  <<< FAILURE!
junit.framework.ComparisonFailure: expected:<[10:20:30.040]> but was:<[]>
	at junit.framework.Assert.assertEquals(Assert.java:81)
	at junit.framework.Assert.assertEquals(Assert.java:87)
	at org.joda.time.format.TestISODateTimeFormat_Fields.testForFields_time_HMSm(TestISODateTimeFormat_Fields.java:608)

testForFields_time_HMS(org.joda.time.format.TestISODateTimeFormat_Fields)  Time elapsed: 0.001 sec  <<< FAILURE!
junit.framework.ComparisonFailure: expected:<[10:20:30]> but was:<[]>
	at junit.framework.Assert.assertEquals(Assert.java:81)
	at junit.framework.Assert.assertEquals(Assert.java:87)
	at org.joda.time.format.TestISODateTimeFormat_Fields.testForFields_time_HMS(TestISODateTimeFormat_Fields.java:637)

testForFields_time_HM(org.joda.time.format.TestISODateTimeFormat_Fields)  Time elapsed: 0 sec  <<< FAILURE!
junit.framework.ComparisonFailure: expected:<[10:20]> but was:<[]>
	at junit.framework.Assert.assertEquals(Assert.java:81)
	at junit.framework.Assert.assertEquals(Assert.java:87)
	at org.joda.time.format.TestISODateTimeFormat_Fields.testForFields_time_HM(TestISODateTimeFormat_Fields.java:665)

testForFields_time_MSm(org.joda.time.format.TestISODateTimeFormat_Fields)  Time elapsed: 0.001 sec  <<< FAILURE!
junit.framework.ComparisonFailure: expected:<[-20:30.040]> but was:<[]>
	at junit.framework.Assert.assertEquals(Assert.java:81)
	at junit.framework.Assert.assertEquals(Assert.java:87)
	at org.joda.time.format.TestISODateTimeFormat_Fields.testForFields_time_MSm(TestISODateTimeFormat_Fields.java:721)

testForFields_time_MS(org.joda.time.format.TestISODateTimeFormat_Fields)  Time elapsed: 0 sec  <<< FAILURE!
junit.framework.ComparisonFailure: expected:<[-20:30]> but was:<[]>
	at junit.framework.Assert.assertEquals(Assert.java:81)
	at junit.framework.Assert.assertEquals(Assert.java:87)
	at org.joda.time.format.TestISODateTimeFormat_Fields.testForFields_time_MS(TestISODateTimeFormat_Fields.java:749)

testForFields_time_M(org.joda.time.format.TestISODateTimeFormat_Fields)  Time elapsed: 0.001 sec  <<< FAILURE!
junit.framework.ComparisonFailure: expected:<[-20]> but was:<[]>
	at junit.framework.Assert.assertEquals(Assert.java:81)
	at junit.framework.Assert.assertEquals(Assert.java:87)
	at org.joda.time.format.TestISODateTimeFormat_Fields.testForFields_time_M(TestISODateTimeFormat_Fields.java:776)

testForFields_time_Sm(org.joda.time.format.TestISODateTimeFormat_Fields)  Time elapsed: 0.002 sec  <<< FAILURE!
junit.framework.ComparisonFailure: expected:<[--30.040]> but was:<[]>
	at junit.framework.Assert.assertEquals(Assert.java:81)
	at junit.framework.Assert.assertEquals(Assert.java:87)
	at org.joda.time.format.TestISODateTimeFormat_Fields.testForFields_time_Sm(TestISODateTimeFormat_Fields.java:804)

testForFields_time_S(org.joda.time.format.TestISODateTimeFormat_Fields)  Time elapsed: 0.001 sec  <<< FAILURE!
junit.framework.ComparisonFailure: expected:<[--30]> but was:<[]>
	at junit.framework.Assert.assertEquals(Assert.java:81)
	at junit.framework.Assert.assertEquals(Assert.java:87)
	at org.joda.time.format.TestISODateTimeFormat_Fields.testForFields_time_S(TestISODateTimeFormat_Fields.java:831)

testForFields_time_m(org.joda.time.format.TestISODateTimeFormat_Fields)  Time elapsed: 0.001 sec  <<< FAILURE!
junit.framework.ComparisonFailure: expected:<[---.040]> but was:<[]>
	at junit.framework.Assert.assertEquals(Assert.java:81)
	at junit.framework.Assert.assertEquals(Assert.java:87)
	at org.joda.time.format.TestISODateTimeFormat_Fields.testForFields_time_m(TestISODateTimeFormat_Fields.java:858)

testForFields_time_Hm(org.joda.time.format.TestISODateTimeFormat_Fields)  Time elapsed: 0.002 sec  <<< FAILURE!
junit.framework.ComparisonFailure: expected:<[10--.040]> but was:<[]>
	at junit.framework.Assert.assertEquals(Assert.java:81)
	at junit.framework.Assert.assertEquals(Assert.java:87)
	at org.joda.time.format.TestISODateTimeFormat_Fields.testForFields_time_Hm(TestISODateTimeFormat_Fields.java:888)

testForFields_time_HS(org.joda.time.format.TestISODateTimeFormat_Fields)  Time elapsed: 0.001 sec  <<< FAILURE!
junit.framework.ComparisonFailure: expected:<[10-30]> but was:<[]>
	at junit.framework.Assert.assertEquals(Assert.java:81)
	at junit.framework.Assert.assertEquals(Assert.java:87)
	at org.joda.time.format.TestISODateTimeFormat_Fields.testForFields_time_HS(TestISODateTimeFormat_Fields.java:918)

testForFields_time_Mm(org.joda.time.format.TestISODateTimeFormat_Fields)  Time elapsed: 0.001 sec  <<< FAILURE!
junit.framework.ComparisonFailure: expected:<[-20-.040]> but was:<[]>
	at junit.framework.Assert.assertEquals(Assert.java:81)
	at junit.framework.Assert.assertEquals(Assert.java:87)
	at org.joda.time.format.TestISODateTimeFormat_Fields.testForFields_time_Mm(TestISODateTimeFormat_Fields.java:948)

testForFields_time_HSm(org.joda.time.format.TestISODateTimeFormat_Fields)  Time elapsed: 0.002 sec  <<< FAILURE!
junit.framework.ComparisonFailure: expected:<[10-30.040]> but was:<[]>
	at junit.framework.Assert.assertEquals(Assert.java:81)
	at junit.framework.Assert.assertEquals(Assert.java:87)
	at org.joda.time.format.TestISODateTimeFormat_Fields.testForFields_time_HSm(TestISODateTimeFormat_Fields.java:979)

testForFields_time_HMm(org.joda.time.format.TestISODateTimeFormat_Fields)  Time elapsed: 0 sec  <<< FAILURE!
junit.framework.ComparisonFailure: expected:<[10:20-.040]> but was:<[]>
	at junit.framework.Assert.assertEquals(Assert.java:81)
	at junit.framework.Assert.assertEquals(Assert.java:87)
	at org.joda.time.format.TestISODateTimeFormat_Fields.testForFields_time_HMm(TestISODateTimeFormat_Fields.java:1010)

testForFields_datetime_YMDH(org.joda.time.format.TestISODateTimeFormat_Fields)  Time elapsed: 0.001 sec  <<< FAILURE!
junit.framework.ComparisonFailure: expected:<[2005-06-25T12]> but was:<[]>
	at junit.framework.Assert.assertEquals(Assert.java:81)
	at junit.framework.Assert.assertEquals(Assert.java:87)
	at org.joda.time.format.TestISODateTimeFormat_Fields.testForFields_datetime_YMDH(TestISODateTimeFormat_Fields.java:1044)

testForFields_datetime_DH(org.joda.time.format.TestISODateTimeFormat_Fields)  Time elapsed: 0 sec  <<< FAILURE!
junit.framework.ComparisonFailure: expected:<[---25T12]> but was:<[]>
	at junit.framework.Assert.assertEquals(Assert.java:81)
	at junit.framework.Assert.assertEquals(Assert.java:87)
	at org.joda.time.format.TestISODateTimeFormat_Fields.testForFields_datetime_DH(TestISODateTimeFormat_Fields.java:1072)

testForFields_datetime_YH(org.joda.time.format.TestISODateTimeFormat_Fields)  Time elapsed: 0.001 sec  <<< FAILURE!
junit.framework.ComparisonFailure: expected:<[2005T12]> but was:<[]>
	at junit.framework.Assert.assertEquals(Assert.java:81)
	at junit.framework.Assert.assertEquals(Assert.java:87)
	at org.joda.time.format.TestISODateTimeFormat_Fields.testForFields_datetime_YH(TestISODateTimeFormat_Fields.java:1100)

testForFields_datetime_DM(org.joda.time.format.TestISODateTimeFormat_Fields)  Time elapsed: 0 sec  <<< FAILURE!
junit.framework.ComparisonFailure: expected:<[---25T-20]> but was:<[]>
	at junit.framework.Assert.assertEquals(Assert.java:81)
	at junit.framework.Assert.assertEquals(Assert.java:87)
	at org.joda.time.format.TestISODateTimeFormat_Fields.testForFields_datetime_DM(TestISODateTimeFormat_Fields.java:1130)

testForFields_calBased_YMD(org.joda.time.format.TestISODateTimeFormat_Fields)  Time elapsed: 0.001 sec  <<< FAILURE!
junit.framework.ComparisonFailure: expected:<[2005-06-25]> but was:<[]>
	at junit.framework.Assert.assertEquals(Assert.java:81)
	at junit.framework.Assert.assertEquals(Assert.java:87)
	at org.joda.time.format.TestISODateTimeFormat_Fields.testForFields_calBased_YMD(TestISODateTimeFormat_Fields.java:83)

testForFields_calBased_YMD_unmodifiable(org.joda.time.format.TestISODateTimeFormat_Fields)  Time elapsed: 0 sec  <<< FAILURE!
junit.framework.ComparisonFailure: expected:<[2005-06-25]> but was:<[]>
	at junit.framework.Assert.assertEquals(Assert.java:81)
	at junit.framework.Assert.assertEquals(Assert.java:87)
	at org.joda.time.format.TestISODateTimeFormat_Fields.testForFields_calBased_YMD_unmodifiable(TestISODateTimeFormat_Fields.java:112)

testForFields_calBased_YMD_duplicates(org.joda.time.format.TestISODateTimeFormat_Fields)  Time elapsed: 0.001 sec  <<< FAILURE!
junit.framework.ComparisonFailure: expected:<[2005-06-25]> but was:<[]>
	at junit.framework.Assert.assertEquals(Assert.java:81)
	at junit.framework.Assert.assertEquals(Assert.java:87)
	at org.joda.time.format.TestISODateTimeFormat_Fields.testForFields_calBased_YMD_duplicates(TestISODateTimeFormat_Fields.java:137)

testForFields_calBased_M(org.joda.time.format.TestISODateTimeFormat_Fields)  Time elapsed: 0 sec  <<< FAILURE!
junit.framework.ComparisonFailure: expected:<[--06]> but was:<[]>
	at junit.framework.Assert.assertEquals(Assert.java:81)
	at junit.framework.Assert.assertEquals(Assert.java:87)
	at org.joda.time.format.TestISODateTimeFormat_Fields.testForFields_calBased_M(TestISODateTimeFormat_Fields.java:181)

testForFields_calBased_D(org.joda.time.format.TestISODateTimeFormat_Fields)  Time elapsed: 0.001 sec  <<< FAILURE!
junit.framework.ComparisonFailure: expected:<[---25]> but was:<[]>
	at junit.framework.Assert.assertEquals(Assert.java:81)
	at junit.framework.Assert.assertEquals(Assert.java:87)
	at org.joda.time.format.TestISODateTimeFormat_Fields.testForFields_calBased_D(TestISODateTimeFormat_Fields.java:208)

testForFields_calBased_YM(org.joda.time.format.TestISODateTimeFormat_Fields)  Time elapsed: 0.003 sec  <<< FAILURE!
junit.framework.ComparisonFailure: expected:<[2005-06]> but was:<[]>
	at junit.framework.Assert.assertEquals(Assert.java:81)
	at junit.framework.Assert.assertEquals(Assert.java:87)
	at org.joda.time.format.TestISODateTimeFormat_Fields.testForFields_calBased_YM(TestISODateTimeFormat_Fields.java:236)

testForFields_calBased_MD(org.joda.time.format.TestISODateTimeFormat_Fields)  Time elapsed: 0 sec  <<< FAILURE!
junit.framework.ComparisonFailure: expected:<[--06-25]> but was:<[]>
	at junit.framework.Assert.assertEquals(Assert.java:81)
	at junit.framework.Assert.assertEquals(Assert.java:87)
	at org.joda.time.format.TestISODateTimeFormat_Fields.testForFields_calBased_MD(TestISODateTimeFormat_Fields.java:264)

testForFields_calBased_YD(org.joda.time.format.TestISODateTimeFormat_Fields)  Time elapsed: 0 sec  <<< FAILURE!
junit.framework.ComparisonFailure: expected:<[2005--25]> but was:<[]>
	at junit.framework.Assert.assertEquals(Assert.java:81)
	at junit.framework.Assert.assertEquals(Assert.java:87)
	at org.joda.time.format.TestISODateTimeFormat_Fields.testForFields_calBased_YD(TestISODateTimeFormat_Fields.java:292)

testForFields_weekBased_YWD(org.joda.time.format.TestISODateTimeFormat_Fields)  Time elapsed: 0 sec  <<< FAILURE!
junit.framework.ComparisonFailure: expected:<[2005-W08-5]> but was:<[]>
	at junit.framework.Assert.assertEquals(Assert.java:81)
	at junit.framework.Assert.assertEquals(Assert.java:87)
	at org.joda.time.format.TestISODateTimeFormat_Fields.testForFields_weekBased_YWD(TestISODateTimeFormat_Fields.java:325)


Results :

Failed tests: 
  org.joda.time.TestDateTimeZoneCutover#test_DateTime_JustAfterLastEverOverlap ComparisonFailure
  org.joda.time.TestDateTimeZoneCutover#test_LocalDate_new_Gaza ComparisonFailure
  org.joda.time.TestDateTimeZoneCutover#test_LocalDate_new_Turk ComparisonFailure
  org.joda.time.TestLocalDateTime_Basics#testToString ComparisonFailure expected...
  org.joda.time.TestLocalDateTime_Basics#testToString_DTFormatter ComparisonFailure
  org.joda.time.TestLocalDateTime_Basics#testToString_String ComparisonFailure e...
  org.joda.time.TestLocalDateTime_Basics#testToString_String_Locale ComparisonFailure
  org.joda.time.TestLocalDate_Basics#testToString ComparisonFailure expected:<[2...
  org.joda.time.TestLocalDate_Basics#testToString_DTFormatter ComparisonFailure ...
  org.joda.time.TestLocalDate_Basics#testToString_String ComparisonFailure expec...
  org.joda.time.TestLocalDate_Basics#testToString_String_Locale ComparisonFailure
  org.joda.time.TestLocalTime_Basics#testToString ComparisonFailure expected:<[1...
  org.joda.time.TestLocalTime_Basics#testToString_DTFormatter ComparisonFailure ...
  org.joda.time.TestLocalTime_Basics#testToString_String ComparisonFailure expec...
  org.joda.time.TestLocalTime_Basics#testToString_String_Locale ComparisonFailure
  org.joda.time.TestMonthDay_Basics#testToString ComparisonFailure expected:<[--...
  org.joda.time.TestMonthDay_Basics#testToString_DTFormatter ComparisonFailure e...
  org.joda.time.TestMonthDay_Basics#testToString_String ComparisonFailure expect...
  org.joda.time.TestMonthDay_Basics#testToString_String_Locale ComparisonFailure
  org.joda.time.TestPartial_Basics#testGetFormatter1 ComparisonFailure expected:...
  org.joda.time.TestPartial_Basics#testGetFormatter3 ComparisonFailure expected:...
  org.joda.time.TestPartial_Basics#testToString1 ComparisonFailure expected:<[10...
  org.joda.time.TestPartial_Basics#testToString3 ComparisonFailure expected:<[20...
  org.joda.time.TestPartial_Basics#testToString4 ComparisonFailure expected:<[-W...
  org.joda.time.TestPartial_Basics#testToString_DTFormatter ComparisonFailure ex...
  org.joda.time.TestPartial_Basics#testToString_String ComparisonFailure expecte...
  org.joda.time.TestPartial_Basics#testToString_String_Locale ComparisonFailure ...
  org.joda.time.TestStringConvert#testLocalDate ComparisonFailure expected:<[201...
  org.joda.time.TestStringConvert#testLocalDateTime ComparisonFailure expected:<...
  org.joda.time.TestStringConvert#testLocalTime ComparisonFailure expected:<[02:...
  org.joda.time.TestStringConvert#testMonthDay ComparisonFailure expected:<[--06...
  org.joda.time.TestStringConvert#testMonthDay_leapDay ComparisonFailure expecte...
  org.joda.time.TestStringConvert#testYearMonth ComparisonFailure expected:<[201...
  org.joda.time.TestTimeOfDay_Basics#testToString ComparisonFailure expected:<[T...
  org.joda.time.TestTimeOfDay_Basics#testToString_DTFormatter ComparisonFailure ...
  org.joda.time.TestTimeOfDay_Basics#testToString_String ComparisonFailure expec...
  org.joda.time.TestTimeOfDay_Basics#testToString_String_Locale ComparisonFailure
  org.joda.time.TestYearMonthDay_Basics#testToString ComparisonFailure expected:...
  org.joda.time.TestYearMonthDay_Basics#testToString_DTFormatter ComparisonFailure
  org.joda.time.TestYearMonthDay_Basics#testToString_String ComparisonFailure ex...
  org.joda.time.TestYearMonthDay_Basics#testToString_String_Locale ComparisonFailure
  org.joda.time.TestYearMonth_Basics#testToString ComparisonFailure expected:<[2...
  org.joda.time.TestYearMonth_Basics#testToString_DTFormatter ComparisonFailure ...
  org.joda.time.TestYearMonth_Basics#testToString_String ComparisonFailure expec...
  org.joda.time.TestYearMonth_Basics#testToString_String_Locale ComparisonFailure
  org.joda.time.format.TestDateTimeFormatter#testPrint_appendableMethods ComparisonFailure
  org.joda.time.format.TestDateTimeFormatter#testPrint_bufferMethods ComparisonFailure
  org.joda.time.format.TestDateTimeFormatter#testPrint_writerMethods ComparisonFailure
  org.joda.time.format.TestISODateTimeFormat#testFormat_date_partial ComparisonFailure
  org.joda.time.format.TestISODateTimeFormat#testFormat_timeNoMillis_partial ComparisonFailure
  org.joda.time.format.TestISODateTimeFormat#testFormat_time_partial ComparisonFailure
  org.joda.time.format.TestISODateTimeFormat_Fields#testForFields_calBased_D ComparisonFailure
  org.joda.time.format.TestISODateTimeFormat_Fields#testForFields_calBased_M ComparisonFailure
  org.joda.time.format.TestISODateTimeFormat_Fields#testForFields_calBased_MD ComparisonFailure
  org.joda.time.format.TestISODateTimeFormat_Fields#testForFields_calBased_YD ComparisonFailure
  org.joda.time.format.TestISODateTimeFormat_Fields#testForFields_calBased_YM ComparisonFailure
  org.joda.time.format.TestISODateTimeFormat_Fields#testForFields_calBased_YMD ComparisonFailure
  org.joda.time.format.TestISODateTimeFormat_Fields#testForFields_calBased_YMD_duplicates ComparisonFailure
  org.joda.time.format.TestISODateTimeFormat_Fields#testForFields_calBased_YMD_unmodifiable ComparisonFailure
  org.joda.time.format.TestISODateTimeFormat_Fields#testForFields_datetime_DH ComparisonFailure
  org.joda.time.format.TestISODateTimeFormat_Fields#testForFields_datetime_DM ComparisonFailure
  org.joda.time.format.TestISODateTimeFormat_Fields#testForFields_datetime_YH ComparisonFailure
  org.joda.time.format.TestISODateTimeFormat_Fields#testForFields_datetime_YMDH ComparisonFailure
  org.joda.time.format.TestISODateTimeFormat_Fields#testForFields_ordinalBased_D ComparisonFailure
  org.joda.time.format.TestISODateTimeFormat_Fields#testForFields_ordinalBased_YD ComparisonFailure
  org.joda.time.format.TestISODateTimeFormat_Fields#testForFields_time_HM ComparisonFailure
  org.joda.time.format.TestISODateTimeFormat_Fields#testForFields_time_HMS ComparisonFailure
  org.joda.time.format.TestISODateTimeFormat_Fields#testForFields_time_HMSm ComparisonFailure
  org.joda.time.format.TestISODateTimeFormat_Fields#testForFields_time_HMm ComparisonFailure
  org.joda.time.format.TestISODateTimeFormat_Fields#testForFields_time_HS ComparisonFailure
  org.joda.time.format.TestISODateTimeFormat_Fields#testForFields_time_HSm ComparisonFailure
  org.joda.time.format.TestISODateTimeFormat_Fields#testForFields_time_Hm ComparisonFailure
  org.joda.time.format.TestISODateTimeFormat_Fields#testForFields_time_M ComparisonFailure
  org.joda.time.format.TestISODateTimeFormat_Fields#testForFields_time_MS ComparisonFailure
  org.joda.time.format.TestISODateTimeFormat_Fields#testForFields_time_MSm ComparisonFailure
  org.joda.time.format.TestISODateTimeFormat_Fields#testForFields_time_Mm ComparisonFailure
  org.joda.time.format.TestISODateTimeFormat_Fields#testForFields_time_S ComparisonFailure
  org.joda.time.format.TestISODateTimeFormat_Fields#testForFields_time_Sm ComparisonFailure
  org.joda.time.format.TestISODateTimeFormat_Fields#testForFields_time_m ComparisonFailure
  org.joda.time.format.TestISODateTimeFormat_Fields#testForFields_weekBased_D ComparisonFailure
  org.joda.time.format.TestISODateTimeFormat_Fields#testForFields_weekBased_W ComparisonFailure
  org.joda.time.format.TestISODateTimeFormat_Fields#testForFields_weekBased_WD ComparisonFailure
  org.joda.time.format.TestISODateTimeFormat_Fields#testForFields_weekBased_YD ComparisonFailure
  org.joda.time.format.TestISODateTimeFormat_Fields#testForFields_weekBased_YW ComparisonFailure
  org.joda.time.format.TestISODateTimeFormat_Fields#testForFields_weekBased_YWD ComparisonFailure

Tests run: 4157, Failures: 85, Errors: 0, Skipped: 0

[INFO] ------------------------------------------------------------------------
[INFO] BUILD FAILURE
[INFO] ------------------------------------------------------------------------
[INFO] Total time: 15.242s
[INFO] Finished at: Thu Aug 06 07:25:01 BST 2015
[INFO] Final Memory: 9M/213M
[INFO] ------------------------------------------------------------------------
[ERROR] Failed to execute goal org.apache.maven.plugins:maven-surefire-plugin:2.18.1:test (default-test) on project joda-time: There are test failures.
[ERROR] 
[ERROR] Please refer to /home/perham/Study/LittleDarwin/Cases/joda-time-2.8.1/target/surefire-reports for the individual test results.
[ERROR] -> [Help 1]
[ERROR] 
[ERROR] To see the full stack trace of the errors, re-run Maven with the -e switch.
[ERROR] Re-run Maven using the -X switch to enable full debug logging.
[ERROR] 
[ERROR] For more information about the errors and possible solutions, please read the following articles:
[ERROR] [Help 1] http://cwiki.apache.org/confluence/display/MAVEN/MojoFailureException
