[INFO] Scanning for projects...
[INFO]                                                                         
[INFO] ------------------------------------------------------------------------
[INFO] Building Joda-Time 2.8.1
[INFO] ------------------------------------------------------------------------
[INFO] 
[INFO] --- maven-resources-plugin:2.7:resources (default-resources) @ joda-time ---
[INFO] Using 'UTF-8' encoding to copy filtered resources.
[INFO] Copying 2 resources to META-INF
[INFO] Copying 10 resources
[INFO] 
[INFO] --- maven-compiler-plugin:3.3:compile (default-compile) @ joda-time ---
[INFO] Changes detected - recompiling the module!
[INFO] Compiling 166 source files to /home/perham/Study/LittleDarwin/Cases/joda-time-2.8.1/target/classes
[INFO] 
[INFO] --- exec-maven-plugin:1.4.0:java (compile-tzdb) @ joda-time ---
Writing zoneinfo files
Writing ZoneInfoMap
[INFO] 
[INFO] --- maven-resources-plugin:2.7:testResources (default-testResources) @ joda-time ---
[INFO] Using 'UTF-8' encoding to copy filtered resources.
[INFO] Copying 34 resources
[INFO] 
[INFO] --- maven-compiler-plugin:3.3:testCompile (default-testCompile) @ joda-time ---
[INFO] Nothing to compile - all classes are up to date
[INFO] 
[INFO] --- maven-surefire-plugin:2.18.1:test (default-test) @ joda-time ---
[INFO] Surefire report directory: /home/perham/Study/LittleDarwin/Cases/joda-time-2.8.1/target/surefire-reports

-------------------------------------------------------
 T E S T S
-------------------------------------------------------
Running org.joda.time.TestAllPackages

TestBuddhistChronology.testCalendar

TestCopticChronology.testCalendar

TestEthiopicChronology.testCalendar

TestIslamicChronology.testCalendar

Testing Gregorian chronology over 1000 iterations
100% complete (i=1000)

Testing Julian chronology over 1000 iterations
100% complete (i=1000)
Writing zoneinfo files
Writing ZoneInfoMap
Tests run: 4157, Failures: 0, Errors: 13, Skipped: 0, Time elapsed: 5.494 sec <<< FAILURE! - in org.joda.time.TestAllPackages
test_appendTimeZoneId(org.joda.time.format.TestDateTimeFormatterBuilder)  Time elapsed: 0.006 sec  <<< ERROR!
java.lang.IllegalArgumentException: Invalid format: "Asia/Tokyo"
	at org.joda.time.format.DateTimeFormatter.parseDateTime(DateTimeFormatter.java:899)
	at org.joda.time.format.TestDateTimeFormatterBuilder.test_appendTimeZoneId(TestDateTimeFormatterBuilder.java:399)

test_printParseZoneTokyo(org.joda.time.format.TestDateTimeFormatterBuilder)  Time elapsed: 0.001 sec  <<< ERROR!
java.lang.IllegalArgumentException: Invalid format: "2007-03-04 12:30 Asia/Tokyo" is malformed at "Asia/Tokyo"
	at org.joda.time.format.DateTimeFormatter.parseDateTime(DateTimeFormatter.java:899)
	at org.joda.time.format.TestDateTimeFormatterBuilder.test_printParseZoneTokyo(TestDateTimeFormatterBuilder.java:414)

test_printParseZoneParis(org.joda.time.format.TestDateTimeFormatterBuilder)  Time elapsed: 0.001 sec  <<< ERROR!
java.lang.IllegalArgumentException: Invalid format: "2007-03-04 12:30 Europe/Paris" is malformed at "Europe/Paris"
	at org.joda.time.format.DateTimeFormatter.parseDateTime(DateTimeFormatter.java:899)
	at org.joda.time.format.TestDateTimeFormatterBuilder.test_printParseZoneParis(TestDateTimeFormatterBuilder.java:424)

test_printParseZoneDawsonCreek(org.joda.time.format.TestDateTimeFormatterBuilder)  Time elapsed: 0.002 sec  <<< ERROR!
java.lang.IllegalArgumentException: Invalid format: "2007-03-04 12:30 America/Dawson_Creek" is malformed at "America/Dawson_Creek"
	at org.joda.time.format.DateTimeFormatter.parseDateTime(DateTimeFormatter.java:899)
	at org.joda.time.format.TestDateTimeFormatterBuilder.test_printParseZoneDawsonCreek(TestDateTimeFormatterBuilder.java:435)

test_printParseZoneBahiaBanderas(org.joda.time.format.TestDateTimeFormatterBuilder)  Time elapsed: 0.001 sec  <<< ERROR!
java.lang.IllegalArgumentException: Invalid format: "2007-03-04 12:30 America/Bahia_Banderas" is malformed at "America/Bahia_Banderas"
	at org.joda.time.format.DateTimeFormatter.parseDateTime(DateTimeFormatter.java:899)
	at org.joda.time.format.TestDateTimeFormatterBuilder.test_printParseZoneBahiaBanderas(TestDateTimeFormatterBuilder.java:445)

test_printParseOffsetAndZone(org.joda.time.format.TestDateTimeFormatterBuilder)  Time elapsed: 0.002 sec  <<< ERROR!
java.lang.IllegalArgumentException: Invalid format: "2007-03-04 12:30 +09:00 Asia/Tokyo" is malformed at "Asia/Tokyo"
	at org.joda.time.format.DateTimeFormatter.parseDateTime(DateTimeFormatter.java:899)
	at org.joda.time.format.TestDateTimeFormatterBuilder.test_printParseOffsetAndZone(TestDateTimeFormatterBuilder.java:467)

test_parseWrongOffsetAndZone(org.joda.time.format.TestDateTimeFormatterBuilder)  Time elapsed: 0.001 sec  <<< ERROR!
java.lang.IllegalArgumentException: Invalid format: "2007-03-04 12:30 +07:00 Asia/Tokyo" is malformed at "Asia/Tokyo"
	at org.joda.time.format.DateTimeFormatter.parseDateTime(DateTimeFormatter.java:899)
	at org.joda.time.format.TestDateTimeFormatterBuilder.test_parseWrongOffsetAndZone(TestDateTimeFormatterBuilder.java:493)

test_localPrintParseZoneTokyo(org.joda.time.format.TestDateTimeFormatterBuilder)  Time elapsed: 0.002 sec  <<< ERROR!
java.lang.IllegalArgumentException: Invalid format: "2007-03-04 12:30 Asia/Tokyo" is malformed at "Asia/Tokyo"
	at org.joda.time.format.DateTimeFormatter.parseLocalDateTime(DateTimeFormatter.java:854)
	at org.joda.time.format.TestDateTimeFormatterBuilder.test_localPrintParseZoneTokyo(TestDateTimeFormatterBuilder.java:510)

test_localPrintParseOffsetAndZone(org.joda.time.format.TestDateTimeFormatterBuilder)  Time elapsed: 0.001 sec  <<< ERROR!
java.lang.IllegalArgumentException: Invalid format: "2007-03-04 12:30 +09:00 Asia/Tokyo" is malformed at "Asia/Tokyo"
	at org.joda.time.format.DateTimeFormatter.parseLocalDateTime(DateTimeFormatter.java:854)
	at org.joda.time.format.TestDateTimeFormatterBuilder.test_localPrintParseOffsetAndZone(TestDateTimeFormatterBuilder.java:536)

test_localParseWrongOffsetAndZone(org.joda.time.format.TestDateTimeFormatterBuilder)  Time elapsed: 0.002 sec  <<< ERROR!
java.lang.IllegalArgumentException: Invalid format: "2007-03-04 12:30 +07:00 Asia/Tokyo" is malformed at "Asia/Tokyo"
	at org.joda.time.format.DateTimeFormatter.parseLocalDateTime(DateTimeFormatter.java:854)
	at org.joda.time.format.TestDateTimeFormatterBuilder.test_localParseWrongOffsetAndZone(TestDateTimeFormatterBuilder.java:547)

test_printParseShortNameWithLookup(org.joda.time.format.TestDateTimeFormatterBuilder)  Time elapsed: 0.001 sec  <<< ERROR!
java.lang.IllegalArgumentException: Invalid format: "2011-01-04 12:30 GMT" is malformed at "GMT"
	at org.joda.time.format.DateTimeFormatter.parseDateTime(DateTimeFormatter.java:899)
	at org.joda.time.format.TestDateTimeFormatterBuilder.test_printParseShortNameWithLookup(TestDateTimeFormatterBuilder.java:588)

test_printParseShortNameWithAutoLookup(org.joda.time.format.TestDateTimeFormatterBuilder)  Time elapsed: 0.001 sec  <<< ERROR!
java.lang.IllegalArgumentException: Invalid format: "2011-01-04 12:30 EST" is malformed at "EST"
	at org.joda.time.format.DateTimeFormatter.parseDateTime(DateTimeFormatter.java:899)
	at org.joda.time.format.TestDateTimeFormatterBuilder.test_printParseShortNameWithAutoLookup(TestDateTimeFormatterBuilder.java:615)

test_printParseLongNameWithLookup(org.joda.time.format.TestDateTimeFormatterBuilder)  Time elapsed: 0 sec  <<< ERROR!
java.lang.IllegalArgumentException: Invalid format: "2011-01-04 12:30 Greenwich Mean Time" is malformed at "Greenwich Mean Time"
	at org.joda.time.format.DateTimeFormatter.parseDateTime(DateTimeFormatter.java:899)
	at org.joda.time.format.TestDateTimeFormatterBuilder.test_printParseLongNameWithLookup(TestDateTimeFormatterBuilder.java:662)


Results :

Tests in error: 
  org.joda.time.format.TestDateTimeFormatterBuilder#test_appendTimeZoneId IllegalArgumentException
  org.joda.time.format.TestDateTimeFormatterBuilder#test_localParseWrongOffsetAndZone IllegalArgumentException
  org.joda.time.format.TestDateTimeFormatterBuilder#test_localPrintParseOffsetAndZone IllegalArgumentException
  org.joda.time.format.TestDateTimeFormatterBuilder#test_localPrintParseZoneTokyo IllegalArgumentException
  org.joda.time.format.TestDateTimeFormatterBuilder#test_parseWrongOffsetAndZone IllegalArgumentException
  org.joda.time.format.TestDateTimeFormatterBuilder#test_printParseLongNameWithLookup IllegalArgumentException
  org.joda.time.format.TestDateTimeFormatterBuilder#test_printParseOffsetAndZone IllegalArgumentException
  org.joda.time.format.TestDateTimeFormatterBuilder#test_printParseShortNameWithAutoLookup IllegalArgumentException
  org.joda.time.format.TestDateTimeFormatterBuilder#test_printParseShortNameWithLookup IllegalArgumentException
  org.joda.time.format.TestDateTimeFormatterBuilder#test_printParseZoneBahiaBanderas IllegalArgumentException
  org.joda.time.format.TestDateTimeFormatterBuilder#test_printParseZoneDawsonCreek IllegalArgumentException
  org.joda.time.format.TestDateTimeFormatterBuilder#test_printParseZoneParis IllegalArgumentException
  org.joda.time.format.TestDateTimeFormatterBuilder#test_printParseZoneTokyo IllegalArgumentException

Tests run: 4157, Failures: 0, Errors: 13, Skipped: 0

[INFO] ------------------------------------------------------------------------
[INFO] BUILD FAILURE
[INFO] ------------------------------------------------------------------------
[INFO] Total time: 15.303s
[INFO] Finished at: Thu Aug 06 07:18:45 BST 2015
[INFO] Final Memory: 8M/213M
[INFO] ------------------------------------------------------------------------
[ERROR] Failed to execute goal org.apache.maven.plugins:maven-surefire-plugin:2.18.1:test (default-test) on project joda-time: There are test failures.
[ERROR] 
[ERROR] Please refer to /home/perham/Study/LittleDarwin/Cases/joda-time-2.8.1/target/surefire-reports for the individual test results.
[ERROR] -> [Help 1]
[ERROR] 
[ERROR] To see the full stack trace of the errors, re-run Maven with the -e switch.
[ERROR] Re-run Maven using the -X switch to enable full debug logging.
[ERROR] 
[ERROR] For more information about the errors and possible solutions, please read the following articles:
[ERROR] [Help 1] http://cwiki.apache.org/confluence/display/MAVEN/MojoFailureException
