[INFO] Scanning for projects...
[INFO]                                                                         
[INFO] ------------------------------------------------------------------------
[INFO] Building Joda-Time 2.8.1
[INFO] ------------------------------------------------------------------------
[INFO] 
[INFO] --- maven-resources-plugin:2.7:resources (default-resources) @ joda-time ---
[INFO] Using 'UTF-8' encoding to copy filtered resources.
[INFO] Copying 2 resources to META-INF
[INFO] Copying 10 resources
[INFO] 
[INFO] --- maven-compiler-plugin:3.3:compile (default-compile) @ joda-time ---
[INFO] Changes detected - recompiling the module!
[INFO] Compiling 166 source files to /home/perham/Study/LittleDarwin/Cases/joda-time-2.8.1/target/classes
[INFO] 
[INFO] --- exec-maven-plugin:1.4.0:java (compile-tzdb) @ joda-time ---
Writing zoneinfo files
Writing ZoneInfoMap
[INFO] 
[INFO] --- maven-resources-plugin:2.7:testResources (default-testResources) @ joda-time ---
[INFO] Using 'UTF-8' encoding to copy filtered resources.
[INFO] Copying 34 resources
[INFO] 
[INFO] --- maven-compiler-plugin:3.3:testCompile (default-testCompile) @ joda-time ---
[INFO] Nothing to compile - all classes are up to date
[INFO] 
[INFO] --- maven-surefire-plugin:2.18.1:test (default-test) @ joda-time ---
[INFO] Surefire report directory: /home/perham/Study/LittleDarwin/Cases/joda-time-2.8.1/target/surefire-reports

-------------------------------------------------------
 T E S T S
-------------------------------------------------------
Running org.joda.time.TestAllPackages

TestBuddhistChronology.testCalendar

TestCopticChronology.testCalendar

TestEthiopicChronology.testCalendar

TestIslamicChronology.testCalendar

Testing Gregorian chronology over 1000 iterations
100% complete (i=1000)

Testing Julian chronology over 1000 iterations
100% complete (i=1000)
Writing zoneinfo files
Writing ZoneInfoMap
Tests run: 4157, Failures: 0, Errors: 14, Skipped: 0, Time elapsed: 19.098 sec <<< FAILURE! - in org.joda.time.TestAllPackages
testToString_String(org.joda.time.TestLocalDate_Basics)  Time elapsed: 1.085 sec  <<< ERROR!
java.lang.OutOfMemoryError: Java heap space
	at java.util.Arrays.copyOf(Arrays.java:2367)
	at java.lang.AbstractStringBuilder.expandCapacity(AbstractStringBuilder.java:130)
	at java.lang.AbstractStringBuilder.ensureCapacityInternal(AbstractStringBuilder.java:114)
	at java.lang.AbstractStringBuilder.append(AbstractStringBuilder.java:587)
	at java.lang.StringBuilder.append(StringBuilder.java:214)
	at java.lang.StringBuilder.append(StringBuilder.java:72)
	at org.joda.time.format.DateTimeFormatterBuilder.appendUnknownString(DateTimeFormatterBuilder.java:176)
	at org.joda.time.format.DateTimeFormatterBuilder$PaddedNumber.printTo(DateTimeFormatterBuilder.java:251)
	at org.joda.time.format.DateTimeFormatterBuilder$Composite.printTo(DateTimeFormatterBuilder.java:681)
	at org.joda.time.format.DateTimeFormatter.printTo(DateTimeFormatter.java:609)
	at org.joda.time.format.DateTimeFormatter.print(DateTimeFormatter.java:663)
	at org.joda.time.LocalDate.toString(LocalDate.java:1845)
	at org.joda.time.TestLocalDate_Basics.testToString_String(TestLocalDate_Basics.java:1132)

testToString_DTFormatter(org.joda.time.TestLocalDate_Basics)  Time elapsed: 0.995 sec  <<< ERROR!
java.lang.OutOfMemoryError: Java heap space
	at java.util.Arrays.copyOf(Arrays.java:2367)
	at java.lang.AbstractStringBuilder.expandCapacity(AbstractStringBuilder.java:130)
	at java.lang.AbstractStringBuilder.ensureCapacityInternal(AbstractStringBuilder.java:114)
	at java.lang.AbstractStringBuilder.append(AbstractStringBuilder.java:587)
	at java.lang.StringBuilder.append(StringBuilder.java:214)
	at java.lang.StringBuilder.append(StringBuilder.java:72)
	at org.joda.time.format.DateTimeFormatterBuilder.appendUnknownString(DateTimeFormatterBuilder.java:176)
	at org.joda.time.format.DateTimeFormatterBuilder$PaddedNumber.printTo(DateTimeFormatterBuilder.java:251)
	at org.joda.time.format.DateTimeFormatterBuilder$Composite.printTo(DateTimeFormatterBuilder.java:681)
	at org.joda.time.format.DateTimeFormatter.printTo(DateTimeFormatter.java:609)
	at org.joda.time.format.DateTimeFormatter.print(DateTimeFormatter.java:663)
	at org.joda.time.base.AbstractPartial.toString(AbstractPartial.java:412)
	at org.joda.time.TestLocalDate_Basics.testToString_DTFormatter(TestLocalDate_Basics.java:1149)

testToString_String(org.joda.time.TestLocalTime_Basics)  Time elapsed: 1.016 sec  <<< ERROR!
java.lang.OutOfMemoryError: Java heap space
	at java.util.Arrays.copyOf(Arrays.java:2367)
	at java.lang.AbstractStringBuilder.expandCapacity(AbstractStringBuilder.java:130)
	at java.lang.AbstractStringBuilder.ensureCapacityInternal(AbstractStringBuilder.java:114)
	at java.lang.AbstractStringBuilder.append(AbstractStringBuilder.java:587)
	at java.lang.StringBuilder.append(StringBuilder.java:214)
	at java.lang.StringBuilder.append(StringBuilder.java:72)
	at org.joda.time.format.DateTimeFormatterBuilder.appendUnknownString(DateTimeFormatterBuilder.java:176)
	at org.joda.time.format.DateTimeFormatterBuilder$PaddedNumber.printTo(DateTimeFormatterBuilder.java:251)
	at org.joda.time.format.DateTimeFormatterBuilder$Composite.printTo(DateTimeFormatterBuilder.java:681)
	at org.joda.time.format.DateTimeFormatter.printTo(DateTimeFormatter.java:609)
	at org.joda.time.format.DateTimeFormatter.print(DateTimeFormatter.java:663)
	at org.joda.time.LocalTime.toString(LocalTime.java:1312)
	at org.joda.time.TestLocalTime_Basics.testToString_String(TestLocalTime_Basics.java:792)

testToString_DTFormatter(org.joda.time.TestLocalTime_Basics)  Time elapsed: 1.029 sec  <<< ERROR!
java.lang.OutOfMemoryError: Java heap space
	at java.util.Arrays.copyOf(Arrays.java:2367)
	at java.lang.AbstractStringBuilder.expandCapacity(AbstractStringBuilder.java:130)
	at java.lang.AbstractStringBuilder.ensureCapacityInternal(AbstractStringBuilder.java:114)
	at java.lang.AbstractStringBuilder.append(AbstractStringBuilder.java:587)
	at java.lang.StringBuilder.append(StringBuilder.java:214)
	at java.lang.StringBuilder.append(StringBuilder.java:72)
	at org.joda.time.format.DateTimeFormatterBuilder.appendUnknownString(DateTimeFormatterBuilder.java:176)
	at org.joda.time.format.DateTimeFormatterBuilder$PaddedNumber.printTo(DateTimeFormatterBuilder.java:251)
	at org.joda.time.format.DateTimeFormatterBuilder$Composite.printTo(DateTimeFormatterBuilder.java:681)
	at org.joda.time.format.DateTimeFormatter.printTo(DateTimeFormatter.java:609)
	at org.joda.time.format.DateTimeFormatter.print(DateTimeFormatter.java:663)
	at org.joda.time.base.AbstractPartial.toString(AbstractPartial.java:412)
	at org.joda.time.TestLocalTime_Basics.testToString_DTFormatter(TestLocalTime_Basics.java:808)

testToString_String(org.joda.time.TestTimeOfDay_Basics)  Time elapsed: 1.009 sec  <<< ERROR!
java.lang.OutOfMemoryError: Java heap space

testToString_DTFormatter(org.joda.time.TestTimeOfDay_Basics)  Time elapsed: 0.987 sec  <<< ERROR!
java.lang.OutOfMemoryError: Java heap space

testToString_String(org.joda.time.TestYearMonthDay_Basics)  Time elapsed: 0.984 sec  <<< ERROR!
java.lang.OutOfMemoryError: Java heap space

testToString_DTFormatter(org.joda.time.TestYearMonthDay_Basics)  Time elapsed: 0.914 sec  <<< ERROR!
java.lang.OutOfMemoryError: Java heap space

testToString_String(org.joda.time.TestYearMonth_Basics)  Time elapsed: 0.942 sec  <<< ERROR!
java.lang.OutOfMemoryError: Java heap space

testToString_DTFormatter(org.joda.time.TestYearMonth_Basics)  Time elapsed: 0.892 sec  <<< ERROR!
java.lang.OutOfMemoryError: Java heap space

testToString_String(org.joda.time.TestMonthDay_Basics)  Time elapsed: 0.965 sec  <<< ERROR!
java.lang.OutOfMemoryError: Java heap space

testToString_DTFormatter(org.joda.time.TestMonthDay_Basics)  Time elapsed: 0.972 sec  <<< ERROR!
java.lang.OutOfMemoryError: Java heap space

testToString_String(org.joda.time.TestPartial_Basics)  Time elapsed: 0.99 sec  <<< ERROR!
java.lang.OutOfMemoryError: Java heap space

testToString_DTFormatter(org.joda.time.TestPartial_Basics)  Time elapsed: 0.89 sec  <<< ERROR!
java.lang.OutOfMemoryError: Java heap space


Results :

Tests in error: 
  org.joda.time.TestLocalDate_Basics#testToString_DTFormatter OutOfMemoryError J...
  org.joda.time.TestLocalDate_Basics#testToString_String OutOfMemoryError Java h...
  org.joda.time.TestLocalTime_Basics#testToString_DTFormatter OutOfMemoryError J...
  org.joda.time.TestLocalTime_Basics#testToString_String OutOfMemoryError Java h...
  org.joda.time.TestMonthDay_Basics#testToString_DTFormatter OutOfMemoryError Ja...
  org.joda.time.TestMonthDay_Basics#testToString_String OutOfMemoryError Java he...
  org.joda.time.TestPartial_Basics#testToString_DTFormatter OutOfMemoryError Jav...
  org.joda.time.TestPartial_Basics#testToString_String OutOfMemoryError Java hea...
  org.joda.time.TestTimeOfDay_Basics#testToString_DTFormatter OutOfMemoryError J...
  org.joda.time.TestTimeOfDay_Basics#testToString_String OutOfMemoryError Java h...
  org.joda.time.TestYearMonthDay_Basics#testToString_DTFormatter OutOfMemoryError
  org.joda.time.TestYearMonthDay_Basics#testToString_String OutOfMemoryError Jav...
  org.joda.time.TestYearMonth_Basics#testToString_DTFormatter OutOfMemoryError J...
  org.joda.time.TestYearMonth_Basics#testToString_String OutOfMemoryError Java h...

Tests run: 4157, Failures: 0, Errors: 14, Skipped: 0

[INFO] ------------------------------------------------------------------------
[INFO] BUILD FAILURE
[INFO] ------------------------------------------------------------------------
[INFO] Total time: 29.907s
[INFO] Finished at: Thu Aug 06 07:11:35 BST 2015
[INFO] Final Memory: 8M/213M
[INFO] ------------------------------------------------------------------------
[ERROR] Failed to execute goal org.apache.maven.plugins:maven-surefire-plugin:2.18.1:test (default-test) on project joda-time: There are test failures.
[ERROR] 
[ERROR] Please refer to /home/perham/Study/LittleDarwin/Cases/joda-time-2.8.1/target/surefire-reports for the individual test results.
[ERROR] -> [Help 1]
[ERROR] 
[ERROR] To see the full stack trace of the errors, re-run Maven with the -e switch.
[ERROR] Re-run Maven using the -X switch to enable full debug logging.
[ERROR] 
[ERROR] For more information about the errors and possible solutions, please read the following articles:
[ERROR] [Help 1] http://cwiki.apache.org/confluence/display/MAVEN/MojoFailureException
