[INFO] Scanning for projects...
[INFO]                                                                         
[INFO] ------------------------------------------------------------------------
[INFO] Building Joda-Time 2.8.1
[INFO] ------------------------------------------------------------------------
[INFO] 
[INFO] --- maven-resources-plugin:2.7:resources (default-resources) @ joda-time ---
[INFO] Using 'UTF-8' encoding to copy filtered resources.
[INFO] Copying 2 resources to META-INF
[INFO] Copying 10 resources
[INFO] 
[INFO] --- maven-compiler-plugin:3.3:compile (default-compile) @ joda-time ---
[INFO] Changes detected - recompiling the module!
[INFO] Compiling 166 source files to /home/perham/Study/LittleDarwin/Cases/joda-time-2.8.1/target/classes
[INFO] 
[INFO] --- exec-maven-plugin:1.4.0:java (compile-tzdb) @ joda-time ---
Writing zoneinfo files
Writing ZoneInfoMap
[INFO] 
[INFO] --- maven-resources-plugin:2.7:testResources (default-testResources) @ joda-time ---
[INFO] Using 'UTF-8' encoding to copy filtered resources.
[INFO] Copying 34 resources
[INFO] 
[INFO] --- maven-compiler-plugin:3.3:testCompile (default-testCompile) @ joda-time ---
[INFO] Nothing to compile - all classes are up to date
[INFO] 
[INFO] --- maven-surefire-plugin:2.18.1:test (default-test) @ joda-time ---
[INFO] Surefire report directory: /home/perham/Study/LittleDarwin/Cases/joda-time-2.8.1/target/surefire-reports

-------------------------------------------------------
 T E S T S
-------------------------------------------------------
Running org.joda.time.TestAllPackages

TestBuddhistChronology.testCalendar

TestCopticChronology.testCalendar

TestEthiopicChronology.testCalendar

TestIslamicChronology.testCalendar

Testing Gregorian chronology over 1000 iterations
100% complete (i=1000)

Testing Julian chronology over 1000 iterations
100% complete (i=1000)
Writing zoneinfo files
Writing ZoneInfoMap
Tests run: 4157, Failures: 0, Errors: 25, Skipped: 0, Time elapsed: 5.186 sec <<< FAILURE! - in org.joda.time.TestAllPackages
testParseDateTime_simple_precedence(org.joda.time.format.TestDateTimeFormatter)  Time elapsed: 0.004 sec  <<< ERROR!
org.joda.time.IllegalFieldValueException: Value 0 for dayOfWeek must be in the range [1,7]
	at org.joda.time.field.FieldUtils.verifyValueBounds(FieldUtils.java:234)
	at org.joda.time.field.PreciseDurationDateTimeField.set(PreciseDurationDateTimeField.java:79)
	at org.joda.time.MutableDateTime$Property.set(MutableDateTime.java:1384)
	at org.joda.time.format.DateTimeFormatterBuilder$TextField.parseInto(DateTimeFormatterBuilder.java:364)
	at org.joda.time.format.DateTimeFormatterBuilder$Composite.parseInto(DateTimeFormatterBuilder.java:688)
	at org.joda.time.format.DateTimeFormatter.parseDateTime(DateTimeFormatter.java:879)
	at org.joda.time.format.TestDateTimeFormatter.testParseDateTime_simple_precedence(TestDateTimeFormatter.java:598)

testParseMutableDateTime_simple_precedence(org.joda.time.format.TestDateTimeFormatter)  Time elapsed: 0.001 sec  <<< ERROR!
org.joda.time.IllegalFieldValueException: Value 0 for dayOfWeek must be in the range [1,7]
	at org.joda.time.field.FieldUtils.verifyValueBounds(FieldUtils.java:234)
	at org.joda.time.field.PreciseDurationDateTimeField.set(PreciseDurationDateTimeField.java:79)
	at org.joda.time.MutableDateTime$Property.set(MutableDateTime.java:1384)
	at org.joda.time.format.DateTimeFormatterBuilder$TextField.parseInto(DateTimeFormatterBuilder.java:364)
	at org.joda.time.format.DateTimeFormatterBuilder$Composite.parseInto(DateTimeFormatterBuilder.java:688)
	at org.joda.time.format.DateTimeFormatter.parseDateTime(DateTimeFormatter.java:879)
	at org.joda.time.format.TestDateTimeFormatter.testParseMutableDateTime_simple_precedence(TestDateTimeFormatter.java:693)

testParseInto_simple_precedence(org.joda.time.format.TestDateTimeFormatter)  Time elapsed: 0.001 sec  <<< ERROR!
org.joda.time.IllegalFieldValueException: Value 0 for dayOfWeek must be in the range [1,7]
	at org.joda.time.field.FieldUtils.verifyValueBounds(FieldUtils.java:234)
	at org.joda.time.field.PreciseDurationDateTimeField.set(PreciseDurationDateTimeField.java:79)
	at org.joda.time.MutableDateTime$Property.set(MutableDateTime.java:1384)
	at org.joda.time.format.DateTimeFormatterBuilder$TextField.parseInto(DateTimeFormatterBuilder.java:364)
	at org.joda.time.format.DateTimeFormatterBuilder$Composite.parseInto(DateTimeFormatterBuilder.java:688)
	at org.joda.time.format.DateTimeFormatter.parseInto(DateTimeFormatter.java:748)
	at org.joda.time.format.TestDateTimeFormatter.testParseInto_simple_precedence(TestDateTimeFormatter.java:815)

testPrinterParserMethods(org.joda.time.format.TestDateTimeFormatter)  Time elapsed: 0.002 sec  <<< ERROR!
org.joda.time.IllegalFieldValueException: Value 0 for dayOfWeek must be in the range [1,7]
	at org.joda.time.field.FieldUtils.verifyValueBounds(FieldUtils.java:234)
	at org.joda.time.field.PreciseDurationDateTimeField.set(PreciseDurationDateTimeField.java:79)
	at org.joda.time.MutableDateTime$Property.set(MutableDateTime.java:1384)
	at org.joda.time.format.DateTimeFormatterBuilder$TextField.parseInto(DateTimeFormatterBuilder.java:364)
	at org.joda.time.format.DateTimeFormatterBuilder$Composite.parseInto(DateTimeFormatterBuilder.java:688)
	at org.joda.time.format.InternalParserDateTimeParser.parseInto(InternalParserDateTimeParser.java:52)
	at org.joda.time.format.DateTimeFormatter.parseDateTime(DateTimeFormatter.java:879)
	at org.joda.time.format.TestDateTimeFormatter.testPrinterParserMethods(TestDateTimeFormatter.java:338)

testParseLocalDate_yearOfEra(org.joda.time.format.TestDateTimeFormatter)  Time elapsed: 0.003 sec  <<< ERROR!
org.joda.time.IllegalFieldValueException: Value -1 for era must be in the range [0,1]
	at org.joda.time.field.FieldUtils.verifyValueBounds(FieldUtils.java:234)
	at org.joda.time.chrono.GJEraDateTimeField.set(GJEraDateTimeField.java:81)
	at org.joda.time.MutableDateTime$Property.set(MutableDateTime.java:1384)
	at org.joda.time.format.DateTimeFormatterBuilder$TextField.parseInto(DateTimeFormatterBuilder.java:364)
	at org.joda.time.format.DateTimeFormatterBuilder$Composite.parseInto(DateTimeFormatterBuilder.java:688)
	at org.joda.time.format.DateTimeFormatter.parseLocalDateTime(DateTimeFormatter.java:838)
	at org.joda.time.format.DateTimeFormatter.parseLocalDate(DateTimeFormatter.java:798)
	at org.joda.time.format.TestDateTimeFormatter.testParseLocalDate_yearOfEra(TestDateTimeFormatter.java:384)

testFormat_yearOfEraParse(org.joda.time.format.TestDateTimeFormat)  Time elapsed: 0 sec  <<< ERROR!
org.joda.time.IllegalFieldValueException: Value -1 for era must be in the range [0,1]
	at org.joda.time.field.FieldUtils.verifyValueBounds(FieldUtils.java:234)
	at org.joda.time.chrono.GJEraDateTimeField.set(GJEraDateTimeField.java:81)
	at org.joda.time.MutableDateTime$Property.set(MutableDateTime.java:1384)
	at org.joda.time.format.DateTimeFormatterBuilder$TextField.parseInto(DateTimeFormatterBuilder.java:364)
	at org.joda.time.format.DateTimeFormatterBuilder$Composite.parseInto(DateTimeFormatterBuilder.java:688)
	at org.joda.time.format.DateTimeFormatter.parseDateTime(DateTimeFormatter.java:879)
	at org.joda.time.format.TestDateTimeFormat.testFormat_yearOfEraParse(TestDateTimeFormat.java:200)

testFormatParse_textMonthJanShort_UK(org.joda.time.format.TestDateTimeFormat)  Time elapsed: 0 sec  <<< ERROR!
org.joda.time.IllegalFieldValueException: Value 0 for monthOfYear must be in the range [1,12]
	at org.joda.time.field.FieldUtils.verifyValueBounds(FieldUtils.java:234)
	at org.joda.time.chrono.BasicMonthOfYearDateTimeField.set(BasicMonthOfYearDateTimeField.java:299)
	at org.joda.time.MutableDateTime$Property.set(MutableDateTime.java:1384)
	at org.joda.time.format.DateTimeFormatterBuilder$TextField.parseInto(DateTimeFormatterBuilder.java:364)
	at org.joda.time.format.DateTimeFormatterBuilder$Composite.parseInto(DateTimeFormatterBuilder.java:688)
	at org.joda.time.format.DateTimeFormatter.parseDateTime(DateTimeFormatter.java:879)
	at org.joda.time.format.TestDateTimeFormat.testFormatParse_textMonthJanShort_UK(TestDateTimeFormat.java:899)

testFormatParse_textMonthJanShortLowerCase_UK(org.joda.time.format.TestDateTimeFormat)  Time elapsed: 0.001 sec  <<< ERROR!
org.joda.time.IllegalFieldValueException: Value 0 for monthOfYear must be in the range [1,12]
	at org.joda.time.field.FieldUtils.verifyValueBounds(FieldUtils.java:234)
	at org.joda.time.chrono.BasicMonthOfYearDateTimeField.set(BasicMonthOfYearDateTimeField.java:299)
	at org.joda.time.MutableDateTime$Property.set(MutableDateTime.java:1384)
	at org.joda.time.format.DateTimeFormatterBuilder$TextField.parseInto(DateTimeFormatterBuilder.java:364)
	at org.joda.time.format.DateTimeFormatterBuilder$Composite.parseInto(DateTimeFormatterBuilder.java:688)
	at org.joda.time.format.DateTimeFormatter.parseDateTime(DateTimeFormatter.java:879)
	at org.joda.time.format.TestDateTimeFormat.testFormatParse_textMonthJanShortLowerCase_UK(TestDateTimeFormat.java:906)

testFormatParse_textMonthJanShortUpperCase_UK(org.joda.time.format.TestDateTimeFormat)  Time elapsed: 0 sec  <<< ERROR!
org.joda.time.IllegalFieldValueException: Value 0 for monthOfYear must be in the range [1,12]
	at org.joda.time.field.FieldUtils.verifyValueBounds(FieldUtils.java:234)
	at org.joda.time.chrono.BasicMonthOfYearDateTimeField.set(BasicMonthOfYearDateTimeField.java:299)
	at org.joda.time.MutableDateTime$Property.set(MutableDateTime.java:1384)
	at org.joda.time.format.DateTimeFormatterBuilder$TextField.parseInto(DateTimeFormatterBuilder.java:364)
	at org.joda.time.format.DateTimeFormatterBuilder$Composite.parseInto(DateTimeFormatterBuilder.java:688)
	at org.joda.time.format.DateTimeFormatter.parseDateTime(DateTimeFormatter.java:879)
	at org.joda.time.format.TestDateTimeFormat.testFormatParse_textMonthJanShortUpperCase_UK(TestDateTimeFormat.java:913)

testParse_textMonthJanLong_UK(org.joda.time.format.TestDateTimeFormat)  Time elapsed: 0 sec  <<< ERROR!
org.joda.time.IllegalFieldValueException: Value 0 for monthOfYear must be in the range [1,12]
	at org.joda.time.field.FieldUtils.verifyValueBounds(FieldUtils.java:234)
	at org.joda.time.chrono.BasicMonthOfYearDateTimeField.set(BasicMonthOfYearDateTimeField.java:299)
	at org.joda.time.MutableDateTime$Property.set(MutableDateTime.java:1384)
	at org.joda.time.format.DateTimeFormatterBuilder$TextField.parseInto(DateTimeFormatterBuilder.java:364)
	at org.joda.time.format.DateTimeFormatterBuilder$Composite.parseInto(DateTimeFormatterBuilder.java:688)
	at org.joda.time.format.DateTimeFormatter.parseDateTime(DateTimeFormatter.java:879)
	at org.joda.time.format.TestDateTimeFormat.testParse_textMonthJanLong_UK(TestDateTimeFormat.java:921)

testFormatParse_textMonthJanLongLowerCase_UK(org.joda.time.format.TestDateTimeFormat)  Time elapsed: 0.001 sec  <<< ERROR!
org.joda.time.IllegalFieldValueException: Value 0 for monthOfYear must be in the range [1,12]
	at org.joda.time.field.FieldUtils.verifyValueBounds(FieldUtils.java:234)
	at org.joda.time.chrono.BasicMonthOfYearDateTimeField.set(BasicMonthOfYearDateTimeField.java:299)
	at org.joda.time.MutableDateTime$Property.set(MutableDateTime.java:1384)
	at org.joda.time.format.DateTimeFormatterBuilder$TextField.parseInto(DateTimeFormatterBuilder.java:364)
	at org.joda.time.format.DateTimeFormatterBuilder$Composite.parseInto(DateTimeFormatterBuilder.java:688)
	at org.joda.time.format.DateTimeFormatter.parseDateTime(DateTimeFormatter.java:879)
	at org.joda.time.format.TestDateTimeFormat.testFormatParse_textMonthJanLongLowerCase_UK(TestDateTimeFormat.java:928)

testFormatParse_textMonthJanLongUpperCase_UK(org.joda.time.format.TestDateTimeFormat)  Time elapsed: 0 sec  <<< ERROR!
org.joda.time.IllegalFieldValueException: Value 0 for monthOfYear must be in the range [1,12]
	at org.joda.time.field.FieldUtils.verifyValueBounds(FieldUtils.java:234)
	at org.joda.time.chrono.BasicMonthOfYearDateTimeField.set(BasicMonthOfYearDateTimeField.java:299)
	at org.joda.time.MutableDateTime$Property.set(MutableDateTime.java:1384)
	at org.joda.time.format.DateTimeFormatterBuilder$TextField.parseInto(DateTimeFormatterBuilder.java:364)
	at org.joda.time.format.DateTimeFormatterBuilder$Composite.parseInto(DateTimeFormatterBuilder.java:688)
	at org.joda.time.format.DateTimeFormatter.parseDateTime(DateTimeFormatter.java:879)
	at org.joda.time.format.TestDateTimeFormat.testFormatParse_textMonthJanLongUpperCase_UK(TestDateTimeFormat.java:935)

testFormatParse_textMonthJanShort_France(org.joda.time.format.TestDateTimeFormat)  Time elapsed: 0.002 sec  <<< ERROR!
org.joda.time.IllegalFieldValueException: Value 0 for monthOfYear must be in the range [1,12]
	at org.joda.time.field.FieldUtils.verifyValueBounds(FieldUtils.java:234)
	at org.joda.time.chrono.BasicMonthOfYearDateTimeField.set(BasicMonthOfYearDateTimeField.java:299)
	at org.joda.time.MutableDateTime$Property.set(MutableDateTime.java:1384)
	at org.joda.time.format.DateTimeFormatterBuilder$TextField.parseInto(DateTimeFormatterBuilder.java:364)
	at org.joda.time.format.DateTimeFormatterBuilder$Composite.parseInto(DateTimeFormatterBuilder.java:688)
	at org.joda.time.format.DateTimeFormatter.parseDateTime(DateTimeFormatter.java:879)
	at org.joda.time.format.TestDateTimeFormat.testFormatParse_textMonthJanShort_France(TestDateTimeFormat.java:945)

testFormatParse_textMonthJanLong_France(org.joda.time.format.TestDateTimeFormat)  Time elapsed: 0 sec  <<< ERROR!
org.joda.time.IllegalFieldValueException: Value 0 for monthOfYear must be in the range [1,12]
	at org.joda.time.field.FieldUtils.verifyValueBounds(FieldUtils.java:234)
	at org.joda.time.chrono.BasicMonthOfYearDateTimeField.set(BasicMonthOfYearDateTimeField.java:299)
	at org.joda.time.MutableDateTime$Property.set(MutableDateTime.java:1384)
	at org.joda.time.format.DateTimeFormatterBuilder$TextField.parseInto(DateTimeFormatterBuilder.java:364)
	at org.joda.time.format.DateTimeFormatterBuilder$Composite.parseInto(DateTimeFormatterBuilder.java:688)
	at org.joda.time.format.DateTimeFormatter.parseDateTime(DateTimeFormatter.java:879)
	at org.joda.time.format.TestDateTimeFormat.testFormatParse_textMonthJanLong_France(TestDateTimeFormat.java:953)

testFormatParse_textMonthApr_France(org.joda.time.format.TestDateTimeFormat)  Time elapsed: 0.001 sec  <<< ERROR!
org.joda.time.IllegalFieldValueException: Value 0 for monthOfYear must be in the range [1,12]
	at org.joda.time.field.FieldUtils.verifyValueBounds(FieldUtils.java:234)
	at org.joda.time.chrono.BasicMonthOfYearDateTimeField.set(BasicMonthOfYearDateTimeField.java:299)
	at org.joda.time.MutableDateTime$Property.set(MutableDateTime.java:1384)
	at org.joda.time.format.DateTimeFormatterBuilder$TextField.parseInto(DateTimeFormatterBuilder.java:364)
	at org.joda.time.format.DateTimeFormatterBuilder$Composite.parseInto(DateTimeFormatterBuilder.java:688)
	at org.joda.time.format.DateTimeFormatter.parseDateTime(DateTimeFormatter.java:879)
	at org.joda.time.format.TestDateTimeFormat.testFormatParse_textMonthApr_France(TestDateTimeFormat.java:963)

testFormatParse_textMonthAtEnd_France(org.joda.time.format.TestDateTimeFormat)  Time elapsed: 0.001 sec  <<< ERROR!
org.joda.time.IllegalFieldValueException: Value 0 for monthOfYear must be in the range [1,12]
	at org.joda.time.field.FieldUtils.verifyValueBounds(FieldUtils.java:234)
	at org.joda.time.chrono.BasicMonthOfYearDateTimeField.set(BasicMonthOfYearDateTimeField.java:299)
	at org.joda.time.MutableDateTime$Property.set(MutableDateTime.java:1384)
	at org.joda.time.format.DateTimeFormatterBuilder$TextField.parseInto(DateTimeFormatterBuilder.java:364)
	at org.joda.time.format.DateTimeFormatterBuilder$Composite.parseInto(DateTimeFormatterBuilder.java:688)
	at org.joda.time.format.DateTimeFormatter.parseDateTime(DateTimeFormatter.java:879)
	at org.joda.time.format.TestDateTimeFormat.testFormatParse_textMonthAtEnd_France(TestDateTimeFormat.java:973)

testFormatParse_textMonthAtEnd_France_withSpecifiedDefault(org.joda.time.format.TestDateTimeFormat)  Time elapsed: 0 sec  <<< ERROR!
org.joda.time.IllegalFieldValueException: Value 0 for monthOfYear must be in the range [1,12]
	at org.joda.time.field.FieldUtils.verifyValueBounds(FieldUtils.java:234)
	at org.joda.time.chrono.BasicMonthOfYearDateTimeField.set(BasicMonthOfYearDateTimeField.java:299)
	at org.joda.time.MutableDateTime$Property.set(MutableDateTime.java:1384)
	at org.joda.time.format.DateTimeFormatterBuilder$TextField.parseInto(DateTimeFormatterBuilder.java:364)
	at org.joda.time.format.DateTimeFormatterBuilder$Composite.parseInto(DateTimeFormatterBuilder.java:688)
	at org.joda.time.format.DateTimeFormatter.parseDateTime(DateTimeFormatter.java:879)
	at org.joda.time.format.TestDateTimeFormat.testFormatParse_textMonthAtEnd_France_withSpecifiedDefault(TestDateTimeFormat.java:983)

testFormatParse_textMonthApr_Korean(org.joda.time.format.TestDateTimeFormat)  Time elapsed: 0.007 sec  <<< ERROR!
org.joda.time.IllegalFieldValueException: Value 0 for dayOfWeek must be in the range [1,7]
	at org.joda.time.field.FieldUtils.verifyValueBounds(FieldUtils.java:234)
	at org.joda.time.field.PreciseDurationDateTimeField.set(PreciseDurationDateTimeField.java:79)
	at org.joda.time.MutableDateTime$Property.set(MutableDateTime.java:1384)
	at org.joda.time.format.DateTimeFormatterBuilder$TextField.parseInto(DateTimeFormatterBuilder.java:364)
	at org.joda.time.format.DateTimeFormatterBuilder$Composite.parseInto(DateTimeFormatterBuilder.java:688)
	at org.joda.time.format.DateTimeFormatter.parseDateTime(DateTimeFormatter.java:879)
	at org.joda.time.format.TestDateTimeFormat.testFormatParse_textMonthApr_Korean(TestDateTimeFormat.java:992)

testFormatParse_textHalfdayAM_UK(org.joda.time.format.TestDateTimeFormat)  Time elapsed: 0 sec  <<< ERROR!
org.joda.time.IllegalFieldValueException: Value -1 for halfdayOfDay must be in the range [0,1]
	at org.joda.time.field.FieldUtils.verifyValueBounds(FieldUtils.java:234)
	at org.joda.time.field.PreciseDateTimeField.set(PreciseDateTimeField.java:112)
	at org.joda.time.MutableDateTime$Property.set(MutableDateTime.java:1384)
	at org.joda.time.format.DateTimeFormatterBuilder$TextField.parseInto(DateTimeFormatterBuilder.java:364)
	at org.joda.time.format.DateTimeFormatterBuilder$Composite.parseInto(DateTimeFormatterBuilder.java:688)
	at org.joda.time.format.DateTimeFormatter.parseDateTime(DateTimeFormatter.java:879)
	at org.joda.time.format.TestDateTimeFormat.testFormatParse_textHalfdayAM_UK(TestDateTimeFormat.java:1010)

testFormatParse_textHalfdayAM_France(org.joda.time.format.TestDateTimeFormat)  Time elapsed: 0.001 sec  <<< ERROR!
org.joda.time.IllegalFieldValueException: Value -1 for halfdayOfDay must be in the range [0,1]
	at org.joda.time.field.FieldUtils.verifyValueBounds(FieldUtils.java:234)
	at org.joda.time.field.PreciseDateTimeField.set(PreciseDateTimeField.java:112)
	at org.joda.time.MutableDateTime$Property.set(MutableDateTime.java:1384)
	at org.joda.time.format.DateTimeFormatterBuilder$TextField.parseInto(DateTimeFormatterBuilder.java:364)
	at org.joda.time.format.DateTimeFormatterBuilder$Composite.parseInto(DateTimeFormatterBuilder.java:688)
	at org.joda.time.format.DateTimeFormatter.parseDateTime(DateTimeFormatter.java:879)
	at org.joda.time.format.TestDateTimeFormat.testFormatParse_textHalfdayAM_France(TestDateTimeFormat.java:1027)

testFormatParse_textEraAD_UK(org.joda.time.format.TestDateTimeFormat)  Time elapsed: 0.001 sec  <<< ERROR!
org.joda.time.IllegalFieldValueException: Value -1 for era must be in the range [0,1]
	at org.joda.time.field.FieldUtils.verifyValueBounds(FieldUtils.java:234)
	at org.joda.time.chrono.GJEraDateTimeField.set(GJEraDateTimeField.java:81)
	at org.joda.time.MutableDateTime$Property.set(MutableDateTime.java:1384)
	at org.joda.time.format.DateTimeFormatterBuilder$TextField.parseInto(DateTimeFormatterBuilder.java:364)
	at org.joda.time.format.DateTimeFormatterBuilder$Composite.parseInto(DateTimeFormatterBuilder.java:688)
	at org.joda.time.format.DateTimeFormatter.parseDateTime(DateTimeFormatter.java:879)
	at org.joda.time.format.TestDateTimeFormat.testFormatParse_textEraAD_UK(TestDateTimeFormat.java:1042)

testFormatParse_textEraAD_France(org.joda.time.format.TestDateTimeFormat)  Time elapsed: 0 sec  <<< ERROR!
org.joda.time.IllegalFieldValueException: Value -1 for era must be in the range [0,1]
	at org.joda.time.field.FieldUtils.verifyValueBounds(FieldUtils.java:234)
	at org.joda.time.chrono.GJEraDateTimeField.set(GJEraDateTimeField.java:81)
	at org.joda.time.MutableDateTime$Property.set(MutableDateTime.java:1384)
	at org.joda.time.format.DateTimeFormatterBuilder$TextField.parseInto(DateTimeFormatterBuilder.java:364)
	at org.joda.time.format.DateTimeFormatterBuilder$Composite.parseInto(DateTimeFormatterBuilder.java:688)
	at org.joda.time.format.DateTimeFormatter.parseDateTime(DateTimeFormatter.java:879)
	at org.joda.time.format.TestDateTimeFormat.testFormatParse_textEraAD_France(TestDateTimeFormat.java:1056)

testFormatParse_textEraBC_France(org.joda.time.format.TestDateTimeFormat)  Time elapsed: 0.001 sec  <<< ERROR!
org.joda.time.IllegalFieldValueException: Value -1 for era must be in the range [0,1]
	at org.joda.time.field.FieldUtils.verifyValueBounds(FieldUtils.java:234)
	at org.joda.time.chrono.GJEraDateTimeField.set(GJEraDateTimeField.java:81)
	at org.joda.time.MutableDateTime$Property.set(MutableDateTime.java:1384)
	at org.joda.time.format.DateTimeFormatterBuilder$TextField.parseInto(DateTimeFormatterBuilder.java:364)
	at org.joda.time.format.DateTimeFormatterBuilder$Composite.parseInto(DateTimeFormatterBuilder.java:688)
	at org.joda.time.format.DateTimeFormatter.parseDateTime(DateTimeFormatter.java:879)
	at org.joda.time.format.TestDateTimeFormat.testFormatParse_textEraBC_France(TestDateTimeFormat.java:1070)

testFormatParse_textAdjoiningHelloWorld_UK(org.joda.time.format.TestDateTimeFormat)  Time elapsed: 0.001 sec  <<< ERROR!
org.joda.time.IllegalFieldValueException: Value 0 for monthOfYear must be in the range [1,12]
	at org.joda.time.field.FieldUtils.verifyValueBounds(FieldUtils.java:234)
	at org.joda.time.chrono.BasicMonthOfYearDateTimeField.set(BasicMonthOfYearDateTimeField.java:299)
	at org.joda.time.MutableDateTime$Property.set(MutableDateTime.java:1384)
	at org.joda.time.format.DateTimeFormatterBuilder$TextField.parseInto(DateTimeFormatterBuilder.java:364)
	at org.joda.time.format.DateTimeFormatterBuilder$Composite.parseInto(DateTimeFormatterBuilder.java:688)
	at org.joda.time.format.DateTimeFormatter.parseDateTime(DateTimeFormatter.java:879)
	at org.joda.time.format.TestDateTimeFormat.testFormatParse_textAdjoiningHelloWorld_UK(TestDateTimeFormat.java:1121)

testFormatParse_textAdjoiningMonthDOW_UK(org.joda.time.format.TestDateTimeFormat)  Time elapsed: 0.001 sec  <<< ERROR!
org.joda.time.IllegalFieldValueException: Value 0 for monthOfYear must be in the range [1,12]
	at org.joda.time.field.FieldUtils.verifyValueBounds(FieldUtils.java:234)
	at org.joda.time.chrono.BasicMonthOfYearDateTimeField.set(BasicMonthOfYearDateTimeField.java:299)
	at org.joda.time.MutableDateTime$Property.set(MutableDateTime.java:1384)
	at org.joda.time.format.DateTimeFormatterBuilder$TextField.parseInto(DateTimeFormatterBuilder.java:364)
	at org.joda.time.format.DateTimeFormatterBuilder$Composite.parseInto(DateTimeFormatterBuilder.java:688)
	at org.joda.time.format.DateTimeFormatter.parseDateTime(DateTimeFormatter.java:879)
	at org.joda.time.format.TestDateTimeFormat.testFormatParse_textAdjoiningMonthDOW_UK(TestDateTimeFormat.java:1135)


Results :

Tests in error: 
  org.joda.time.format.TestDateTimeFormat#testFormatParse_textAdjoiningHelloWorld_UK IllegalFieldValueException
  org.joda.time.format.TestDateTimeFormat#testFormatParse_textAdjoiningMonthDOW_UK IllegalFieldValueException
  org.joda.time.format.TestDateTimeFormat#testFormatParse_textEraAD_France IllegalFieldValueException
  org.joda.time.format.TestDateTimeFormat#testFormatParse_textEraAD_UK IllegalFieldValueException
  org.joda.time.format.TestDateTimeFormat#testFormatParse_textEraBC_France IllegalFieldValueException
  org.joda.time.format.TestDateTimeFormat#testFormatParse_textHalfdayAM_France IllegalFieldValueException
  org.joda.time.format.TestDateTimeFormat#testFormatParse_textHalfdayAM_UK IllegalFieldValueException
  org.joda.time.format.TestDateTimeFormat#testFormatParse_textMonthApr_France IllegalFieldValueException
  org.joda.time.format.TestDateTimeFormat#testFormatParse_textMonthApr_Korean IllegalFieldValueException
  org.joda.time.format.TestDateTimeFormat#testFormatParse_textMonthAtEnd_France IllegalFieldValueException
  org.joda.time.format.TestDateTimeFormat#testFormatParse_textMonthAtEnd_France_withSpecifiedDefault IllegalFieldValueException
  org.joda.time.format.TestDateTimeFormat#testFormatParse_textMonthJanLongLowerCase_UK IllegalFieldValueException
  org.joda.time.format.TestDateTimeFormat#testFormatParse_textMonthJanLongUpperCase_UK IllegalFieldValueException
  org.joda.time.format.TestDateTimeFormat#testFormatParse_textMonthJanLong_France IllegalFieldValueException
  org.joda.time.format.TestDateTimeFormat#testFormatParse_textMonthJanShortLowerCase_UK IllegalFieldValueException
  org.joda.time.format.TestDateTimeFormat#testFormatParse_textMonthJanShortUpperCase_UK IllegalFieldValueException
  org.joda.time.format.TestDateTimeFormat#testFormatParse_textMonthJanShort_France IllegalFieldValueException
  org.joda.time.format.TestDateTimeFormat#testFormatParse_textMonthJanShort_UK IllegalFieldValueException
  org.joda.time.format.TestDateTimeFormat#testFormat_yearOfEraParse IllegalFieldValueException
  org.joda.time.format.TestDateTimeFormat#testParse_textMonthJanLong_UK IllegalFieldValueException
  org.joda.time.format.TestDateTimeFormatter#testParseDateTime_simple_precedence IllegalFieldValueException
  org.joda.time.format.TestDateTimeFormatter#testParseInto_simple_precedence IllegalFieldValueException
  org.joda.time.format.TestDateTimeFormatter#testParseLocalDate_yearOfEra IllegalFieldValueException
  org.joda.time.format.TestDateTimeFormatter#testParseMutableDateTime_simple_precedence IllegalFieldValueException
  org.joda.time.format.TestDateTimeFormatter#testPrinterParserMethods IllegalFieldValueException

Tests run: 4157, Failures: 0, Errors: 25, Skipped: 0

[INFO] ------------------------------------------------------------------------
[INFO] BUILD FAILURE
[INFO] ------------------------------------------------------------------------
[INFO] Total time: 15.269s
[INFO] Finished at: Thu Aug 06 07:07:23 BST 2015
[INFO] Final Memory: 9M/213M
[INFO] ------------------------------------------------------------------------
[ERROR] Failed to execute goal org.apache.maven.plugins:maven-surefire-plugin:2.18.1:test (default-test) on project joda-time: There are test failures.
[ERROR] 
[ERROR] Please refer to /home/perham/Study/LittleDarwin/Cases/joda-time-2.8.1/target/surefire-reports for the individual test results.
[ERROR] -> [Help 1]
[ERROR] 
[ERROR] To see the full stack trace of the errors, re-run Maven with the -e switch.
[ERROR] Re-run Maven using the -X switch to enable full debug logging.
[ERROR] 
[ERROR] For more information about the errors and possible solutions, please read the following articles:
[ERROR] [Help 1] http://cwiki.apache.org/confluence/display/MAVEN/MojoFailureException
