[INFO] Scanning for projects...
[INFO]                                                                         
[INFO] ------------------------------------------------------------------------
[INFO] Building Joda-Time 2.8.1
[INFO] ------------------------------------------------------------------------
[INFO] 
[INFO] --- maven-resources-plugin:2.7:resources (default-resources) @ joda-time ---
[INFO] Using 'UTF-8' encoding to copy filtered resources.
[INFO] Copying 2 resources to META-INF
[INFO] Copying 10 resources
[INFO] 
[INFO] --- maven-compiler-plugin:3.3:compile (default-compile) @ joda-time ---
[INFO] Changes detected - recompiling the module!
[INFO] Compiling 166 source files to /home/perham/Study/LittleDarwin/Cases/joda-time-2.8.1/target/classes
[INFO] 
[INFO] --- exec-maven-plugin:1.4.0:java (compile-tzdb) @ joda-time ---
Writing zoneinfo files
Writing ZoneInfoMap
[INFO] 
[INFO] --- maven-resources-plugin:2.7:testResources (default-testResources) @ joda-time ---
[INFO] Using 'UTF-8' encoding to copy filtered resources.
[INFO] Copying 34 resources
[INFO] 
[INFO] --- maven-compiler-plugin:3.3:testCompile (default-testCompile) @ joda-time ---
[INFO] Nothing to compile - all classes are up to date
[INFO] 
[INFO] --- maven-surefire-plugin:2.18.1:test (default-test) @ joda-time ---
[INFO] Surefire report directory: /home/perham/Study/LittleDarwin/Cases/joda-time-2.8.1/target/surefire-reports

-------------------------------------------------------
 T E S T S
-------------------------------------------------------
Running org.joda.time.TestAllPackages

TestBuddhistChronology.testCalendar

TestCopticChronology.testCalendar

TestEthiopicChronology.testCalendar

TestIslamicChronology.testCalendar

Testing Gregorian chronology over 1000 iterations
100% complete (i=1000)

Testing Julian chronology over 1000 iterations
100% complete (i=1000)
Writing zoneinfo files
Writing ZoneInfoMap
Tests run: 4157, Failures: 0, Errors: 25, Skipped: 0, Time elapsed: 5.217 sec <<< FAILURE! - in org.joda.time.TestAllPackages
testParse_formatter(org.joda.time.TestInstant_Constructors)  Time elapsed: 0.005 sec  <<< ERROR!
java.lang.IllegalArgumentException: Invalid format: "2010--30 06 13" is malformed at "--30 06 13"
	at org.joda.time.format.DateTimeFormatter.parseDateTime(DateTimeFormatter.java:899)
	at org.joda.time.Instant.parse(Instant.java:98)
	at org.joda.time.TestInstant_Constructors.testParse_formatter(TestInstant_Constructors.java:106)

testParse_formatter(org.joda.time.TestDateTime_Constructors)  Time elapsed: 0.001 sec  <<< ERROR!
java.lang.IllegalArgumentException: Invalid format: "2010--30 06 13" is malformed at "--30 06 13"
	at org.joda.time.format.DateTimeFormatter.parseDateTime(DateTimeFormatter.java:899)
	at org.joda.time.DateTime.parse(DateTime.java:160)
	at org.joda.time.TestDateTime_Constructors.testParse_formatter(TestDateTime_Constructors.java:178)

testParse_formatter(org.joda.time.TestMutableDateTime_Constructors)  Time elapsed: 0.001 sec  <<< ERROR!
java.lang.IllegalArgumentException: Invalid format: "2010--30 06 13" is malformed at "--30 06 13"
	at org.joda.time.format.DateTimeFormatter.parseDateTime(DateTimeFormatter.java:899)
	at org.joda.time.MutableDateTime.parse(MutableDateTime.java:160)
	at org.joda.time.TestMutableDateTime_Constructors.testParse_formatter(TestMutableDateTime_Constructors.java:163)

testParse_formatter(org.joda.time.TestDateMidnight_Constructors)  Time elapsed: 0.001 sec  <<< ERROR!
java.lang.IllegalArgumentException: Invalid format: "2010--30 06" is malformed at "--30 06"
	at org.joda.time.format.DateTimeFormatter.parseDateTime(DateTimeFormatter.java:899)
	at org.joda.time.DateMidnight.parse(DateMidnight.java:152)
	at org.joda.time.TestDateMidnight_Constructors.testParse_formatter(TestDateMidnight_Constructors.java:179)

testParse_formatter(org.joda.time.TestLocalDateTime_Constructors)  Time elapsed: 0 sec  <<< ERROR!
java.lang.IllegalArgumentException: Invalid format: "2010--30 06 13" is malformed at "--30 06 13"
	at org.joda.time.format.DateTimeFormatter.parseLocalDateTime(DateTimeFormatter.java:854)
	at org.joda.time.LocalDateTime.parse(LocalDateTime.java:168)
	at org.joda.time.TestLocalDateTime_Constructors.testParse_formatter(TestLocalDateTime_Constructors.java:101)

testParse_formatter(org.joda.time.TestLocalDate_Constructors)  Time elapsed: 0.002 sec  <<< ERROR!
java.lang.IllegalArgumentException: Invalid format: "2010--30 06" is malformed at "--30 06"
	at org.joda.time.format.DateTimeFormatter.parseLocalDateTime(DateTimeFormatter.java:854)
	at org.joda.time.format.DateTimeFormatter.parseLocalDate(DateTimeFormatter.java:798)
	at org.joda.time.LocalDate.parse(LocalDate.java:179)
	at org.joda.time.TestLocalDate_Constructors.testParse_formatter(TestLocalDate_Constructors.java:93)

testParse_formatter(org.joda.time.TestYearMonth_Constructors)  Time elapsed: 0.001 sec  <<< ERROR!
java.lang.IllegalArgumentException: Invalid format: "2010--06" is malformed at "--06"
	at org.joda.time.format.DateTimeFormatter.parseLocalDateTime(DateTimeFormatter.java:854)
	at org.joda.time.format.DateTimeFormatter.parseLocalDate(DateTimeFormatter.java:798)
	at org.joda.time.YearMonth.parse(YearMonth.java:152)
	at org.joda.time.TestYearMonth_Constructors.testParse_formatter(TestYearMonth_Constructors.java:90)

testParse_noFormatter(org.joda.time.TestMonthDay_Constructors)  Time elapsed: 0 sec  <<< ERROR!
java.lang.StringIndexOutOfBoundsException: String index out of range: -1
	at java.lang.String.charAt(String.java:658)
	at org.joda.time.format.DateTimeFormatterBuilder.csStartsWithIgnoreCase(DateTimeFormatterBuilder.java:749)
	at org.joda.time.format.DateTimeFormatterBuilder$StringLiteral.parseInto(DateTimeFormatterBuilder.java:200)
	at org.joda.time.format.DateTimeFormatterBuilder$Composite.parseInto(DateTimeFormatterBuilder.java:688)
	at org.joda.time.format.InternalParserDateTimeParser.parseInto(InternalParserDateTimeParser.java:52)
	at org.joda.time.format.DateTimeFormatterBuilder$MatchingParser.parseInto(DateTimeFormatterBuilder.java:729)
	at org.joda.time.format.DateTimeFormatterBuilder$Composite.parseInto(DateTimeFormatterBuilder.java:688)
	at org.joda.time.format.DateTimeFormatter.parseLocalDateTime(DateTimeFormatter.java:838)
	at org.joda.time.format.DateTimeFormatter.parseLocalDate(DateTimeFormatter.java:798)
	at org.joda.time.MonthDay.parse(MonthDay.java:160)
	at org.joda.time.MonthDay.parse(MonthDay.java:149)
	at org.joda.time.TestMonthDay_Constructors.testParse_noFormatter(TestMonthDay_Constructors.java:82)

testParse_formatter(org.joda.time.TestMonthDay_Constructors)  Time elapsed: 0.001 sec  <<< ERROR!
java.lang.IllegalArgumentException: Invalid format: "2010--30 06" is malformed at "--30 06"
	at org.joda.time.format.DateTimeFormatter.parseLocalDateTime(DateTimeFormatter.java:854)
	at org.joda.time.format.DateTimeFormatter.parseLocalDate(DateTimeFormatter.java:798)
	at org.joda.time.MonthDay.parse(MonthDay.java:160)
	at org.joda.time.TestMonthDay_Constructors.testParse_formatter(TestMonthDay_Constructors.java:90)

testMonthDay(org.joda.time.TestStringConvert)  Time elapsed: 0.001 sec  <<< ERROR!
java.lang.StringIndexOutOfBoundsException: String index out of range: -1
	at java.lang.String.charAt(String.java:658)
	at org.joda.time.format.DateTimeFormatterBuilder.csStartsWithIgnoreCase(DateTimeFormatterBuilder.java:749)
	at org.joda.time.format.DateTimeFormatterBuilder$StringLiteral.parseInto(DateTimeFormatterBuilder.java:200)
	at org.joda.time.format.DateTimeFormatterBuilder$Composite.parseInto(DateTimeFormatterBuilder.java:688)
	at org.joda.time.format.InternalParserDateTimeParser.parseInto(InternalParserDateTimeParser.java:52)
	at org.joda.time.format.DateTimeFormatterBuilder$MatchingParser.parseInto(DateTimeFormatterBuilder.java:729)
	at org.joda.time.format.DateTimeFormatterBuilder$Composite.parseInto(DateTimeFormatterBuilder.java:688)
	at org.joda.time.format.DateTimeFormatter.parseLocalDateTime(DateTimeFormatter.java:838)
	at org.joda.time.format.DateTimeFormatter.parseLocalDate(DateTimeFormatter.java:798)
	at org.joda.time.MonthDay.parse(MonthDay.java:160)
	at org.joda.time.MonthDay.parse(MonthDay.java:149)
	at sun.reflect.NativeMethodAccessorImpl.invoke0(Native Method)
	at sun.reflect.NativeMethodAccessorImpl.invoke(NativeMethodAccessorImpl.java:57)
	at sun.reflect.DelegatingMethodAccessorImpl.invoke(DelegatingMethodAccessorImpl.java:43)
	at java.lang.reflect.Method.invoke(Method.java:606)
	at org.joda.convert.MethodsStringConverter.convertFromString(MethodsStringConverter.java:70)
	at org.joda.convert.StringConvert.convertFromString(StringConvert.java:163)
	at org.joda.time.TestStringConvert.testMonthDay(TestStringConvert.java:106)

testMonthDay_leapDay(org.joda.time.TestStringConvert)  Time elapsed: 0 sec  <<< ERROR!
java.lang.StringIndexOutOfBoundsException: String index out of range: -1
	at java.lang.String.charAt(String.java:658)
	at org.joda.time.format.DateTimeFormatterBuilder.csStartsWithIgnoreCase(DateTimeFormatterBuilder.java:749)
	at org.joda.time.format.DateTimeFormatterBuilder$StringLiteral.parseInto(DateTimeFormatterBuilder.java:200)
	at org.joda.time.format.DateTimeFormatterBuilder$Composite.parseInto(DateTimeFormatterBuilder.java:688)
	at org.joda.time.format.InternalParserDateTimeParser.parseInto(InternalParserDateTimeParser.java:52)
	at org.joda.time.format.DateTimeFormatterBuilder$MatchingParser.parseInto(DateTimeFormatterBuilder.java:729)
	at org.joda.time.format.DateTimeFormatterBuilder$Composite.parseInto(DateTimeFormatterBuilder.java:688)
	at org.joda.time.format.DateTimeFormatter.parseLocalDateTime(DateTimeFormatter.java:838)
	at org.joda.time.format.DateTimeFormatter.parseLocalDate(DateTimeFormatter.java:798)
	at org.joda.time.MonthDay.parse(MonthDay.java:160)
	at org.joda.time.MonthDay.parse(MonthDay.java:149)
	at sun.reflect.NativeMethodAccessorImpl.invoke0(Native Method)
	at sun.reflect.NativeMethodAccessorImpl.invoke(NativeMethodAccessorImpl.java:57)
	at sun.reflect.DelegatingMethodAccessorImpl.invoke(DelegatingMethodAccessorImpl.java:43)
	at java.lang.reflect.Method.invoke(Method.java:606)
	at org.joda.convert.MethodsStringConverter.convertFromString(MethodsStringConverter.java:70)
	at org.joda.convert.StringConvert.convertFromString(StringConvert.java:163)
	at org.joda.time.TestStringConvert.testMonthDay_leapDay(TestStringConvert.java:113)

testCutoverAddWeeks(org.joda.time.chrono.TestGJChronology)  Time elapsed: 0.001 sec  <<< ERROR!
java.lang.IllegalArgumentException: Invalid format: "1582-W01-1" is malformed at "-W01-1"
	at org.joda.time.format.DateTimeParserBucket.doParseMillis(DateTimeParserBucket.java:187)
	at org.joda.time.format.DateTimeFormatter.parseMillis(DateTimeFormatter.java:780)
	at org.joda.time.convert.StringConverter.getInstantMillis(StringConverter.java:65)
	at org.joda.time.base.BaseDateTime.<init>(BaseDateTime.java:175)
	at org.joda.time.DateTime.<init>(DateTime.java:302)
	at org.joda.time.chrono.TestGJChronology.testAdd(TestGJChronology.java:482)
	at org.joda.time.chrono.TestGJChronology.testCutoverAddWeeks(TestGJChronology.java:448)

testCutoverAddWeekyears(org.joda.time.chrono.TestGJChronology)  Time elapsed: 0.001 sec  <<< ERROR!
java.lang.IllegalArgumentException: Invalid format: "1582-W01-1" is malformed at "-W01-1"
	at org.joda.time.format.DateTimeParserBucket.doParseMillis(DateTimeParserBucket.java:187)
	at org.joda.time.format.DateTimeFormatter.parseMillis(DateTimeFormatter.java:780)
	at org.joda.time.convert.StringConverter.getInstantMillis(StringConverter.java:65)
	at org.joda.time.base.BaseDateTime.<init>(BaseDateTime.java:175)
	at org.joda.time.DateTime.<init>(DateTime.java:302)
	at org.joda.time.chrono.TestGJChronology.testAdd(TestGJChronology.java:482)
	at org.joda.time.chrono.TestGJChronology.testCutoverAddWeekyears(TestGJChronology.java:401)

testGetInstantMillis_Object(org.joda.time.convert.TestStringConverter)  Time elapsed: 0.001 sec  <<< ERROR!
java.lang.IllegalArgumentException: Invalid format: "2004-W24-3T+08:00" is malformed at "-W24-3T+08:00"
	at org.joda.time.format.DateTimeParserBucket.doParseMillis(DateTimeParserBucket.java:187)
	at org.joda.time.format.DateTimeFormatter.parseMillis(DateTimeFormatter.java:780)
	at org.joda.time.convert.StringConverter.getInstantMillis(StringConverter.java:65)
	at org.joda.time.convert.TestStringConverter.testGetInstantMillis_Object(TestStringConverter.java:129)

testFormatParse_textMonthApr_Korean(org.joda.time.format.TestDateTimeFormat)  Time elapsed: 0.008 sec  <<< ERROR!
java.lang.IllegalArgumentException: Invalid format: "목요일, 8 3월 2007 22:00" is malformed at ", 8 3월 2007 22:00"
	at org.joda.time.format.DateTimeFormatter.parseDateTime(DateTimeFormatter.java:899)
	at org.joda.time.format.TestDateTimeFormat.testFormatParse_textMonthApr_Korean(TestDateTimeFormat.java:992)

testFormatParse_textAdjoiningHelloWorld_UK(org.joda.time.format.TestDateTimeFormat)  Time elapsed: 0.001 sec  <<< ERROR!
java.lang.IllegalArgumentException: Invalid format: "$23JunHelloWorld" is malformed at "HelloWorld"
	at org.joda.time.format.DateTimeFormatter.parseDateTime(DateTimeFormatter.java:899)
	at org.joda.time.format.TestDateTimeFormat.testFormatParse_textAdjoiningHelloWorld_UK(TestDateTimeFormat.java:1121)

test_weekDate(org.joda.time.format.TestISODateTimeFormatParsing)  Time elapsed: 0 sec  <<< ERROR!
java.lang.IllegalArgumentException: Invalid format: "2006-W27-3" is malformed at "-W27-3"
	at org.joda.time.format.DateTimeFormatter.parseDateTime(DateTimeFormatter.java:899)
	at org.joda.time.format.TestISODateTimeFormatParsing.assertParse(TestISODateTimeFormatParsing.java:840)
	at org.joda.time.format.TestISODateTimeFormatParsing.test_weekDate(TestISODateTimeFormatParsing.java:520)

test_weekDateTime(org.joda.time.format.TestISODateTimeFormatParsing)  Time elapsed: 0.001 sec  <<< ERROR!
java.lang.IllegalArgumentException: Invalid format: "2006-W27-3T10:20:30.400999999Z" is malformed at "-W27-3T10:20:30.400999999Z"
	at org.joda.time.format.DateTimeFormatter.parseDateTime(DateTimeFormatter.java:899)
	at org.joda.time.format.TestISODateTimeFormatParsing.assertParse(TestISODateTimeFormatParsing.java:840)
	at org.joda.time.format.TestISODateTimeFormatParsing.test_weekDateTime(TestISODateTimeFormatParsing.java:533)

test_weekDateTimeNoMillis(org.joda.time.format.TestISODateTimeFormatParsing)  Time elapsed: 0.001 sec  <<< ERROR!
java.lang.IllegalArgumentException: Invalid format: "2006-W27-3T10:20:30Z" is malformed at "-W27-3T10:20:30Z"
	at org.joda.time.format.DateTimeFormatter.parseDateTime(DateTimeFormatter.java:899)
	at org.joda.time.format.TestISODateTimeFormatParsing.assertParse(TestISODateTimeFormatParsing.java:840)
	at org.joda.time.format.TestISODateTimeFormatParsing.test_weekDateTimeNoMillis(TestISODateTimeFormatParsing.java:553)

test_dateParser(org.joda.time.format.TestISODateTimeFormatParsing)  Time elapsed: 0.001 sec  <<< ERROR!
java.lang.IllegalArgumentException: Invalid format: "2006-W27-3" is malformed at "-W27-3"
	at org.joda.time.format.DateTimeParserBucket.doParseMillis(DateTimeParserBucket.java:187)
	at org.joda.time.format.DateTimeFormatter.parseMillis(DateTimeFormatter.java:780)
	at org.joda.time.format.TestISODateTimeFormatParsing.assertParse(TestISODateTimeFormatParsing.java:828)
	at org.joda.time.format.TestISODateTimeFormatParsing.test_dateParser(TestISODateTimeFormatParsing.java:72)

test_localDateParser(org.joda.time.format.TestISODateTimeFormatParsing)  Time elapsed: 0 sec  <<< ERROR!
java.lang.IllegalArgumentException: Invalid format: "2006-W27-3" is malformed at "-W27-3"
	at org.joda.time.format.DateTimeParserBucket.doParseMillis(DateTimeParserBucket.java:187)
	at org.joda.time.format.DateTimeFormatter.parseMillis(DateTimeFormatter.java:780)
	at org.joda.time.format.TestISODateTimeFormatParsing.assertParse(TestISODateTimeFormatParsing.java:828)
	at org.joda.time.format.TestISODateTimeFormatParsing.test_localDateParser(TestISODateTimeFormatParsing.java:103)

test_dateElementParser(org.joda.time.format.TestISODateTimeFormatParsing)  Time elapsed: 0.001 sec  <<< ERROR!
java.lang.IllegalArgumentException: Invalid format: "2006-W27-3" is malformed at "-W27-3"
	at org.joda.time.format.DateTimeParserBucket.doParseMillis(DateTimeParserBucket.java:187)
	at org.joda.time.format.DateTimeFormatter.parseMillis(DateTimeFormatter.java:780)
	at org.joda.time.format.TestISODateTimeFormatParsing.assertParse(TestISODateTimeFormatParsing.java:828)
	at org.joda.time.format.TestISODateTimeFormatParsing.test_dateElementParser(TestISODateTimeFormatParsing.java:136)

test_dateTimeParser(org.joda.time.format.TestISODateTimeFormatParsing)  Time elapsed: 0.001 sec  <<< ERROR!
java.lang.IllegalArgumentException: Invalid format: "2006-W27-3" is malformed at "-W27-3"
	at org.joda.time.format.DateTimeParserBucket.doParseMillis(DateTimeParserBucket.java:187)
	at org.joda.time.format.DateTimeFormatter.parseMillis(DateTimeFormatter.java:780)
	at org.joda.time.format.TestISODateTimeFormatParsing.assertParse(TestISODateTimeFormatParsing.java:828)
	at org.joda.time.format.TestISODateTimeFormatParsing.test_dateTimeParser(TestISODateTimeFormatParsing.java:268)

test_dateOptionalTimeParser(org.joda.time.format.TestISODateTimeFormatParsing)  Time elapsed: 0.001 sec  <<< ERROR!
java.lang.IllegalArgumentException: Invalid format: "2006-W27-3" is malformed at "-W27-3"
	at org.joda.time.format.DateTimeParserBucket.doParseMillis(DateTimeParserBucket.java:187)
	at org.joda.time.format.DateTimeFormatter.parseMillis(DateTimeFormatter.java:780)
	at org.joda.time.format.TestISODateTimeFormatParsing.assertParse(TestISODateTimeFormatParsing.java:828)
	at org.joda.time.format.TestISODateTimeFormatParsing.test_dateOptionalTimeParser(TestISODateTimeFormatParsing.java:298)

test_localDateOptionalTimeParser(org.joda.time.format.TestISODateTimeFormatParsing)  Time elapsed: 0.001 sec  <<< ERROR!
java.lang.IllegalArgumentException: Invalid format: "2006-W27-3" is malformed at "-W27-3"
	at org.joda.time.format.DateTimeParserBucket.doParseMillis(DateTimeParserBucket.java:187)
	at org.joda.time.format.DateTimeFormatter.parseMillis(DateTimeFormatter.java:780)
	at org.joda.time.format.TestISODateTimeFormatParsing.assertParse(TestISODateTimeFormatParsing.java:828)
	at org.joda.time.format.TestISODateTimeFormatParsing.test_localDateOptionalTimeParser(TestISODateTimeFormatParsing.java:329)


Results :

Tests in error: 
  org.joda.time.TestDateMidnight_Constructors#testParse_formatter IllegalArgumentException
  org.joda.time.TestDateTime_Constructors#testParse_formatter IllegalArgumentException
  org.joda.time.TestInstant_Constructors#testParse_formatter IllegalArgumentException
  org.joda.time.TestLocalDateTime_Constructors#testParse_formatter IllegalArgumentException
  org.joda.time.TestLocalDate_Constructors#testParse_formatter IllegalArgumentException
  org.joda.time.TestMonthDay_Constructors#testParse_formatter IllegalArgumentException
  org.joda.time.TestMonthDay_Constructors#testParse_noFormatter StringIndexOutOfBoundsException
  org.joda.time.TestMutableDateTime_Constructors#testParse_formatter IllegalArgumentException
  org.joda.time.TestStringConvert#testMonthDay StringIndexOutOfBoundsException S...
  org.joda.time.TestStringConvert#testMonthDay_leapDay StringIndexOutOfBoundsException
  org.joda.time.TestYearMonth_Constructors#testParse_formatter IllegalArgumentException
  org.joda.time.chrono.TestGJChronology#testCutoverAddWeeks IllegalArgumentException
  org.joda.time.chrono.TestGJChronology#testCutoverAddWeekyears IllegalArgumentException
  org.joda.time.convert.TestStringConverter#testGetInstantMillis_Object IllegalArgumentException
  org.joda.time.format.TestDateTimeFormat#testFormatParse_textAdjoiningHelloWorld_UK IllegalArgumentException
  org.joda.time.format.TestDateTimeFormat#testFormatParse_textMonthApr_Korean IllegalArgumentException
  org.joda.time.format.TestISODateTimeFormatParsing#test_dateElementParser IllegalArgumentException
  org.joda.time.format.TestISODateTimeFormatParsing#test_dateOptionalTimeParser IllegalArgumentException
  org.joda.time.format.TestISODateTimeFormatParsing#test_dateParser IllegalArgumentException
  org.joda.time.format.TestISODateTimeFormatParsing#test_dateTimeParser IllegalArgumentException
  org.joda.time.format.TestISODateTimeFormatParsing#test_localDateOptionalTimeParser IllegalArgumentException
  org.joda.time.format.TestISODateTimeFormatParsing#test_localDateParser IllegalArgumentException
  org.joda.time.format.TestISODateTimeFormatParsing#test_weekDate IllegalArgumentException
  org.joda.time.format.TestISODateTimeFormatParsing#test_weekDateTime IllegalArgumentException
  org.joda.time.format.TestISODateTimeFormatParsing#test_weekDateTimeNoMillis IllegalArgumentException

Tests run: 4157, Failures: 0, Errors: 25, Skipped: 0

[INFO] ------------------------------------------------------------------------
[INFO] BUILD FAILURE
[INFO] ------------------------------------------------------------------------
[INFO] Total time: 15.417s
[INFO] Finished at: Thu Aug 06 06:35:50 BST 2015
[INFO] Final Memory: 8M/213M
[INFO] ------------------------------------------------------------------------
[ERROR] Failed to execute goal org.apache.maven.plugins:maven-surefire-plugin:2.18.1:test (default-test) on project joda-time: There are test failures.
[ERROR] 
[ERROR] Please refer to /home/perham/Study/LittleDarwin/Cases/joda-time-2.8.1/target/surefire-reports for the individual test results.
[ERROR] -> [Help 1]
[ERROR] 
[ERROR] To see the full stack trace of the errors, re-run Maven with the -e switch.
[ERROR] Re-run Maven using the -X switch to enable full debug logging.
[ERROR] 
[ERROR] For more information about the errors and possible solutions, please read the following articles:
[ERROR] [Help 1] http://cwiki.apache.org/confluence/display/MAVEN/MojoFailureException
