[INFO] Scanning for projects...
[INFO]                                                                         
[INFO] ------------------------------------------------------------------------
[INFO] Building Joda-Time 2.8.1
[INFO] ------------------------------------------------------------------------
[INFO] 
[INFO] --- maven-resources-plugin:2.7:resources (default-resources) @ joda-time ---
[INFO] Using 'UTF-8' encoding to copy filtered resources.
[INFO] Copying 2 resources to META-INF
[INFO] Copying 10 resources
[INFO] 
[INFO] --- maven-compiler-plugin:3.3:compile (default-compile) @ joda-time ---
[INFO] Changes detected - recompiling the module!
[INFO] Compiling 166 source files to /home/perham/Study/LittleDarwin/Cases/joda-time-2.8.1/target/classes
[INFO] 
[INFO] --- exec-maven-plugin:1.4.0:java (compile-tzdb) @ joda-time ---
Writing zoneinfo files
Writing ZoneInfoMap
[INFO] 
[INFO] --- maven-resources-plugin:2.7:testResources (default-testResources) @ joda-time ---
[INFO] Using 'UTF-8' encoding to copy filtered resources.
[INFO] Copying 34 resources
[INFO] 
[INFO] --- maven-compiler-plugin:3.3:testCompile (default-testCompile) @ joda-time ---
[INFO] Nothing to compile - all classes are up to date
[INFO] 
[INFO] --- maven-surefire-plugin:2.18.1:test (default-test) @ joda-time ---
[INFO] Surefire report directory: /home/perham/Study/LittleDarwin/Cases/joda-time-2.8.1/target/surefire-reports

-------------------------------------------------------
 T E S T S
-------------------------------------------------------
Running org.joda.time.TestAllPackages

TestBuddhistChronology.testCalendar

TestCopticChronology.testCalendar

TestEthiopicChronology.testCalendar

TestIslamicChronology.testCalendar

Testing Gregorian chronology over 1000 iterations
100% complete (i=1000)

Testing Julian chronology over 1000 iterations
100% complete (i=1000)
Writing zoneinfo files
Writing ZoneInfoMap
Tests run: 4157, Failures: 275, Errors: 0, Skipped: 0, Time elapsed: 5.436 sec <<< FAILURE! - in org.joda.time.TestAllPackages
testTest(org.joda.time.TestChronology)  Time elapsed: 0.016 sec  <<< FAILURE!
junit.framework.ComparisonFailure: expected:<2002-06-09T0[0:00:00.000Z]> but was:<2002-06-09T0[1:00:00.000+01:00]>
	at junit.framework.Assert.assertEquals(Assert.java:81)
	at junit.framework.Assert.assertEquals(Assert.java:87)
	at org.joda.time.TestChronology.testTest(TestChronology.java:112)

testParse_formatter(org.joda.time.TestInstant_Constructors)  Time elapsed: 0.004 sec  <<< FAILURE!
junit.framework.AssertionFailedError: expected:<2010-06-30T12:00:00.000+01:00> but was:<2010-06-30T13:00:00.000+01:00>
	at junit.framework.Assert.fail(Assert.java:47)
	at junit.framework.Assert.failNotEquals(Assert.java:280)
	at junit.framework.Assert.assertEquals(Assert.java:64)
	at junit.framework.Assert.assertEquals(Assert.java:71)
	at org.joda.time.TestInstant_Constructors.testParse_formatter(TestInstant_Constructors.java:106)

testTest(org.joda.time.TestInstant_Basics)  Time elapsed: 0.001 sec  <<< FAILURE!
junit.framework.ComparisonFailure: expected:<2002-06-09T0[0:00:00.000Z]> but was:<2002-06-09T0[1:00:00.000+01:00]>
	at junit.framework.Assert.assertEquals(Assert.java:81)
	at junit.framework.Assert.assertEquals(Assert.java:87)
	at org.joda.time.TestInstant_Basics.testTest(TestInstant_Basics.java:109)

testToString(org.joda.time.TestInstant_Basics)  Time elapsed: 0 sec  <<< FAILURE!
junit.framework.ComparisonFailure: expected:<2002-06-09T0[0:00:00.000Z]> but was:<2002-06-09T0[1:00:00.000+01:00]>
	at junit.framework.Assert.assertEquals(Assert.java:81)
	at junit.framework.Assert.assertEquals(Assert.java:87)
	at org.joda.time.TestInstant_Basics.testToString(TestInstant_Basics.java:384)

testTest(org.joda.time.TestDateTime_Constructors)  Time elapsed: 0.001 sec  <<< FAILURE!
junit.framework.ComparisonFailure: expected:<2002-06-09T0[0:00:00.000Z]> but was:<2002-06-09T0[1:00:00.000+01:00]>
	at junit.framework.Assert.assertEquals(Assert.java:81)
	at junit.framework.Assert.assertEquals(Assert.java:87)
	at org.joda.time.TestDateTime_Constructors.testTest(TestDateTime_Constructors.java:102)

testParse_formatter(org.joda.time.TestDateTime_Constructors)  Time elapsed: 0.001 sec  <<< FAILURE!
junit.framework.AssertionFailedError: expected:<2010-06-30T12:00:00.000+01:00> but was:<2010-06-30T13:00:00.000+01:00>
	at junit.framework.Assert.fail(Assert.java:47)
	at junit.framework.Assert.failNotEquals(Assert.java:280)
	at junit.framework.Assert.assertEquals(Assert.java:64)
	at junit.framework.Assert.assertEquals(Assert.java:71)
	at org.joda.time.TestDateTime_Constructors.testParse_formatter(TestDateTime_Constructors.java:178)

testTest(org.joda.time.TestDateTime_Basics)  Time elapsed: 0.003 sec  <<< FAILURE!
junit.framework.ComparisonFailure: expected:<2002-06-09T0[0:00:00.000Z]> but was:<2002-06-09T0[1:00:00.000+01:00]>
	at junit.framework.Assert.assertEquals(Assert.java:81)
	at junit.framework.Assert.assertEquals(Assert.java:87)
	at org.joda.time.TestDateTime_Basics.testTest(TestDateTime_Basics.java:131)

testToString(org.joda.time.TestDateTime_Basics)  Time elapsed: 0 sec  <<< FAILURE!
junit.framework.ComparisonFailure: expected:<2002-06-09T0[2:00:00.000+02]:00> but was:<2002-06-09T0[1:00:00.000+01]:00>
	at junit.framework.Assert.assertEquals(Assert.java:81)
	at junit.framework.Assert.assertEquals(Assert.java:87)
	at org.joda.time.TestDateTime_Basics.testToString(TestDateTime_Basics.java:507)

testTest(org.joda.time.TestDateTime_Properties)  Time elapsed: 0.001 sec  <<< FAILURE!
junit.framework.ComparisonFailure: expected:<2002-06-09T0[0:00:00.000Z]> but was:<2002-06-09T0[1:00:00.000+01:00]>
	at junit.framework.Assert.assertEquals(Assert.java:81)
	at junit.framework.Assert.assertEquals(Assert.java:87)
	at org.joda.time.TestDateTime_Properties.testTest(TestDateTime_Properties.java:100)

testPropertyWithMinimumValueMillisOfDayDSTGap(org.joda.time.TestDateTime_Properties)  Time elapsed: 0.002 sec  <<< FAILURE!
junit.framework.ComparisonFailure: expected:<2001-04-[20T01:00:00.000+03]:00> but was:<2001-04-[19T23:00:00.000+01]:00>
	at junit.framework.Assert.assertEquals(Assert.java:81)
	at junit.framework.Assert.assertEquals(Assert.java:87)
	at org.joda.time.TestDateTime_Properties.testPropertyWithMinimumValueMillisOfDayDSTGap(TestDateTime_Properties.java:665)

testTest(org.joda.time.TestMutableDateTime_Constructors)  Time elapsed: 0.001 sec  <<< FAILURE!
junit.framework.ComparisonFailure: expected:<2002-06-09T0[0:00:00.000Z]> but was:<2002-06-09T0[1:00:00.000+01:00]>
	at junit.framework.Assert.assertEquals(Assert.java:81)
	at junit.framework.Assert.assertEquals(Assert.java:87)
	at org.joda.time.TestMutableDateTime_Constructors.testTest(TestMutableDateTime_Constructors.java:102)

testParse_formatter(org.joda.time.TestMutableDateTime_Constructors)  Time elapsed: 0.001 sec  <<< FAILURE!
junit.framework.AssertionFailedError: expected:<2010-06-30T12:00:00.000+01:00> but was:<2010-06-30T13:00:00.000+01:00>
	at junit.framework.Assert.fail(Assert.java:47)
	at junit.framework.Assert.failNotEquals(Assert.java:280)
	at junit.framework.Assert.assertEquals(Assert.java:64)
	at junit.framework.Assert.assertEquals(Assert.java:71)
	at org.joda.time.TestMutableDateTime_Constructors.testParse_formatter(TestMutableDateTime_Constructors.java:163)

testTest(org.joda.time.TestMutableDateTime_Basics)  Time elapsed: 0 sec  <<< FAILURE!
junit.framework.ComparisonFailure: expected:<2002-06-09T0[0:00:00.000Z]> but was:<2002-06-09T0[1:00:00.000+01:00]>
	at junit.framework.Assert.assertEquals(Assert.java:81)
	at junit.framework.Assert.assertEquals(Assert.java:87)
	at org.joda.time.TestMutableDateTime_Basics.testTest(TestMutableDateTime_Basics.java:115)

testToString(org.joda.time.TestMutableDateTime_Basics)  Time elapsed: 0.001 sec  <<< FAILURE!
junit.framework.ComparisonFailure: expected:<2002-06-09T0[2:00:00.000+02]:00> but was:<2002-06-09T0[1:00:00.000+01]:00>
	at junit.framework.Assert.assertEquals(Assert.java:81)
	at junit.framework.Assert.assertEquals(Assert.java:87)
	at org.joda.time.TestMutableDateTime_Basics.testToString(TestMutableDateTime_Basics.java:411)

testTest(org.joda.time.TestMutableDateTime_Sets)  Time elapsed: 0 sec  <<< FAILURE!
junit.framework.ComparisonFailure: expected:<2002-06-09T0[0:00:00.000Z]> but was:<2002-06-09T0[1:00:00.000+01:00]>
	at junit.framework.Assert.assertEquals(Assert.java:81)
	at junit.framework.Assert.assertEquals(Assert.java:87)
	at org.joda.time.TestMutableDateTime_Sets.testTest(TestMutableDateTime_Sets.java:103)

testSetMonthOfYear_int_dstOverlapSummer_addZero(org.joda.time.TestMutableDateTime_Sets)  Time elapsed: 0.002 sec  <<< FAILURE!
junit.framework.ComparisonFailure: expected:<2011-10-30T0[2:30:00.000+02]:00> but was:<2011-10-30T0[1:30:00.000+01]:00>
	at junit.framework.Assert.assertEquals(Assert.java:81)
	at junit.framework.Assert.assertEquals(Assert.java:87)
	at org.joda.time.TestMutableDateTime_Sets.testSetMonthOfYear_int_dstOverlapSummer_addZero(TestMutableDateTime_Sets.java:432)

testSetMonthOfYear_int_dstOverlapWinter_addZero(org.joda.time.TestMutableDateTime_Sets)  Time elapsed: 0 sec  <<< FAILURE!
junit.framework.ComparisonFailure: expected:<2011-10-30T0[2:30:00.000+01:00]> but was:<2011-10-30T0[1:30:00.000Z]>
	at junit.framework.Assert.assertEquals(Assert.java:81)
	at junit.framework.Assert.assertEquals(Assert.java:87)
	at org.joda.time.TestMutableDateTime_Sets.testSetMonthOfYear_int_dstOverlapWinter_addZero(TestMutableDateTime_Sets.java:440)

testSetDayOfMonth_int_dstOverlapSummer_addZero(org.joda.time.TestMutableDateTime_Sets)  Time elapsed: 0 sec  <<< FAILURE!
junit.framework.ComparisonFailure: expected:<2011-10-30T0[2:30:00.000+02]:00> but was:<2011-10-30T0[1:30:00.000+01]:00>
	at junit.framework.Assert.assertEquals(Assert.java:81)
	at junit.framework.Assert.assertEquals(Assert.java:87)
	at org.joda.time.TestMutableDateTime_Sets.testSetDayOfMonth_int_dstOverlapSummer_addZero(TestMutableDateTime_Sets.java:472)

testSetDayOfMonth_int_dstOverlapWinter_addZero(org.joda.time.TestMutableDateTime_Sets)  Time elapsed: 0 sec  <<< FAILURE!
junit.framework.ComparisonFailure: expected:<2011-10-30T0[2:30:00.000+01:00]> but was:<2011-10-30T0[1:30:00.000Z]>
	at junit.framework.Assert.assertEquals(Assert.java:81)
	at junit.framework.Assert.assertEquals(Assert.java:87)
	at org.joda.time.TestMutableDateTime_Sets.testSetDayOfMonth_int_dstOverlapWinter_addZero(TestMutableDateTime_Sets.java:480)

testSetDayOfYear_int_dstOverlapSummer_addZero(org.joda.time.TestMutableDateTime_Sets)  Time elapsed: 0.001 sec  <<< FAILURE!
junit.framework.ComparisonFailure: expected:<2011-10-30T0[2:30:00.000+02]:00> but was:<2011-10-30T0[1:30:00.000+01]:00>
	at junit.framework.Assert.assertEquals(Assert.java:81)
	at junit.framework.Assert.assertEquals(Assert.java:87)
	at org.joda.time.TestMutableDateTime_Sets.testSetDayOfYear_int_dstOverlapSummer_addZero(TestMutableDateTime_Sets.java:494)

testSetDayOfYear_int_dstOverlapWinter_addZero(org.joda.time.TestMutableDateTime_Sets)  Time elapsed: 0.001 sec  <<< FAILURE!
junit.framework.ComparisonFailure: expected:<2011-10-30T0[2:30:00.000+01:00]> but was:<2011-10-30T0[1:30:00.000Z]>
	at junit.framework.Assert.assertEquals(Assert.java:81)
	at junit.framework.Assert.assertEquals(Assert.java:87)
	at org.joda.time.TestMutableDateTime_Sets.testSetDayOfYear_int_dstOverlapWinter_addZero(TestMutableDateTime_Sets.java:502)

testTest(org.joda.time.TestMutableDateTime_Adds)  Time elapsed: 0 sec  <<< FAILURE!
junit.framework.ComparisonFailure: expected:<2002-06-09T0[0:00:00.000Z]> but was:<2002-06-09T0[1:00:00.000+01:00]>
	at junit.framework.Assert.assertEquals(Assert.java:81)
	at junit.framework.Assert.assertEquals(Assert.java:87)
	at org.joda.time.TestMutableDateTime_Adds.testTest(TestMutableDateTime_Adds.java:100)

testAdd_DurationFieldType_int_dstOverlapSummer_addZero(org.joda.time.TestMutableDateTime_Adds)  Time elapsed: 0.001 sec  <<< FAILURE!
junit.framework.ComparisonFailure: expected:<2011-10-30T0[2:30:00.000+02]:00> but was:<2011-10-30T0[1:30:00.000+01]:00>
	at junit.framework.Assert.assertEquals(Assert.java:81)
	at junit.framework.Assert.assertEquals(Assert.java:87)
	at org.joda.time.TestMutableDateTime_Adds.testAdd_DurationFieldType_int_dstOverlapSummer_addZero(TestMutableDateTime_Adds.java:177)

testAdd_DurationFieldType_int_dstOverlapWinter_addZero(org.joda.time.TestMutableDateTime_Adds)  Time elapsed: 0.001 sec  <<< FAILURE!
junit.framework.ComparisonFailure: expected:<2011-10-30T0[2:30:00.000+01:00]> but was:<2011-10-30T0[1:30:00.000Z]>
	at junit.framework.Assert.assertEquals(Assert.java:81)
	at junit.framework.Assert.assertEquals(Assert.java:87)
	at org.joda.time.TestMutableDateTime_Adds.testAdd_DurationFieldType_int_dstOverlapWinter_addZero(TestMutableDateTime_Adds.java:185)

testAddYears_int_dstOverlapSummer_addZero(org.joda.time.TestMutableDateTime_Adds)  Time elapsed: 0.001 sec  <<< FAILURE!
junit.framework.ComparisonFailure: expected:<2011-10-30T0[2:30:00.000+02]:00> but was:<2011-10-30T0[1:30:00.000+01]:00>
	at junit.framework.Assert.assertEquals(Assert.java:81)
	at junit.framework.Assert.assertEquals(Assert.java:87)
	at org.joda.time.TestMutableDateTime_Adds.testAddYears_int_dstOverlapSummer_addZero(TestMutableDateTime_Adds.java:217)

testAddYears_int_dstOverlapWinter_addZero(org.joda.time.TestMutableDateTime_Adds)  Time elapsed: 0.001 sec  <<< FAILURE!
junit.framework.ComparisonFailure: expected:<2011-10-30T0[2:30:00.000+01:00]> but was:<2011-10-30T0[1:30:00.000Z]>
	at junit.framework.Assert.assertEquals(Assert.java:81)
	at junit.framework.Assert.assertEquals(Assert.java:87)
	at org.joda.time.TestMutableDateTime_Adds.testAddYears_int_dstOverlapWinter_addZero(TestMutableDateTime_Adds.java:225)

testAddMonths_int_dstOverlapSummer_addZero(org.joda.time.TestMutableDateTime_Adds)  Time elapsed: 0.001 sec  <<< FAILURE!
junit.framework.ComparisonFailure: expected:<2011-10-30T0[2:30:00.000+02]:00> but was:<2011-10-30T0[1:30:00.000+01]:00>
	at junit.framework.Assert.assertEquals(Assert.java:81)
	at junit.framework.Assert.assertEquals(Assert.java:87)
	at org.joda.time.TestMutableDateTime_Adds.testAddMonths_int_dstOverlapSummer_addZero(TestMutableDateTime_Adds.java:239)

testAddMonths_int_dstOverlapWinter_addZero(org.joda.time.TestMutableDateTime_Adds)  Time elapsed: 0.004 sec  <<< FAILURE!
junit.framework.ComparisonFailure: expected:<2011-10-30T0[2:30:00.000+01:00]> but was:<2011-10-30T0[1:30:00.000Z]>
	at junit.framework.Assert.assertEquals(Assert.java:81)
	at junit.framework.Assert.assertEquals(Assert.java:87)
	at org.joda.time.TestMutableDateTime_Adds.testAddMonths_int_dstOverlapWinter_addZero(TestMutableDateTime_Adds.java:247)

testAddDays_int_dstOverlapSummer_addZero(org.joda.time.TestMutableDateTime_Adds)  Time elapsed: 0 sec  <<< FAILURE!
junit.framework.ComparisonFailure: expected:<2011-10-30T0[2:30:00.000+02]:00> but was:<2011-10-30T0[1:30:00.000+01]:00>
	at junit.framework.Assert.assertEquals(Assert.java:81)
	at junit.framework.Assert.assertEquals(Assert.java:87)
	at org.joda.time.TestMutableDateTime_Adds.testAddDays_int_dstOverlapSummer_addZero(TestMutableDateTime_Adds.java:261)

testAddDays_int_dstOverlapWinter_addZero(org.joda.time.TestMutableDateTime_Adds)  Time elapsed: 0 sec  <<< FAILURE!
junit.framework.ComparisonFailure: expected:<2011-10-30T0[2:30:00.000+01:00]> but was:<2011-10-30T0[1:30:00.000Z]>
	at junit.framework.Assert.assertEquals(Assert.java:81)
	at junit.framework.Assert.assertEquals(Assert.java:87)
	at org.joda.time.TestMutableDateTime_Adds.testAddDays_int_dstOverlapWinter_addZero(TestMutableDateTime_Adds.java:269)

testAddWeeks_int_dstOverlapSummer_addZero(org.joda.time.TestMutableDateTime_Adds)  Time elapsed: 0 sec  <<< FAILURE!
junit.framework.ComparisonFailure: expected:<2011-10-30T0[2:30:00.000+02]:00> but was:<2011-10-30T0[1:30:00.000+01]:00>
	at junit.framework.Assert.assertEquals(Assert.java:81)
	at junit.framework.Assert.assertEquals(Assert.java:87)
	at org.joda.time.TestMutableDateTime_Adds.testAddWeeks_int_dstOverlapSummer_addZero(TestMutableDateTime_Adds.java:290)

testAddWeeks_int_dstOverlapWinter_addZero(org.joda.time.TestMutableDateTime_Adds)  Time elapsed: 0 sec  <<< FAILURE!
junit.framework.ComparisonFailure: expected:<2011-10-30T0[2:30:00.000+01:00]> but was:<2011-10-30T0[1:30:00.000Z]>
	at junit.framework.Assert.assertEquals(Assert.java:81)
	at junit.framework.Assert.assertEquals(Assert.java:87)
	at org.joda.time.TestMutableDateTime_Adds.testAddWeeks_int_dstOverlapWinter_addZero(TestMutableDateTime_Adds.java:298)

testAddHours_int_dstOverlapSummer_addZero(org.joda.time.TestMutableDateTime_Adds)  Time elapsed: 0 sec  <<< FAILURE!
junit.framework.ComparisonFailure: expected:<2011-10-30T0[2:30:00.000+02]:00> but was:<2011-10-30T0[1:30:00.000+01]:00>
	at junit.framework.Assert.assertEquals(Assert.java:81)
	at junit.framework.Assert.assertEquals(Assert.java:87)
	at org.joda.time.TestMutableDateTime_Adds.testAddHours_int_dstOverlapSummer_addZero(TestMutableDateTime_Adds.java:312)

testAddHours_int_dstOverlapWinter_addZero(org.joda.time.TestMutableDateTime_Adds)  Time elapsed: 0 sec  <<< FAILURE!
junit.framework.ComparisonFailure: expected:<2011-10-30T0[2:30:00.000+01:00]> but was:<2011-10-30T0[1:30:00.000Z]>
	at junit.framework.Assert.assertEquals(Assert.java:81)
	at junit.framework.Assert.assertEquals(Assert.java:87)
	at org.joda.time.TestMutableDateTime_Adds.testAddHours_int_dstOverlapWinter_addZero(TestMutableDateTime_Adds.java:320)

testAddMinutes_int_dstOverlapSummer_addZero(org.joda.time.TestMutableDateTime_Adds)  Time elapsed: 0 sec  <<< FAILURE!
junit.framework.ComparisonFailure: expected:<2011-10-30T0[2:30:00.000+02]:00> but was:<2011-10-30T0[1:30:00.000+01]:00>
	at junit.framework.Assert.assertEquals(Assert.java:81)
	at junit.framework.Assert.assertEquals(Assert.java:87)
	at org.joda.time.TestMutableDateTime_Adds.testAddMinutes_int_dstOverlapSummer_addZero(TestMutableDateTime_Adds.java:334)

testAddMinutes_int_dstOverlapWinter_addZero(org.joda.time.TestMutableDateTime_Adds)  Time elapsed: 0.001 sec  <<< FAILURE!
junit.framework.ComparisonFailure: expected:<2011-10-30T0[2:30:00.000+01:00]> but was:<2011-10-30T0[1:30:00.000Z]>
	at junit.framework.Assert.assertEquals(Assert.java:81)
	at junit.framework.Assert.assertEquals(Assert.java:87)
	at org.joda.time.TestMutableDateTime_Adds.testAddMinutes_int_dstOverlapWinter_addZero(TestMutableDateTime_Adds.java:342)

testAddSeconds_int_dstOverlapSummer_addZero(org.joda.time.TestMutableDateTime_Adds)  Time elapsed: 0.001 sec  <<< FAILURE!
junit.framework.ComparisonFailure: expected:<2011-10-30T0[2:30:00.000+02]:00> but was:<2011-10-30T0[1:30:00.000+01]:00>
	at junit.framework.Assert.assertEquals(Assert.java:81)
	at junit.framework.Assert.assertEquals(Assert.java:87)
	at org.joda.time.TestMutableDateTime_Adds.testAddSeconds_int_dstOverlapSummer_addZero(TestMutableDateTime_Adds.java:356)

testAddSeconds_int_dstOverlapWinter_addZero(org.joda.time.TestMutableDateTime_Adds)  Time elapsed: 0 sec  <<< FAILURE!
junit.framework.ComparisonFailure: expected:<2011-10-30T0[2:30:00.000+01:00]> but was:<2011-10-30T0[1:30:00.000Z]>
	at junit.framework.Assert.assertEquals(Assert.java:81)
	at junit.framework.Assert.assertEquals(Assert.java:87)
	at org.joda.time.TestMutableDateTime_Adds.testAddSeconds_int_dstOverlapWinter_addZero(TestMutableDateTime_Adds.java:364)

testAddMillis_int_dstOverlapSummer_addZero(org.joda.time.TestMutableDateTime_Adds)  Time elapsed: 0 sec  <<< FAILURE!
junit.framework.ComparisonFailure: expected:<2011-10-30T0[2:30:00.000+02]:00> but was:<2011-10-30T0[1:30:00.000+01]:00>
	at junit.framework.Assert.assertEquals(Assert.java:81)
	at junit.framework.Assert.assertEquals(Assert.java:87)
	at org.joda.time.TestMutableDateTime_Adds.testAddMillis_int_dstOverlapSummer_addZero(TestMutableDateTime_Adds.java:378)

testAddMillis_int_dstOverlapWinter_addZero(org.joda.time.TestMutableDateTime_Adds)  Time elapsed: 0.001 sec  <<< FAILURE!
junit.framework.ComparisonFailure: expected:<2011-10-30T0[2:30:00.000+01:00]> but was:<2011-10-30T0[1:30:00.000Z]>
	at junit.framework.Assert.assertEquals(Assert.java:81)
	at junit.framework.Assert.assertEquals(Assert.java:87)
	at org.joda.time.TestMutableDateTime_Adds.testAddMillis_int_dstOverlapWinter_addZero(TestMutableDateTime_Adds.java:386)

testTest(org.joda.time.TestMutableDateTime_Properties)  Time elapsed: 0.001 sec  <<< FAILURE!
junit.framework.ComparisonFailure: expected:<2002-06-09T0[0:00:00.000Z]> but was:<2002-06-09T0[1:00:00.000+01:00]>
	at junit.framework.Assert.assertEquals(Assert.java:81)
	at junit.framework.Assert.assertEquals(Assert.java:87)
	at org.joda.time.TestMutableDateTime_Properties.testTest(TestMutableDateTime_Properties.java:93)

testTest(org.joda.time.TestDateMidnight_Constructors)  Time elapsed: 0.001 sec  <<< FAILURE!
junit.framework.ComparisonFailure: expected:<2002-06-09T0[0:00:00.000Z]> but was:<2002-06-09T0[1:00:00.000+01:00]>
	at junit.framework.Assert.assertEquals(Assert.java:81)
	at junit.framework.Assert.assertEquals(Assert.java:87)
	at org.joda.time.TestDateMidnight_Constructors.testTest(TestDateMidnight_Constructors.java:116)

testTest(org.joda.time.TestDateMidnight_Basics)  Time elapsed: 0 sec  <<< FAILURE!
junit.framework.ComparisonFailure: expected:<2002-06-09T0[0:00:00.000Z]> but was:<2002-06-09T0[1:00:00.000+01:00]>
	at junit.framework.Assert.assertEquals(Assert.java:81)
	at junit.framework.Assert.assertEquals(Assert.java:87)
	at org.joda.time.TestDateMidnight_Basics.testTest(TestDateMidnight_Basics.java:146)

testToString(org.joda.time.TestDateMidnight_Basics)  Time elapsed: 0.001 sec  <<< FAILURE!
junit.framework.ComparisonFailure: expected:<2002-06-0[9T00:00:00.000+02]:00> but was:<2002-06-0[8T23:00:00.000+01]:00>
	at junit.framework.Assert.assertEquals(Assert.java:81)
	at junit.framework.Assert.assertEquals(Assert.java:87)
	at org.joda.time.TestDateMidnight_Basics.testToString(TestDateMidnight_Basics.java:442)

testTest(org.joda.time.TestDateMidnight_Properties)  Time elapsed: 0.001 sec  <<< FAILURE!
junit.framework.ComparisonFailure: expected:<2002-06-09T0[0:00:00.000Z]> but was:<2002-06-09T0[1:00:00.000+01:00]>
	at junit.framework.Assert.assertEquals(Assert.java:81)
	at junit.framework.Assert.assertEquals(Assert.java:87)
	at org.joda.time.TestDateMidnight_Properties.testTest(TestDateMidnight_Properties.java:101)

testTest(org.joda.time.TestDuration_Basics)  Time elapsed: 0.001 sec  <<< FAILURE!
junit.framework.ComparisonFailure: expected:<2002-06-09T0[0:00:00.000Z]> but was:<2002-06-09T0[1:00:00.000+01:00]>
	at junit.framework.Assert.assertEquals(Assert.java:81)
	at junit.framework.Assert.assertEquals(Assert.java:87)
	at org.joda.time.TestDuration_Basics.testTest(TestDuration_Basics.java:106)

testTest(org.joda.time.TestInterval_Basics)  Time elapsed: 0.001 sec  <<< FAILURE!
junit.framework.ComparisonFailure: expected:<2002-06-09T0[0:00:00.000Z]> but was:<2002-06-09T0[2:00:00.000+02:00]>
	at junit.framework.Assert.assertEquals(Assert.java:81)
	at junit.framework.Assert.assertEquals(Assert.java:87)
	at org.joda.time.TestInterval_Basics.testTest(TestInterval_Basics.java:116)

testToString(org.joda.time.TestInterval_Basics)  Time elapsed: 0.004 sec  <<< FAILURE!
junit.framework.ComparisonFailure: expected:<2004-06-09T0[7:08:09.010Z/2005-08-13T12:14:16.018Z]> but was:<2004-06-09T0[9:08:09.010+02:00/2005-08-13T14:14:16.018+02:00]>
	at junit.framework.Assert.assertEquals(Assert.java:81)
	at junit.framework.Assert.assertEquals(Assert.java:87)
	at org.joda.time.TestInterval_Basics.testToString(TestInterval_Basics.java:1046)

testTest(org.joda.time.TestMutableInterval_Constructors)  Time elapsed: 0.001 sec  <<< FAILURE!
junit.framework.ComparisonFailure: expected:<2002-06-09T0[0:00:00.000Z]> but was:<2002-06-09T0[2:00:00.000+02:00]>
	at junit.framework.Assert.assertEquals(Assert.java:81)
	at junit.framework.Assert.assertEquals(Assert.java:87)
	at org.joda.time.TestMutableInterval_Constructors.testTest(TestMutableInterval_Constructors.java:105)

testTest(org.joda.time.TestMutableInterval_Basics)  Time elapsed: 0.001 sec  <<< FAILURE!
junit.framework.ComparisonFailure: expected:<2002-06-09T0[0:00:00.000Z]> but was:<2002-06-09T0[1:00:00.000+01:00]>
	at junit.framework.Assert.assertEquals(Assert.java:81)
	at junit.framework.Assert.assertEquals(Assert.java:87)
	at org.joda.time.TestMutableInterval_Basics.testTest(TestMutableInterval_Basics.java:109)

testToString(org.joda.time.TestMutableInterval_Basics)  Time elapsed: 0.001 sec  <<< FAILURE!
junit.framework.ComparisonFailure: expected:<2004-06-09T0[7:08:09.010Z/2005-08-13T12:14:16.018Z]> but was:<2004-06-09T0[8:08:09.010+01:00/2005-08-13T13:14:16.018+01:00]>
	at junit.framework.Assert.assertEquals(Assert.java:81)
	at junit.framework.Assert.assertEquals(Assert.java:87)
	at org.joda.time.TestMutableInterval_Basics.testToString(TestMutableInterval_Basics.java:471)

testTest(org.joda.time.TestMutableInterval_Updates)  Time elapsed: 0.001 sec  <<< FAILURE!
junit.framework.ComparisonFailure: expected:<2002-06-09T0[0:00:00.000Z]> but was:<2002-06-09T0[1:00:00.000+01:00]>
	at junit.framework.Assert.assertEquals(Assert.java:81)
	at junit.framework.Assert.assertEquals(Assert.java:87)
	at org.joda.time.TestMutableInterval_Updates.testTest(TestMutableInterval_Updates.java:102)

testTest(org.joda.time.TestPeriod_Basics)  Time elapsed: 0.012 sec  <<< FAILURE!
junit.framework.ComparisonFailure: expected:<2002-06-09T0[0:00:00.000Z]> but was:<2002-06-09T0[1:00:00.000+01:00]>
	at junit.framework.Assert.assertEquals(Assert.java:81)
	at junit.framework.Assert.assertEquals(Assert.java:87)
	at org.joda.time.TestPeriod_Basics.testTest(TestPeriod_Basics.java:109)

testTest(org.joda.time.TestMutablePeriod_Basics)  Time elapsed: 0.001 sec  <<< FAILURE!
junit.framework.ComparisonFailure: expected:<2002-06-09T0[0:00:00.000Z]> but was:<2002-06-09T0[1:00:00.000+01:00]>
	at junit.framework.Assert.assertEquals(Assert.java:81)
	at junit.framework.Assert.assertEquals(Assert.java:87)
	at org.joda.time.TestMutablePeriod_Basics.testTest(TestMutablePeriod_Basics.java:105)

testTest(org.joda.time.TestMutablePeriod_Updates)  Time elapsed: 0 sec  <<< FAILURE!
junit.framework.ComparisonFailure: expected:<2002-06-09T0[0:00:00.000Z]> but was:<2002-06-09T0[1:00:00.000+01:00]>
	at junit.framework.Assert.assertEquals(Assert.java:81)
	at junit.framework.Assert.assertEquals(Assert.java:87)
	at org.joda.time.TestMutablePeriod_Updates.testTest(TestMutablePeriod_Updates.java:101)

testHour(org.joda.time.TestDateTimeComparator)  Time elapsed: 0.001 sec  <<< FAILURE!
junit.framework.AssertionFailedError: HourM1b expected:<-1> but was:<1>
	at junit.framework.Assert.fail(Assert.java:47)
	at junit.framework.Assert.failNotEquals(Assert.java:280)
	at junit.framework.Assert.assertEquals(Assert.java:64)
	at junit.framework.Assert.assertEquals(Assert.java:198)
	at org.joda.time.TestDateTimeComparator.testHour(TestDateTimeComparator.java:468)

testMonth(org.joda.time.TestDateTimeComparator)  Time elapsed: 0.001 sec  <<< FAILURE!
junit.framework.AssertionFailedError: MONTHM1a expected:<-1> but was:<0>
	at junit.framework.Assert.fail(Assert.java:47)
	at junit.framework.Assert.failNotEquals(Assert.java:280)
	at junit.framework.Assert.assertEquals(Assert.java:64)
	at junit.framework.Assert.assertEquals(Assert.java:198)
	at org.joda.time.TestDateTimeComparator.testMonth(TestDateTimeComparator.java:557)

testYear(org.joda.time.TestDateTimeComparator)  Time elapsed: 0.001 sec  <<< FAILURE!
junit.framework.AssertionFailedError: YEARM1c expected:<-1> but was:<0>
	at junit.framework.Assert.fail(Assert.java:47)
	at junit.framework.Assert.failNotEquals(Assert.java:280)
	at junit.framework.Assert.assertEquals(Assert.java:64)
	at junit.framework.Assert.assertEquals(Assert.java:198)
	at org.joda.time.TestDateTimeComparator.testYear(TestDateTimeComparator.java:579)

testTest(org.joda.time.TestDateTimeUtils)  Time elapsed: 0.001 sec  <<< FAILURE!
junit.framework.ComparisonFailure: expected:<2002-06-09T0[0:00:00.000Z]> but was:<2002-06-09T0[1:00:00.000+01:00]>
	at junit.framework.Assert.assertEquals(Assert.java:81)
	at junit.framework.Assert.assertEquals(Assert.java:87)
	at org.joda.time.TestDateTimeUtils.testTest(TestDateTimeUtils.java:140)

test_MockGazaIsCorrect(org.joda.time.TestDateTimeZoneCutover)  Time elapsed: 0.001 sec  <<< FAILURE!
junit.framework.ComparisonFailure: expected:<2007-03-31T2[3:59:59.999+02]:00> but was:<2007-03-31T2[2:59:59.999+01]:00>
	at junit.framework.Assert.assertEquals(Assert.java:81)
	at junit.framework.Assert.assertEquals(Assert.java:87)
	at org.joda.time.TestDateTimeZoneCutover.test_MockGazaIsCorrect(TestDateTimeZoneCutover.java:63)

test_getOffsetFromLocal_Gaza(org.joda.time.TestDateTimeZoneCutover)  Time elapsed: 0 sec  <<< FAILURE!
junit.framework.ComparisonFailure: 2007-03-31T22:00:00.000+01:00 expected:<2007-03-31T2[3:00:00.000+02]:00> but was:<2007-03-31T2[2:00:00.000+01]:00>
	at junit.framework.Assert.assertEquals(Assert.java:81)
	at org.joda.time.TestDateTimeZoneCutover.doTest_getOffsetFromLocal_Gaza(TestDateTimeZoneCutover.java:88)
	at org.joda.time.TestDateTimeZoneCutover.test_getOffsetFromLocal_Gaza(TestDateTimeZoneCutover.java:71)

test_DateTime_roundFloor_Gaza(org.joda.time.TestDateTimeZoneCutover)  Time elapsed: 0.001 sec  <<< FAILURE!
junit.framework.ComparisonFailure: expected:<2007-04-01T0[8:00:00.000+03]:00> but was:<2007-04-01T0[6:00:00.000+01]:00>
	at junit.framework.Assert.assertEquals(Assert.java:81)
	at junit.framework.Assert.assertEquals(Assert.java:87)
	at org.joda.time.TestDateTimeZoneCutover.test_DateTime_roundFloor_Gaza(TestDateTimeZoneCutover.java:93)

test_DateTime_roundCeiling_minuteOfHour_NewYork_Autumn_postCutover(org.joda.time.TestDateTimeZoneCutover)  Time elapsed: 0 sec  <<< FAILURE!
junit.framework.ComparisonFailure: expected:<2007-11-04T0[1:30:40.000-05:00]> but was:<2007-11-04T0[6:30:40.000Z]>
	at junit.framework.Assert.assertEquals(Assert.java:81)
	at junit.framework.Assert.assertEquals(Assert.java:87)
	at org.joda.time.TestDateTimeZoneCutover.test_DateTime_roundCeiling_minuteOfHour_NewYork_Autumn_postCutover(TestDateTimeZoneCutover.java:791)

test_DateTime_roundCeiling_secondOfMinute_NewYork_Autumn_preCutover(org.joda.time.TestDateTimeZoneCutover)  Time elapsed: 0.001 sec  <<< FAILURE!
junit.framework.ComparisonFailure: expected:<2007-11-04T0[1:30:40.500-04:00]> but was:<2007-11-04T0[5:30:40.500Z]>
	at junit.framework.Assert.assertEquals(Assert.java:81)
	at junit.framework.Assert.assertEquals(Assert.java:87)
	at org.joda.time.TestDateTimeZoneCutover.test_DateTime_roundCeiling_secondOfMinute_NewYork_Autumn_preCutover(TestDateTimeZoneCutover.java:798)

test_DateTime_roundCeiling_secondOfMinute_NewYork_Autumn_postCutover(org.joda.time.TestDateTimeZoneCutover)  Time elapsed: 0 sec  <<< FAILURE!
junit.framework.ComparisonFailure: expected:<2007-11-04T0[1:30:40.500-05:00]> but was:<2007-11-04T0[6:30:40.500Z]>
	at junit.framework.Assert.assertEquals(Assert.java:81)
	at junit.framework.Assert.assertEquals(Assert.java:87)
	at org.joda.time.TestDateTimeZoneCutover.test_DateTime_roundCeiling_secondOfMinute_NewYork_Autumn_postCutover(TestDateTimeZoneCutover.java:805)

test_MoscowIsCorrect_Spring(org.joda.time.TestDateTimeZoneCutover)  Time elapsed: 0.001 sec  <<< FAILURE!
junit.framework.ComparisonFailure: expected:<2007-03-2[5T01:59:59.999+03:00]> but was:<2007-03-2[4T22:59:59.999Z]>
	at junit.framework.Assert.assertEquals(Assert.java:81)
	at junit.framework.Assert.assertEquals(Assert.java:87)
	at org.joda.time.TestDateTimeZoneCutover.test_MoscowIsCorrect_Spring(TestDateTimeZoneCutover.java:822)

test_getOffsetFromLocal_Moscow_Spring(org.joda.time.TestDateTimeZoneCutover)  Time elapsed: 0 sec  <<< FAILURE!
junit.framework.ComparisonFailure: 2007-03-24T22:00:00.000Z expected:<2007-03-2[5T01:00:00.000+03:00]> but was:<2007-03-2[4T22:00:00.000Z]>
	at junit.framework.Assert.assertEquals(Assert.java:81)
	at org.joda.time.TestDateTimeZoneCutover.doTest_getOffsetFromLocal(TestDateTimeZoneCutover.java:1371)
	at org.joda.time.TestDateTimeZoneCutover.doTest_getOffsetFromLocal(TestDateTimeZoneCutover.java:1355)
	at org.joda.time.TestDateTimeZoneCutover.test_getOffsetFromLocal_Moscow_Spring(TestDateTimeZoneCutover.java:830)

test_DateTime_setHourAcross_Moscow_Spring(org.joda.time.TestDateTimeZoneCutover)  Time elapsed: 0.001 sec  <<< FAILURE!
junit.framework.ComparisonFailure: expected:<2007-03-2[5T00:00:00.000+03:00]> but was:<2007-03-2[4T21:00:00.000Z]>
	at junit.framework.Assert.assertEquals(Assert.java:81)
	at junit.framework.Assert.assertEquals(Assert.java:87)
	at org.joda.time.TestDateTimeZoneCutover.test_DateTime_setHourAcross_Moscow_Spring(TestDateTimeZoneCutover.java:847)

test_DateTime_setHourForward_Moscow_Spring(org.joda.time.TestDateTimeZoneCutover)  Time elapsed: 0 sec  <<< FAILURE!
junit.framework.ComparisonFailure: expected:<2007-03-2[5T00:00:00.000+03:00]> but was:<2007-03-2[4T21:00:00.000Z]>
	at junit.framework.Assert.assertEquals(Assert.java:81)
	at junit.framework.Assert.assertEquals(Assert.java:87)
	at org.joda.time.TestDateTimeZoneCutover.test_DateTime_setHourForward_Moscow_Spring(TestDateTimeZoneCutover.java:854)

test_DateTime_setHourBack_Moscow_Spring(org.joda.time.TestDateTimeZoneCutover)  Time elapsed: 0.001 sec  <<< FAILURE!
junit.framework.ComparisonFailure: expected:<2007-03-25T0[8:00:00.000+04]:00> but was:<2007-03-25T0[5:00:00.000+01]:00>
	at junit.framework.Assert.assertEquals(Assert.java:81)
	at junit.framework.Assert.assertEquals(Assert.java:87)
	at org.joda.time.TestDateTimeZoneCutover.test_DateTime_setHourBack_Moscow_Spring(TestDateTimeZoneCutover.java:866)

test_MoscowIsCorrect_Autumn(org.joda.time.TestDateTimeZoneCutover)  Time elapsed: 0 sec  <<< FAILURE!
junit.framework.ComparisonFailure: expected:<2007-10-2[8T02:59:59.999+04]:00> but was:<2007-10-2[7T23:59:59.999+01]:00>
	at junit.framework.Assert.assertEquals(Assert.java:81)
	at junit.framework.Assert.assertEquals(Assert.java:87)
	at org.joda.time.TestDateTimeZoneCutover.test_MoscowIsCorrect_Autumn(TestDateTimeZoneCutover.java:883)

test_getOffsetFromLocal_Moscow_Autumn(org.joda.time.TestDateTimeZoneCutover)  Time elapsed: 0.001 sec  <<< FAILURE!
junit.framework.ComparisonFailure: 2007-10-27T21:00:00.000+01:00 expected:<2007-10-2[8T00:00:00.000+04]:00> but was:<2007-10-2[7T21:00:00.000+01]:00>
	at junit.framework.Assert.assertEquals(Assert.java:81)
	at org.joda.time.TestDateTimeZoneCutover.doTest_getOffsetFromLocal(TestDateTimeZoneCutover.java:1371)
	at org.joda.time.TestDateTimeZoneCutover.doTest_getOffsetFromLocal(TestDateTimeZoneCutover.java:1355)
	at org.joda.time.TestDateTimeZoneCutover.test_getOffsetFromLocal_Moscow_Autumn(TestDateTimeZoneCutover.java:891)

test_DateTime_constructor_Moscow_Autumn(org.joda.time.TestDateTimeZoneCutover)  Time elapsed: 0 sec  <<< FAILURE!
junit.framework.ComparisonFailure: expected:<2007-10-2[8T02:30:00.000+04]:00> but was:<2007-10-2[7T23:30:00.000+01]:00>
	at junit.framework.Assert.assertEquals(Assert.java:81)
	at junit.framework.Assert.assertEquals(Assert.java:87)
	at org.joda.time.TestDateTimeZoneCutover.test_DateTime_constructor_Moscow_Autumn(TestDateTimeZoneCutover.java:923)

test_DateTime_plusHour_Moscow_Autumn(org.joda.time.TestDateTimeZoneCutover)  Time elapsed: 0.001 sec  <<< FAILURE!
junit.framework.ComparisonFailure: expected:<2007-10-27T1[9:00:00.000+04]:00> but was:<2007-10-27T1[6:00:00.000+01]:00>
	at junit.framework.Assert.assertEquals(Assert.java:81)
	at junit.framework.Assert.assertEquals(Assert.java:87)
	at org.joda.time.TestDateTimeZoneCutover.test_DateTime_plusHour_Moscow_Autumn(TestDateTimeZoneCutover.java:928)

test_DateTime_minusHour_Moscow_Autumn(org.joda.time.TestDateTimeZoneCutover)  Time elapsed: 0 sec  <<< FAILURE!
junit.framework.ComparisonFailure: expected:<2007-10-28T0[9:00:00.000+03:00]> but was:<2007-10-28T0[6:00:00.000Z]>
	at junit.framework.Assert.assertEquals(Assert.java:81)
	at junit.framework.Assert.assertEquals(Assert.java:87)
	at org.joda.time.TestDateTimeZoneCutover.test_DateTime_minusHour_Moscow_Autumn(TestDateTimeZoneCutover.java:942)

test_GuatemataIsCorrect_Autumn(org.joda.time.TestDateTimeZoneCutover)  Time elapsed: 0.001 sec  <<< FAILURE!
junit.framework.ComparisonFailure: expected:<2006-[09-30T23:59:59.999-05]:00> but was:<2006-[10-01T05:59:59.999+01]:00>
	at junit.framework.Assert.assertEquals(Assert.java:81)
	at junit.framework.Assert.assertEquals(Assert.java:87)
	at org.joda.time.TestDateTimeZoneCutover.test_GuatemataIsCorrect_Autumn(TestDateTimeZoneCutover.java:964)

test_getOffsetFromLocal_Guatemata_Autumn(org.joda.time.TestDateTimeZoneCutover)  Time elapsed: 0 sec  <<< FAILURE!
junit.framework.ComparisonFailure: 2006-10-01T05:00:00.000+01:00 expected:<2006-[09-30T23:00:00.000-05]:00> but was:<2006-[10-01T05:00:00.000+01]:00>
	at junit.framework.Assert.assertEquals(Assert.java:81)
	at org.joda.time.TestDateTimeZoneCutover.doTest_getOffsetFromLocal(TestDateTimeZoneCutover.java:1371)
	at org.joda.time.TestDateTimeZoneCutover.doTest_getOffsetFromLocal(TestDateTimeZoneCutover.java:1363)
	at org.joda.time.TestDateTimeZoneCutover.test_getOffsetFromLocal_Guatemata_Autumn(TestDateTimeZoneCutover.java:972)

test_DateTime_plusHour_Guatemata_Autumn(org.joda.time.TestDateTimeZoneCutover)  Time elapsed: 0.001 sec  <<< FAILURE!
junit.framework.ComparisonFailure: expected:<2006-[09-30T20:00:00.000-05]:00> but was:<2006-[10-01T02:00:00.000+01]:00>
	at junit.framework.Assert.assertEquals(Assert.java:81)
	at junit.framework.Assert.assertEquals(Assert.java:87)
	at org.joda.time.TestDateTimeZoneCutover.test_DateTime_plusHour_Guatemata_Autumn(TestDateTimeZoneCutover.java:1014)

test_DateTime_minusHour_Guatemata_Autumn(org.joda.time.TestDateTimeZoneCutover)  Time elapsed: 0 sec  <<< FAILURE!
junit.framework.ComparisonFailure: expected:<2006-10-01T0[2:00:00.000-06]:00> but was:<2006-10-01T0[9:00:00.000+01]:00>
	at junit.framework.Assert.assertEquals(Assert.java:81)
	at junit.framework.Assert.assertEquals(Assert.java:87)
	at org.joda.time.TestDateTimeZoneCutover.test_DateTime_minusHour_Guatemata_Autumn(TestDateTimeZoneCutover.java:1034)

test_RioBrancoIsCorrect_Spring(org.joda.time.TestDateTimeZoneCutover)  Time elapsed: 0.001 sec  <<< FAILURE!
junit.framework.ComparisonFailure: expected:<2008-06-2[3T23:59:59.999-05]:00> but was:<2008-06-2[4T05:59:59.999+01]:00>
	at junit.framework.Assert.assertEquals(Assert.java:81)
	at junit.framework.Assert.assertEquals(Assert.java:87)
	at org.joda.time.TestDateTimeZoneCutover.test_RioBrancoIsCorrect_Spring(TestDateTimeZoneCutover.java:1062)

test_getOffsetFromLocal_RioBranco_Spring(org.joda.time.TestDateTimeZoneCutover)  Time elapsed: 0 sec  <<< FAILURE!
junit.framework.ComparisonFailure: 2008-06-24T05:00:00.000+01:00 expected:<2008-06-2[3T23:00:00.000-05]:00> but was:<2008-06-2[4T05:00:00.000+01]:00>
	at junit.framework.Assert.assertEquals(Assert.java:81)
	at org.joda.time.TestDateTimeZoneCutover.doTest_getOffsetFromLocal(TestDateTimeZoneCutover.java:1371)
	at org.joda.time.TestDateTimeZoneCutover.doTest_getOffsetFromLocal(TestDateTimeZoneCutover.java:1363)
	at org.joda.time.TestDateTimeZoneCutover.test_getOffsetFromLocal_RioBranco_Spring(TestDateTimeZoneCutover.java:1070)

test_DateTime_JustAfterLastEverOverlap(org.joda.time.TestDateTimeZoneCutover)  Time elapsed: 0.004 sec  <<< FAILURE!
junit.framework.ComparisonFailure: expected:<2008-08-10T0[0:00:00.000-03]:00> but was:<2008-08-10T0[4:00:00.000+01]:00>
	at junit.framework.Assert.assertEquals(Assert.java:81)
	at junit.framework.Assert.assertEquals(Assert.java:87)
	at org.joda.time.TestDateTimeZoneCutover.test_DateTime_JustAfterLastEverOverlap(TestDateTimeZoneCutover.java:1102)

testWithMinuteOfHourInDstChange_mockZone(org.joda.time.TestDateTimeZoneCutover)  Time elapsed: 0.001 sec  <<< FAILURE!
junit.framework.ComparisonFailure: expected:<2010-10-31T01:[15:00.000+00:3]0> but was:<2010-10-31T01:[45:00.000+01:0]0>
	at junit.framework.Assert.assertEquals(Assert.java:81)
	at junit.framework.Assert.assertEquals(Assert.java:87)
	at org.joda.time.TestDateTimeZoneCutover.testWithMinuteOfHourInDstChange_mockZone(TestDateTimeZoneCutover.java:1120)

testWithHourOfDayInDstChange(org.joda.time.TestDateTimeZoneCutover)  Time elapsed: 0 sec  <<< FAILURE!
junit.framework.ComparisonFailure: expected:<2010-10-31T0[2:30:10.123+02]:00> but was:<2010-10-31T0[1:30:10.123+01]:00>
	at junit.framework.Assert.assertEquals(Assert.java:81)
	at junit.framework.Assert.assertEquals(Assert.java:87)
	at org.joda.time.TestDateTimeZoneCutover.testWithHourOfDayInDstChange(TestDateTimeZoneCutover.java:1140)

testWithMinuteOfHourInDstChange(org.joda.time.TestDateTimeZoneCutover)  Time elapsed: 0.001 sec  <<< FAILURE!
junit.framework.ComparisonFailure: expected:<2010-10-31T0[2:30:10.123+02]:00> but was:<2010-10-31T0[1:30:10.123+01]:00>
	at junit.framework.Assert.assertEquals(Assert.java:81)
	at junit.framework.Assert.assertEquals(Assert.java:87)
	at org.joda.time.TestDateTimeZoneCutover.testWithMinuteOfHourInDstChange(TestDateTimeZoneCutover.java:1147)

testWithSecondOfMinuteInDstChange(org.joda.time.TestDateTimeZoneCutover)  Time elapsed: 0.001 sec  <<< FAILURE!
junit.framework.ComparisonFailure: expected:<2010-10-31T0[2:30:10.123+02]:00> but was:<2010-10-31T0[1:30:10.123+01]:00>
	at junit.framework.Assert.assertEquals(Assert.java:81)
	at junit.framework.Assert.assertEquals(Assert.java:87)
	at org.joda.time.TestDateTimeZoneCutover.testWithSecondOfMinuteInDstChange(TestDateTimeZoneCutover.java:1154)

testWithMillisOfSecondInDstChange_Paris_summer(org.joda.time.TestDateTimeZoneCutover)  Time elapsed: 0 sec  <<< FAILURE!
junit.framework.ComparisonFailure: expected:<2010-10-31T0[2:30:10.123+02]:00> but was:<2010-10-31T0[1:30:10.123+01]:00>
	at junit.framework.Assert.assertEquals(Assert.java:81)
	at junit.framework.Assert.assertEquals(Assert.java:87)
	at org.joda.time.TestDateTimeZoneCutover.testWithMillisOfSecondInDstChange_Paris_summer(TestDateTimeZoneCutover.java:1161)

testWithMillisOfSecondInDstChange_Paris_winter(org.joda.time.TestDateTimeZoneCutover)  Time elapsed: 0.001 sec  <<< FAILURE!
junit.framework.ComparisonFailure: expected:<2010-10-31T0[2:30:10.123+01:00]> but was:<2010-10-31T0[1:30:10.123Z]>
	at junit.framework.Assert.assertEquals(Assert.java:81)
	at junit.framework.Assert.assertEquals(Assert.java:87)
	at org.joda.time.TestDateTimeZoneCutover.testWithMillisOfSecondInDstChange_Paris_winter(TestDateTimeZoneCutover.java:1168)

testWithMillisOfSecondInDstChange_NewYork_summer(org.joda.time.TestDateTimeZoneCutover)  Time elapsed: 0.001 sec  <<< FAILURE!
junit.framework.ComparisonFailure: expected:<2007-11-04T0[1:30:00.123-04:00]> but was:<2007-11-04T0[5:30:00.123Z]>
	at junit.framework.Assert.assertEquals(Assert.java:81)
	at junit.framework.Assert.assertEquals(Assert.java:87)
	at org.joda.time.TestDateTimeZoneCutover.testWithMillisOfSecondInDstChange_NewYork_summer(TestDateTimeZoneCutover.java:1175)

testWithMillisOfSecondInDstChange_NewYork_winter(org.joda.time.TestDateTimeZoneCutover)  Time elapsed: 0.001 sec  <<< FAILURE!
junit.framework.ComparisonFailure: expected:<2007-11-04T0[1:30:00.123-05:00]> but was:<2007-11-04T0[6:30:00.123Z]>
	at junit.framework.Assert.assertEquals(Assert.java:81)
	at junit.framework.Assert.assertEquals(Assert.java:87)
	at org.joda.time.TestDateTimeZoneCutover.testWithMillisOfSecondInDstChange_NewYork_winter(TestDateTimeZoneCutover.java:1182)

testPlusMinutesInDstChange(org.joda.time.TestDateTimeZoneCutover)  Time elapsed: 0 sec  <<< FAILURE!
junit.framework.ComparisonFailure: expected:<2010-10-31T0[2:30:10.123+02]:00> but was:<2010-10-31T0[1:30:10.123+01]:00>
	at junit.framework.Assert.assertEquals(Assert.java:81)
	at junit.framework.Assert.assertEquals(Assert.java:87)
	at org.joda.time.TestDateTimeZoneCutover.testPlusMinutesInDstChange(TestDateTimeZoneCutover.java:1189)

testPlusSecondsInDstChange(org.joda.time.TestDateTimeZoneCutover)  Time elapsed: 0.001 sec  <<< FAILURE!
junit.framework.ComparisonFailure: expected:<2010-10-31T0[2:30:10.123+02]:00> but was:<2010-10-31T0[1:30:10.123+01]:00>
	at junit.framework.Assert.assertEquals(Assert.java:81)
	at junit.framework.Assert.assertEquals(Assert.java:87)
	at org.joda.time.TestDateTimeZoneCutover.testPlusSecondsInDstChange(TestDateTimeZoneCutover.java:1196)

testPlusMillisInDstChange(org.joda.time.TestDateTimeZoneCutover)  Time elapsed: 0 sec  <<< FAILURE!
junit.framework.ComparisonFailure: expected:<2010-10-31T0[2:30:10.123+02]:00> but was:<2010-10-31T0[1:30:10.123+01]:00>
	at junit.framework.Assert.assertEquals(Assert.java:81)
	at junit.framework.Assert.assertEquals(Assert.java:87)
	at org.joda.time.TestDateTimeZoneCutover.testPlusMillisInDstChange(TestDateTimeZoneCutover.java:1203)

testDateTimeCreation_athens(org.joda.time.TestDateTimeZoneCutover)  Time elapsed: 0.001 sec  <<< FAILURE!
junit.framework.ComparisonFailure: expected:<2011-10-30T0[3:15:00.000+03]:00> but was:<2011-10-30T0[1:15:00.000+01]:00>
	at junit.framework.Assert.assertEquals(Assert.java:81)
	at junit.framework.Assert.assertEquals(Assert.java:87)
	at org.joda.time.TestDateTimeZoneCutover.testDateTimeCreation_athens(TestDateTimeZoneCutover.java:1319)

testDateTimeCreation_paris(org.joda.time.TestDateTimeZoneCutover)  Time elapsed: 0 sec  <<< FAILURE!
junit.framework.ComparisonFailure: expected:<2011-10-30T0[2:15:00.000+02]:00> but was:<2011-10-30T0[1:15:00.000+01]:00>
	at junit.framework.Assert.assertEquals(Assert.java:81)
	at junit.framework.Assert.assertEquals(Assert.java:87)
	at org.joda.time.TestDateTimeZoneCutover.testDateTimeCreation_paris(TestDateTimeZoneCutover.java:1326)

testDateTimeCreation_newYork(org.joda.time.TestDateTimeZoneCutover)  Time elapsed: 0.001 sec  <<< FAILURE!
junit.framework.ComparisonFailure: expected:<2010-11-07T0[1:15:00.000-04:00]> but was:<2010-11-07T0[5:15:00.000Z]>
	at junit.framework.Assert.assertEquals(Assert.java:81)
	at junit.framework.Assert.assertEquals(Assert.java:87)
	at org.joda.time.TestDateTimeZoneCutover.testDateTimeCreation_newYork(TestDateTimeZoneCutover.java:1340)

testDateTimeCreation_losAngeles(org.joda.time.TestDateTimeZoneCutover)  Time elapsed: 0.001 sec  <<< FAILURE!
junit.framework.ComparisonFailure: expected:<2010-11-07T0[1:15:00.000-07:00]> but was:<2010-11-07T0[8:15:00.000Z]>
	at junit.framework.Assert.assertEquals(Assert.java:81)
	at junit.framework.Assert.assertEquals(Assert.java:87)
	at org.joda.time.TestDateTimeZoneCutover.testDateTimeCreation_losAngeles(TestDateTimeZoneCutover.java:1347)

test_DateTime_roundCeiling_Gaza(org.joda.time.TestDateTimeZoneCutover)  Time elapsed: 0 sec  <<< FAILURE!
junit.framework.ComparisonFailure: expected:<2007-03-31T[20:00:00.000+02]:00> but was:<2007-03-31T[19:00:00.000+01]:00>
	at junit.framework.Assert.assertEquals(Assert.java:81)
	at junit.framework.Assert.assertEquals(Assert.java:87)
	at org.joda.time.TestDateTimeZoneCutover.test_DateTime_roundCeiling_Gaza(TestDateTimeZoneCutover.java:100)

test_DateTime_setHourZero_Gaza(org.joda.time.TestDateTimeZoneCutover)  Time elapsed: 0.001 sec  <<< FAILURE!
junit.framework.ComparisonFailure: expected:<2007-04-01T0[8:00:00.000+03]:00> but was:<2007-04-01T0[6:00:00.000+01]:00>
	at junit.framework.Assert.assertEquals(Assert.java:81)
	at junit.framework.Assert.assertEquals(Assert.java:87)
	at org.joda.time.TestDateTimeZoneCutover.test_DateTime_setHourZero_Gaza(TestDateTimeZoneCutover.java:107)

test_DateTime_withHourZero_Gaza(org.joda.time.TestDateTimeZoneCutover)  Time elapsed: 0 sec  <<< FAILURE!
junit.framework.ComparisonFailure: expected:<2007-04-01T0[8:00:00.000+03]:00> but was:<2007-04-01T0[6:00:00.000+01]:00>
	at junit.framework.Assert.assertEquals(Assert.java:81)
	at junit.framework.Assert.assertEquals(Assert.java:87)
	at org.joda.time.TestDateTimeZoneCutover.test_DateTime_withHourZero_Gaza(TestDateTimeZoneCutover.java:118)

test_DateTime_withDay_Gaza(org.joda.time.TestDateTimeZoneCutover)  Time elapsed: 0.001 sec  <<< FAILURE!
junit.framework.ComparisonFailure: expected:<2007-04-0[2T00:00:00.000+03]:00> but was:<2007-04-0[1T22:00:00.000+01]:00>
	at junit.framework.Assert.assertEquals(Assert.java:81)
	at junit.framework.Assert.assertEquals(Assert.java:87)
	at org.joda.time.TestDateTimeZoneCutover.test_DateTime_withDay_Gaza(TestDateTimeZoneCutover.java:129)

test_DateTime_minusHour_Gaza(org.joda.time.TestDateTimeZoneCutover)  Time elapsed: 0 sec  <<< FAILURE!
junit.framework.ComparisonFailure: expected:<2007-04-01T0[8:00:00.000+03]:00> but was:<2007-04-01T0[6:00:00.000+01]:00>
	at junit.framework.Assert.assertEquals(Assert.java:81)
	at junit.framework.Assert.assertEquals(Assert.java:87)
	at org.joda.time.TestDateTimeZoneCutover.test_DateTime_minusHour_Gaza(TestDateTimeZoneCutover.java:136)

test_DateTime_plusHour_Gaza(org.joda.time.TestDateTimeZoneCutover)  Time elapsed: 0.001 sec  <<< FAILURE!
junit.framework.ComparisonFailure: expected:<2007-03-31T1[6:00:00.000+02]:00> but was:<2007-03-31T1[5:00:00.000+01]:00>
	at junit.framework.Assert.assertEquals(Assert.java:81)
	at junit.framework.Assert.assertEquals(Assert.java:87)
	at org.joda.time.TestDateTimeZoneCutover.test_DateTime_plusHour_Gaza(TestDateTimeZoneCutover.java:148)

test_DateTime_minusDay_Gaza(org.joda.time.TestDateTimeZoneCutover)  Time elapsed: 0 sec  <<< FAILURE!
junit.framework.ComparisonFailure: expected:<2007-04-0[2T00:00:00.000+03]:00> but was:<2007-04-0[1T22:00:00.000+01]:00>
	at junit.framework.Assert.assertEquals(Assert.java:81)
	at junit.framework.Assert.assertEquals(Assert.java:87)
	at org.joda.time.TestDateTimeZoneCutover.test_DateTime_minusDay_Gaza(TestDateTimeZoneCutover.java:160)

test_DateTime_plusDay_Gaza(org.joda.time.TestDateTimeZoneCutover)  Time elapsed: 0 sec  <<< FAILURE!
junit.framework.ComparisonFailure: expected:<2007-03-3[1T00:00:00.000+02]:00> but was:<2007-03-3[0T23:00:00.000+01]:00>
	at junit.framework.Assert.assertEquals(Assert.java:81)
	at junit.framework.Assert.assertEquals(Assert.java:87)
	at org.joda.time.TestDateTimeZoneCutover.test_DateTime_plusDay_Gaza(TestDateTimeZoneCutover.java:170)

test_DateTime_parse_Turk(org.joda.time.TestDateTimeZoneCutover)  Time elapsed: 0.001 sec  <<< FAILURE!
junit.framework.AssertionFailedError
	at junit.framework.Assert.fail(Assert.java:47)
	at junit.framework.Assert.fail(Assert.java:53)
	at org.joda.time.TestDateTimeZoneCutover.test_DateTime_parse_Turk(TestDateTimeZoneCutover.java:471)

test_NewYorkIsCorrect_Spring(org.joda.time.TestDateTimeZoneCutover)  Time elapsed: 0 sec  <<< FAILURE!
junit.framework.ComparisonFailure: expected:<2007-03-11T0[1:59:59.999-05:00]> but was:<2007-03-11T0[6:59:59.999Z]>
	at junit.framework.Assert.assertEquals(Assert.java:81)
	at junit.framework.Assert.assertEquals(Assert.java:87)
	at org.joda.time.TestDateTimeZoneCutover.test_NewYorkIsCorrect_Spring(TestDateTimeZoneCutover.java:491)

test_getOffsetFromLocal_NewYork_Spring(org.joda.time.TestDateTimeZoneCutover)  Time elapsed: 0.001 sec  <<< FAILURE!
junit.framework.ComparisonFailure: 2007-03-11T06:00:00.000Z expected:<2007-03-11T0[1:00:00.000-05:00]> but was:<2007-03-11T0[6:00:00.000Z]>
	at junit.framework.Assert.assertEquals(Assert.java:81)
	at org.joda.time.TestDateTimeZoneCutover.doTest_getOffsetFromLocal(TestDateTimeZoneCutover.java:1371)
	at org.joda.time.TestDateTimeZoneCutover.doTest_getOffsetFromLocal(TestDateTimeZoneCutover.java:1355)
	at org.joda.time.TestDateTimeZoneCutover.test_getOffsetFromLocal_NewYork_Spring(TestDateTimeZoneCutover.java:499)

test_DateTime_setHourAcross_NewYork_Spring(org.joda.time.TestDateTimeZoneCutover)  Time elapsed: 0 sec  <<< FAILURE!
junit.framework.ComparisonFailure: expected:<2007-03-11T0[0:00:00.000-05:00]> but was:<2007-03-11T0[5:00:00.000Z]>
	at junit.framework.Assert.assertEquals(Assert.java:81)
	at junit.framework.Assert.assertEquals(Assert.java:87)
	at org.joda.time.TestDateTimeZoneCutover.test_DateTime_setHourAcross_NewYork_Spring(TestDateTimeZoneCutover.java:516)

test_DateTime_setHourForward_NewYork_Spring(org.joda.time.TestDateTimeZoneCutover)  Time elapsed: 0.001 sec  <<< FAILURE!
junit.framework.ComparisonFailure: expected:<2007-03-11T0[0:00:00.000-05:00]> but was:<2007-03-11T0[5:00:00.000Z]>
	at junit.framework.Assert.assertEquals(Assert.java:81)
	at junit.framework.Assert.assertEquals(Assert.java:87)
	at org.joda.time.TestDateTimeZoneCutover.test_DateTime_setHourForward_NewYork_Spring(TestDateTimeZoneCutover.java:523)

test_DateTime_setHourBack_NewYork_Spring(org.joda.time.TestDateTimeZoneCutover)  Time elapsed: 0 sec  <<< FAILURE!
junit.framework.ComparisonFailure: expected:<2007-03-11T[08:00:00.000-04:00]> but was:<2007-03-11T[12:00:00.000Z]>
	at junit.framework.Assert.assertEquals(Assert.java:81)
	at junit.framework.Assert.assertEquals(Assert.java:87)
	at org.joda.time.TestDateTimeZoneCutover.test_DateTime_setHourBack_NewYork_Spring(TestDateTimeZoneCutover.java:535)

test_DateTime_roundFloor_day_NewYork_Spring_preCutover(org.joda.time.TestDateTimeZoneCutover)  Time elapsed: 0.001 sec  <<< FAILURE!
junit.framework.ComparisonFailure: expected:<2007-03-11T0[1:30:00.000-05:00]> but was:<2007-03-11T0[6:30:00.000Z]>
	at junit.framework.Assert.assertEquals(Assert.java:81)
	at junit.framework.Assert.assertEquals(Assert.java:87)
	at org.joda.time.TestDateTimeZoneCutover.test_DateTime_roundFloor_day_NewYork_Spring_preCutover(TestDateTimeZoneCutover.java:548)

test_DateTime_roundFloor_day_NewYork_Spring_postCutover(org.joda.time.TestDateTimeZoneCutover)  Time elapsed: 0 sec  <<< FAILURE!
junit.framework.ComparisonFailure: expected:<2007-03-11T0[3:30:00.000-04:00]> but was:<2007-03-11T0[7:30:00.000Z]>
	at junit.framework.Assert.assertEquals(Assert.java:81)
	at junit.framework.Assert.assertEquals(Assert.java:87)
	at org.joda.time.TestDateTimeZoneCutover.test_DateTime_roundFloor_day_NewYork_Spring_postCutover(TestDateTimeZoneCutover.java:555)

test_DateTime_roundFloor_hour_NewYork_Spring_preCutover(org.joda.time.TestDateTimeZoneCutover)  Time elapsed: 0.001 sec  <<< FAILURE!
junit.framework.ComparisonFailure: expected:<2007-03-11T0[1:30:00.000-05:00]> but was:<2007-03-11T0[6:30:00.000Z]>
	at junit.framework.Assert.assertEquals(Assert.java:81)
	at junit.framework.Assert.assertEquals(Assert.java:87)
	at org.joda.time.TestDateTimeZoneCutover.test_DateTime_roundFloor_hour_NewYork_Spring_preCutover(TestDateTimeZoneCutover.java:562)

test_DateTime_roundFloor_hour_NewYork_Spring_postCutover(org.joda.time.TestDateTimeZoneCutover)  Time elapsed: 0 sec  <<< FAILURE!
junit.framework.ComparisonFailure: expected:<2007-03-11T0[3:30:00.000-04:00]> but was:<2007-03-11T0[7:30:00.000Z]>
	at junit.framework.Assert.assertEquals(Assert.java:81)
	at junit.framework.Assert.assertEquals(Assert.java:87)
	at org.joda.time.TestDateTimeZoneCutover.test_DateTime_roundFloor_hour_NewYork_Spring_postCutover(TestDateTimeZoneCutover.java:569)

test_DateTime_roundFloor_minute_NewYork_Spring_preCutover(org.joda.time.TestDateTimeZoneCutover)  Time elapsed: 0.001 sec  <<< FAILURE!
junit.framework.ComparisonFailure: expected:<2007-03-11T0[1:30:40.000-05:00]> but was:<2007-03-11T0[6:30:40.000Z]>
	at junit.framework.Assert.assertEquals(Assert.java:81)
	at junit.framework.Assert.assertEquals(Assert.java:87)
	at org.joda.time.TestDateTimeZoneCutover.test_DateTime_roundFloor_minute_NewYork_Spring_preCutover(TestDateTimeZoneCutover.java:576)

test_DateTime_roundFloor_minute_NewYork_Spring_postCutover(org.joda.time.TestDateTimeZoneCutover)  Time elapsed: 0 sec  <<< FAILURE!
junit.framework.ComparisonFailure: expected:<2007-03-11T0[3:30:40.000-04:00]> but was:<2007-03-11T0[7:30:40.000Z]>
	at junit.framework.Assert.assertEquals(Assert.java:81)
	at junit.framework.Assert.assertEquals(Assert.java:87)
	at org.joda.time.TestDateTimeZoneCutover.test_DateTime_roundFloor_minute_NewYork_Spring_postCutover(TestDateTimeZoneCutover.java:583)

test_DateTime_roundCeiling_day_NewYork_Spring_preCutover(org.joda.time.TestDateTimeZoneCutover)  Time elapsed: 0.001 sec  <<< FAILURE!
junit.framework.ComparisonFailure: expected:<2007-03-11T0[1:30:00.000-05:00]> but was:<2007-03-11T0[6:30:00.000Z]>
	at junit.framework.Assert.assertEquals(Assert.java:81)
	at junit.framework.Assert.assertEquals(Assert.java:87)
	at org.joda.time.TestDateTimeZoneCutover.test_DateTime_roundCeiling_day_NewYork_Spring_preCutover(TestDateTimeZoneCutover.java:591)

test_DateTime_roundCeiling_day_NewYork_Spring_postCutover(org.joda.time.TestDateTimeZoneCutover)  Time elapsed: 0 sec  <<< FAILURE!
junit.framework.ComparisonFailure: expected:<2007-03-11T0[3:30:00.000-04:00]> but was:<2007-03-11T0[7:30:00.000Z]>
	at junit.framework.Assert.assertEquals(Assert.java:81)
	at junit.framework.Assert.assertEquals(Assert.java:87)
	at org.joda.time.TestDateTimeZoneCutover.test_DateTime_roundCeiling_day_NewYork_Spring_postCutover(TestDateTimeZoneCutover.java:598)

test_DateTime_roundCeiling_hour_NewYork_Spring_preCutover(org.joda.time.TestDateTimeZoneCutover)  Time elapsed: 0 sec  <<< FAILURE!
junit.framework.ComparisonFailure: expected:<2007-03-11T0[1:30:00.000-05:00]> but was:<2007-03-11T0[6:30:00.000Z]>
	at junit.framework.Assert.assertEquals(Assert.java:81)
	at junit.framework.Assert.assertEquals(Assert.java:87)
	at org.joda.time.TestDateTimeZoneCutover.test_DateTime_roundCeiling_hour_NewYork_Spring_preCutover(TestDateTimeZoneCutover.java:605)

test_DateTime_roundCeiling_hour_NewYork_Spring_postCutover(org.joda.time.TestDateTimeZoneCutover)  Time elapsed: 0.001 sec  <<< FAILURE!
junit.framework.ComparisonFailure: expected:<2007-03-11T0[3:30:00.000-04:00]> but was:<2007-03-11T0[7:30:00.000Z]>
	at junit.framework.Assert.assertEquals(Assert.java:81)
	at junit.framework.Assert.assertEquals(Assert.java:87)
	at org.joda.time.TestDateTimeZoneCutover.test_DateTime_roundCeiling_hour_NewYork_Spring_postCutover(TestDateTimeZoneCutover.java:612)

test_DateTime_roundCeiling_minute_NewYork_Spring_preCutover(org.joda.time.TestDateTimeZoneCutover)  Time elapsed: 0 sec  <<< FAILURE!
junit.framework.ComparisonFailure: expected:<2007-03-11T0[1:30:40.000-05:00]> but was:<2007-03-11T0[6:30:40.000Z]>
	at junit.framework.Assert.assertEquals(Assert.java:81)
	at junit.framework.Assert.assertEquals(Assert.java:87)
	at org.joda.time.TestDateTimeZoneCutover.test_DateTime_roundCeiling_minute_NewYork_Spring_preCutover(TestDateTimeZoneCutover.java:619)

test_DateTime_roundCeiling_minute_NewYork_Spring_postCutover(org.joda.time.TestDateTimeZoneCutover)  Time elapsed: 0.001 sec  <<< FAILURE!
junit.framework.ComparisonFailure: expected:<2007-03-11T0[3:30:40.000-04:00]> but was:<2007-03-11T0[7:30:40.000Z]>
	at junit.framework.Assert.assertEquals(Assert.java:81)
	at junit.framework.Assert.assertEquals(Assert.java:87)
	at org.joda.time.TestDateTimeZoneCutover.test_DateTime_roundCeiling_minute_NewYork_Spring_postCutover(TestDateTimeZoneCutover.java:626)

test_NewYorkIsCorrect_Autumn(org.joda.time.TestDateTimeZoneCutover)  Time elapsed: 0 sec  <<< FAILURE!
junit.framework.ComparisonFailure: expected:<2007-11-04T0[1:59:59.999-04:00]> but was:<2007-11-04T0[5:59:59.999Z]>
	at junit.framework.Assert.assertEquals(Assert.java:81)
	at junit.framework.Assert.assertEquals(Assert.java:87)
	at org.joda.time.TestDateTimeZoneCutover.test_NewYorkIsCorrect_Autumn(TestDateTimeZoneCutover.java:638)

test_getOffsetFromLocal_NewYork_Autumn(org.joda.time.TestDateTimeZoneCutover)  Time elapsed: 0.001 sec  <<< FAILURE!
junit.framework.ComparisonFailure: 2007-11-04T04:00:00.000Z expected:<2007-11-04T0[0:00:00.000-04:00]> but was:<2007-11-04T0[4:00:00.000Z]>
	at junit.framework.Assert.assertEquals(Assert.java:81)
	at org.joda.time.TestDateTimeZoneCutover.doTest_getOffsetFromLocal(TestDateTimeZoneCutover.java:1371)
	at org.joda.time.TestDateTimeZoneCutover.doTest_getOffsetFromLocal(TestDateTimeZoneCutover.java:1355)
	at org.joda.time.TestDateTimeZoneCutover.test_getOffsetFromLocal_NewYork_Autumn(TestDateTimeZoneCutover.java:646)

test_DateTime_constructor_NewYork_Autumn(org.joda.time.TestDateTimeZoneCutover)  Time elapsed: 0 sec  <<< FAILURE!
junit.framework.ComparisonFailure: expected:<2007-11-04T0[1:30:00.000-04:00]> but was:<2007-11-04T0[5:30:00.000Z]>
	at junit.framework.Assert.assertEquals(Assert.java:81)
	at junit.framework.Assert.assertEquals(Assert.java:87)
	at org.joda.time.TestDateTimeZoneCutover.test_DateTime_constructor_NewYork_Autumn(TestDateTimeZoneCutover.java:665)

test_DateTime_plusHour_NewYork_Autumn(org.joda.time.TestDateTimeZoneCutover)  Time elapsed: 0 sec  <<< FAILURE!
junit.framework.ComparisonFailure: expected:<2007-11-03T[18:00:00.000-04:00]> but was:<2007-11-03T[22:00:00.000Z]>
	at junit.framework.Assert.assertEquals(Assert.java:81)
	at junit.framework.Assert.assertEquals(Assert.java:87)
	at org.joda.time.TestDateTimeZoneCutover.test_DateTime_plusHour_NewYork_Autumn(TestDateTimeZoneCutover.java:670)

test_DateTime_minusHour_NewYork_Autumn(org.joda.time.TestDateTimeZoneCutover)  Time elapsed: 0.001 sec  <<< FAILURE!
junit.framework.ComparisonFailure: expected:<2007-11-04T[08:00:00.000-05:00]> but was:<2007-11-04T[13:00:00.000Z]>
	at junit.framework.Assert.assertEquals(Assert.java:81)
	at junit.framework.Assert.assertEquals(Assert.java:87)
	at org.joda.time.TestDateTimeZoneCutover.test_DateTime_minusHour_NewYork_Autumn(TestDateTimeZoneCutover.java:684)

test_DateTime_roundFloor_day_NewYork_Autumn_preCutover(org.joda.time.TestDateTimeZoneCutover)  Time elapsed: 0 sec  <<< FAILURE!
junit.framework.ComparisonFailure: expected:<2007-11-04T0[1:30:00.000-04:00]> but was:<2007-11-04T0[5:30:00.000Z]>
	at junit.framework.Assert.assertEquals(Assert.java:81)
	at junit.framework.Assert.assertEquals(Assert.java:87)
	at org.joda.time.TestDateTimeZoneCutover.test_DateTime_roundFloor_day_NewYork_Autumn_preCutover(TestDateTimeZoneCutover.java:699)

test_DateTime_roundFloor_day_NewYork_Autumn_postCutover(org.joda.time.TestDateTimeZoneCutover)  Time elapsed: 0.001 sec  <<< FAILURE!
junit.framework.ComparisonFailure: expected:<2007-11-04T0[1:30:00.000-05:00]> but was:<2007-11-04T0[6:30:00.000Z]>
	at junit.framework.Assert.assertEquals(Assert.java:81)
	at junit.framework.Assert.assertEquals(Assert.java:87)
	at org.joda.time.TestDateTimeZoneCutover.test_DateTime_roundFloor_day_NewYork_Autumn_postCutover(TestDateTimeZoneCutover.java:706)

test_DateTime_roundFloor_hourOfDay_NewYork_Autumn_preCutover(org.joda.time.TestDateTimeZoneCutover)  Time elapsed: 0 sec  <<< FAILURE!
junit.framework.ComparisonFailure: expected:<2007-11-04T0[1:30:00.000-04:00]> but was:<2007-11-04T0[5:30:00.000Z]>
	at junit.framework.Assert.assertEquals(Assert.java:81)
	at junit.framework.Assert.assertEquals(Assert.java:87)
	at org.joda.time.TestDateTimeZoneCutover.test_DateTime_roundFloor_hourOfDay_NewYork_Autumn_preCutover(TestDateTimeZoneCutover.java:713)

test_DateTime_roundFloor_hourOfDay_NewYork_Autumn_postCutover(org.joda.time.TestDateTimeZoneCutover)  Time elapsed: 0 sec  <<< FAILURE!
junit.framework.ComparisonFailure: expected:<2007-11-04T0[1:30:00.000-05:00]> but was:<2007-11-04T0[6:30:00.000Z]>
	at junit.framework.Assert.assertEquals(Assert.java:81)
	at junit.framework.Assert.assertEquals(Assert.java:87)
	at org.joda.time.TestDateTimeZoneCutover.test_DateTime_roundFloor_hourOfDay_NewYork_Autumn_postCutover(TestDateTimeZoneCutover.java:720)

test_DateTime_roundFloor_minuteOfHour_NewYork_Autumn_preCutover(org.joda.time.TestDateTimeZoneCutover)  Time elapsed: 0.001 sec  <<< FAILURE!
junit.framework.ComparisonFailure: expected:<2007-11-04T0[1:30:40.000-04:00]> but was:<2007-11-04T0[5:30:40.000Z]>
	at junit.framework.Assert.assertEquals(Assert.java:81)
	at junit.framework.Assert.assertEquals(Assert.java:87)
	at org.joda.time.TestDateTimeZoneCutover.test_DateTime_roundFloor_minuteOfHour_NewYork_Autumn_preCutover(TestDateTimeZoneCutover.java:727)

test_DateTime_roundFloor_minuteOfHour_NewYork_Autumn_postCutover(org.joda.time.TestDateTimeZoneCutover)  Time elapsed: 0 sec  <<< FAILURE!
junit.framework.ComparisonFailure: expected:<2007-11-04T0[1:30:40.000-05:00]> but was:<2007-11-04T0[6:30:40.000Z]>
	at junit.framework.Assert.assertEquals(Assert.java:81)
	at junit.framework.Assert.assertEquals(Assert.java:87)
	at org.joda.time.TestDateTimeZoneCutover.test_DateTime_roundFloor_minuteOfHour_NewYork_Autumn_postCutover(TestDateTimeZoneCutover.java:734)

test_DateTime_roundFloor_secondOfMinute_NewYork_Autumn_preCutover(org.joda.time.TestDateTimeZoneCutover)  Time elapsed: 0.001 sec  <<< FAILURE!
junit.framework.ComparisonFailure: expected:<2007-11-04T0[1:30:40.500-04:00]> but was:<2007-11-04T0[5:30:40.500Z]>
	at junit.framework.Assert.assertEquals(Assert.java:81)
	at junit.framework.Assert.assertEquals(Assert.java:87)
	at org.joda.time.TestDateTimeZoneCutover.test_DateTime_roundFloor_secondOfMinute_NewYork_Autumn_preCutover(TestDateTimeZoneCutover.java:741)

test_DateTime_roundFloor_secondOfMinute_NewYork_Autumn_postCutover(org.joda.time.TestDateTimeZoneCutover)  Time elapsed: 0 sec  <<< FAILURE!
junit.framework.ComparisonFailure: expected:<2007-11-04T0[1:30:40.500-05:00]> but was:<2007-11-04T0[6:30:40.500Z]>
	at junit.framework.Assert.assertEquals(Assert.java:81)
	at junit.framework.Assert.assertEquals(Assert.java:87)
	at org.joda.time.TestDateTimeZoneCutover.test_DateTime_roundFloor_secondOfMinute_NewYork_Autumn_postCutover(TestDateTimeZoneCutover.java:748)

test_DateTime_roundCeiling_day_NewYork_Autumn_preCutover(org.joda.time.TestDateTimeZoneCutover)  Time elapsed: 0.001 sec  <<< FAILURE!
junit.framework.ComparisonFailure: expected:<2007-11-04T0[1:30:00.000-04:00]> but was:<2007-11-04T0[5:30:00.000Z]>
	at junit.framework.Assert.assertEquals(Assert.java:81)
	at junit.framework.Assert.assertEquals(Assert.java:87)
	at org.joda.time.TestDateTimeZoneCutover.test_DateTime_roundCeiling_day_NewYork_Autumn_preCutover(TestDateTimeZoneCutover.java:756)

test_DateTime_roundCeiling_day_NewYork_Autumn_postCutover(org.joda.time.TestDateTimeZoneCutover)  Time elapsed: 0 sec  <<< FAILURE!
junit.framework.ComparisonFailure: expected:<2007-11-04T0[1:30:00.000-05:00]> but was:<2007-11-04T0[6:30:00.000Z]>
	at junit.framework.Assert.assertEquals(Assert.java:81)
	at junit.framework.Assert.assertEquals(Assert.java:87)
	at org.joda.time.TestDateTimeZoneCutover.test_DateTime_roundCeiling_day_NewYork_Autumn_postCutover(TestDateTimeZoneCutover.java:763)

test_DateTime_roundCeiling_hourOfDay_NewYork_Autumn_preCutover(org.joda.time.TestDateTimeZoneCutover)  Time elapsed: 0.001 sec  <<< FAILURE!
junit.framework.ComparisonFailure: expected:<2007-11-04T0[1:30:00.000-04:00]> but was:<2007-11-04T0[5:30:00.000Z]>
	at junit.framework.Assert.assertEquals(Assert.java:81)
	at junit.framework.Assert.assertEquals(Assert.java:87)
	at org.joda.time.TestDateTimeZoneCutover.test_DateTime_roundCeiling_hourOfDay_NewYork_Autumn_preCutover(TestDateTimeZoneCutover.java:770)

test_DateTime_roundCeiling_hourOfDay_NewYork_Autumn_postCutover(org.joda.time.TestDateTimeZoneCutover)  Time elapsed: 0 sec  <<< FAILURE!
junit.framework.ComparisonFailure: expected:<2007-11-04T0[1:30:00.000-05:00]> but was:<2007-11-04T0[6:30:00.000Z]>
	at junit.framework.Assert.assertEquals(Assert.java:81)
	at junit.framework.Assert.assertEquals(Assert.java:87)
	at org.joda.time.TestDateTimeZoneCutover.test_DateTime_roundCeiling_hourOfDay_NewYork_Autumn_postCutover(TestDateTimeZoneCutover.java:777)

test_DateTime_roundCeiling_minuteOfHour_NewYork_Autumn_preCutover(org.joda.time.TestDateTimeZoneCutover)  Time elapsed: 0 sec  <<< FAILURE!
junit.framework.ComparisonFailure: expected:<2007-11-04T0[1:30:40.000-04:00]> but was:<2007-11-04T0[5:30:40.000Z]>
	at junit.framework.Assert.assertEquals(Assert.java:81)
	at junit.framework.Assert.assertEquals(Assert.java:87)
	at org.joda.time.TestDateTimeZoneCutover.test_DateTime_roundCeiling_minuteOfHour_NewYork_Autumn_preCutover(TestDateTimeZoneCutover.java:784)

test_getOffsetFromLocal_Moscow_Autumn_overlap_mins(org.joda.time.TestDateTimeZoneCutover)  Time elapsed: 0.001 sec  <<< FAILURE!
junit.framework.ComparisonFailure: 2007-10-27T23:00:00.000+01:00 expected:<2007-10-2[8T02:00:00.000+04]:00> but was:<2007-10-2[7T23:00:00.000+01]:00>
	at junit.framework.Assert.assertEquals(Assert.java:81)
	at org.joda.time.TestDateTimeZoneCutover.doTest_getOffsetFromLocal(TestDateTimeZoneCutover.java:1371)
	at org.joda.time.TestDateTimeZoneCutover.doTest_getOffsetFromLocal(TestDateTimeZoneCutover.java:1355)
	at org.joda.time.TestDateTimeZoneCutover.test_getOffsetFromLocal_Moscow_Autumn_overlap_mins(TestDateTimeZoneCutover.java:914)

test_DateTime_plusDayMidGap_Gaza(org.joda.time.TestDateTimeZoneCutover)  Time elapsed: 0 sec  <<< FAILURE!
junit.framework.ComparisonFailure: expected:<2007-03-3[1T00:30:00.000+02]:00> but was:<2007-03-3[0T23:30:00.000+01]:00>
	at junit.framework.Assert.assertEquals(Assert.java:81)
	at junit.framework.Assert.assertEquals(Assert.java:87)
	at org.joda.time.TestDateTimeZoneCutover.test_DateTime_plusDayMidGap_Gaza(TestDateTimeZoneCutover.java:180)

test_DateTime_addWrapFieldDay_Gaza(org.joda.time.TestDateTimeZoneCutover)  Time elapsed: 0.001 sec  <<< FAILURE!
junit.framework.ComparisonFailure: expected:<2007-04-[30T00:00:00.000+03]:00> but was:<2007-04-[29T22:00:00.000+01]:00>
	at junit.framework.Assert.assertEquals(Assert.java:81)
	at junit.framework.Assert.assertEquals(Assert.java:87)
	at org.joda.time.TestDateTimeZoneCutover.test_DateTime_addWrapFieldDay_Gaza(TestDateTimeZoneCutover.java:190)

test_DateTime_withZoneRetainFields_Gaza(org.joda.time.TestDateTimeZoneCutover)  Time elapsed: 0 sec  <<< FAILURE!
junit.framework.ComparisonFailure: expected:<2007-04-01T0[0:00:00.000Z]> but was:<2007-04-01T0[1:00:00.000+01:00]>
	at junit.framework.Assert.assertEquals(Assert.java:81)
	at junit.framework.Assert.assertEquals(Assert.java:87)
	at org.joda.time.TestDateTimeZoneCutover.test_DateTime_withZoneRetainFields_Gaza(TestDateTimeZoneCutover.java:200)

test_MutableDateTime_withZoneRetainFields_Gaza(org.joda.time.TestDateTimeZoneCutover)  Time elapsed: 0.001 sec  <<< FAILURE!
junit.framework.ComparisonFailure: expected:<2007-04-01T0[0:00:00.000Z]> but was:<2007-04-01T0[1:00:00.000+01:00]>
	at junit.framework.Assert.assertEquals(Assert.java:81)
	at junit.framework.Assert.assertEquals(Assert.java:87)
	at org.joda.time.TestDateTimeZoneCutover.test_MutableDateTime_withZoneRetainFields_Gaza(TestDateTimeZoneCutover.java:208)

test_DateTime_parse_Gaza(org.joda.time.TestDateTimeZoneCutover)  Time elapsed: 0 sec  <<< FAILURE!
junit.framework.AssertionFailedError
	at junit.framework.Assert.fail(Assert.java:47)
	at junit.framework.Assert.fail(Assert.java:53)
	at org.joda.time.TestDateTimeZoneCutover.test_DateTime_parse_Gaza(TestDateTimeZoneCutover.java:255)

test_MockTurkIsCorrect(org.joda.time.TestDateTimeZoneCutover)  Time elapsed: 0.001 sec  <<< FAILURE!
junit.framework.ComparisonFailure: expected:<2007-0[3-31T23:59:59.999-05]:00> but was:<2007-0[4-01T05:59:59.999+01]:00>
	at junit.framework.Assert.assertEquals(Assert.java:81)
	at junit.framework.Assert.assertEquals(Assert.java:87)
	at org.joda.time.TestDateTimeZoneCutover.test_MockTurkIsCorrect(TestDateTimeZoneCutover.java:272)

test_getOffsetFromLocal_Turk(org.joda.time.TestDateTimeZoneCutover)  Time elapsed: 0 sec  <<< FAILURE!
junit.framework.ComparisonFailure: 2007-04-01T05:00:00.000+01:00 expected:<2007-0[3-31T23:00:00.000-05]:00> but was:<2007-0[4-01T05:00:00.000+01]:00>
	at junit.framework.Assert.assertEquals(Assert.java:81)
	at org.joda.time.TestDateTimeZoneCutover.doTest_getOffsetFromLocal_Turk(TestDateTimeZoneCutover.java:298)
	at org.joda.time.TestDateTimeZoneCutover.test_getOffsetFromLocal_Turk(TestDateTimeZoneCutover.java:280)

test_DateTime_roundFloor_Turk(org.joda.time.TestDateTimeZoneCutover)  Time elapsed: 0.001 sec  <<< FAILURE!
junit.framework.ComparisonFailure: expected:<2007-04-01T[08:00:00.000-04]:00> but was:<2007-04-01T[13:00:00.000+01]:00>
	at junit.framework.Assert.assertEquals(Assert.java:81)
	at junit.framework.Assert.assertEquals(Assert.java:87)
	at org.joda.time.TestDateTimeZoneCutover.test_DateTime_roundFloor_Turk(TestDateTimeZoneCutover.java:303)

test_DateTime_roundFloorNotDST_Turk(org.joda.time.TestDateTimeZoneCutover)  Time elapsed: 0 sec  <<< FAILURE!
junit.framework.ComparisonFailure: expected:<2007-04-02T[08:00:00.000-04]:00> but was:<2007-04-02T[13:00:00.000+01]:00>
	at junit.framework.Assert.assertEquals(Assert.java:81)
	at junit.framework.Assert.assertEquals(Assert.java:87)
	at org.joda.time.TestDateTimeZoneCutover.test_DateTime_roundFloorNotDST_Turk(TestDateTimeZoneCutover.java:310)

test_DateTime_roundCeiling_Turk(org.joda.time.TestDateTimeZoneCutover)  Time elapsed: 0.001 sec  <<< FAILURE!
junit.framework.ComparisonFailure: expected:<2007-0[3-31T20:00:00.000-05]:00> but was:<2007-0[4-01T02:00:00.000+01]:00>
	at junit.framework.Assert.assertEquals(Assert.java:81)
	at junit.framework.Assert.assertEquals(Assert.java:87)
	at org.joda.time.TestDateTimeZoneCutover.test_DateTime_roundCeiling_Turk(TestDateTimeZoneCutover.java:317)

test_DateTime_setHourZero_Turk(org.joda.time.TestDateTimeZoneCutover)  Time elapsed: 0 sec  <<< FAILURE!
junit.framework.ComparisonFailure: expected:<2007-04-01T[08:00:00.000-04]:00> but was:<2007-04-01T[13:00:00.000+01]:00>
	at junit.framework.Assert.assertEquals(Assert.java:81)
	at junit.framework.Assert.assertEquals(Assert.java:87)
	at org.joda.time.TestDateTimeZoneCutover.test_DateTime_setHourZero_Turk(TestDateTimeZoneCutover.java:324)

test_DateTime_withHourZero_Turk(org.joda.time.TestDateTimeZoneCutover)  Time elapsed: 0 sec  <<< FAILURE!
junit.framework.ComparisonFailure: expected:<2007-04-01T[08:00:00.000-04]:00> but was:<2007-04-01T[13:00:00.000+01]:00>
	at junit.framework.Assert.assertEquals(Assert.java:81)
	at junit.framework.Assert.assertEquals(Assert.java:87)
	at org.joda.time.TestDateTimeZoneCutover.test_DateTime_withHourZero_Turk(TestDateTimeZoneCutover.java:335)

test_DateTime_withDay_Turk(org.joda.time.TestDateTimeZoneCutover)  Time elapsed: 0.001 sec  <<< FAILURE!
junit.framework.ComparisonFailure: expected:<2007-04-02T0[0:00:00.000-04]:00> but was:<2007-04-02T0[5:00:00.000+01]:00>
	at junit.framework.Assert.assertEquals(Assert.java:81)
	at junit.framework.Assert.assertEquals(Assert.java:87)
	at org.joda.time.TestDateTimeZoneCutover.test_DateTime_withDay_Turk(TestDateTimeZoneCutover.java:346)

test_DateTime_minusHour_Turk(org.joda.time.TestDateTimeZoneCutover)  Time elapsed: 0 sec  <<< FAILURE!
junit.framework.ComparisonFailure: expected:<2007-04-01T[08:00:00.000-04]:00> but was:<2007-04-01T[13:00:00.000+01]:00>
	at junit.framework.Assert.assertEquals(Assert.java:81)
	at junit.framework.Assert.assertEquals(Assert.java:87)
	at org.joda.time.TestDateTimeZoneCutover.test_DateTime_minusHour_Turk(TestDateTimeZoneCutover.java:353)

test_DateTime_plusHour_Turk(org.joda.time.TestDateTimeZoneCutover)  Time elapsed: 0.001 sec  <<< FAILURE!
junit.framework.ComparisonFailure: expected:<2007-03-31T[16:00:00.000-05]:00> but was:<2007-03-31T[22:00:00.000+01]:00>
	at junit.framework.Assert.assertEquals(Assert.java:81)
	at junit.framework.Assert.assertEquals(Assert.java:87)
	at org.joda.time.TestDateTimeZoneCutover.test_DateTime_plusHour_Turk(TestDateTimeZoneCutover.java:365)

test_DateTime_minusDay_Turk(org.joda.time.TestDateTimeZoneCutover)  Time elapsed: 0 sec  <<< FAILURE!
junit.framework.ComparisonFailure: expected:<2007-04-02T0[0:00:00.000-04]:00> but was:<2007-04-02T0[5:00:00.000+01]:00>
	at junit.framework.Assert.assertEquals(Assert.java:81)
	at junit.framework.Assert.assertEquals(Assert.java:87)
	at org.joda.time.TestDateTimeZoneCutover.test_DateTime_minusDay_Turk(TestDateTimeZoneCutover.java:377)

test_DateTime_plusDay_Turk(org.joda.time.TestDateTimeZoneCutover)  Time elapsed: 0.001 sec  <<< FAILURE!
junit.framework.ComparisonFailure: expected:<2007-03-31T0[0:00:00.000-05]:00> but was:<2007-03-31T0[6:00:00.000+01]:00>
	at junit.framework.Assert.assertEquals(Assert.java:81)
	at junit.framework.Assert.assertEquals(Assert.java:87)
	at org.joda.time.TestDateTimeZoneCutover.test_DateTime_plusDay_Turk(TestDateTimeZoneCutover.java:387)

test_DateTime_plusDayMidGap_Turk(org.joda.time.TestDateTimeZoneCutover)  Time elapsed: 0 sec  <<< FAILURE!
junit.framework.ComparisonFailure: expected:<2007-03-31T0[0:30:00.000-05]:00> but was:<2007-03-31T0[6:30:00.000+01]:00>
	at junit.framework.Assert.assertEquals(Assert.java:81)
	at junit.framework.Assert.assertEquals(Assert.java:87)
	at org.joda.time.TestDateTimeZoneCutover.test_DateTime_plusDayMidGap_Turk(TestDateTimeZoneCutover.java:397)

test_DateTime_addWrapFieldDay_Turk(org.joda.time.TestDateTimeZoneCutover)  Time elapsed: 0 sec  <<< FAILURE!
junit.framework.ComparisonFailure: expected:<2007-04-30T0[0:00:00.000-04]:00> but was:<2007-04-30T0[5:00:00.000+01]:00>
	at junit.framework.Assert.assertEquals(Assert.java:81)
	at junit.framework.Assert.assertEquals(Assert.java:87)
	at org.joda.time.TestDateTimeZoneCutover.test_DateTime_addWrapFieldDay_Turk(TestDateTimeZoneCutover.java:407)

test_DateTime_withZoneRetainFields_Turk(org.joda.time.TestDateTimeZoneCutover)  Time elapsed: 0.001 sec  <<< FAILURE!
junit.framework.ComparisonFailure: expected:<2007-04-01T0[0:00:00.000Z]> but was:<2007-04-01T0[1:00:00.000+01:00]>
	at junit.framework.Assert.assertEquals(Assert.java:81)
	at junit.framework.Assert.assertEquals(Assert.java:87)
	at org.joda.time.TestDateTimeZoneCutover.test_DateTime_withZoneRetainFields_Turk(TestDateTimeZoneCutover.java:417)

test_MutableDateTime_setZoneRetainFields_Turk(org.joda.time.TestDateTimeZoneCutover)  Time elapsed: 0 sec  <<< FAILURE!
junit.framework.ComparisonFailure: expected:<2007-04-01T0[0:00:00.000Z]> but was:<2007-04-01T0[1:00:00.000+01:00]>
	at junit.framework.Assert.assertEquals(Assert.java:81)
	at junit.framework.Assert.assertEquals(Assert.java:87)
	at org.joda.time.TestDateTimeZoneCutover.test_MutableDateTime_setZoneRetainFields_Turk(TestDateTimeZoneCutover.java:425)

testTest(org.joda.time.TestPeriodType)  Time elapsed: 0.001 sec  <<< FAILURE!
junit.framework.ComparisonFailure: expected:<2002-06-09T0[0:00:00.000Z]> but was:<2002-06-09T0[1:00:00.000+01:00]>
	at junit.framework.Assert.assertEquals(Assert.java:81)
	at junit.framework.Assert.assertEquals(Assert.java:87)
	at org.joda.time.TestPeriodType.testTest(TestPeriodType.java:103)

testDateMidnight(org.joda.time.TestStringConvert)  Time elapsed: 0.003 sec  <<< FAILURE!
junit.framework.ComparisonFailure: expected:<2010-06-[30T00:00:00.000+02]:00> but was:<2010-06-[29T23:00:00.000+01]:00>
	at junit.framework.Assert.assertEquals(Assert.java:81)
	at junit.framework.Assert.assertEquals(Assert.java:87)
	at org.joda.time.TestStringConvert.testDateMidnight(TestStringConvert.java:56)

testDateTime(org.joda.time.TestStringConvert)  Time elapsed: 0.002 sec  <<< FAILURE!
junit.framework.ComparisonFailure: expected:<2010-06-30T0[2:30:50.678+02]:00> but was:<2010-06-30T0[1:30:50.678+01]:00>
	at junit.framework.Assert.assertEquals(Assert.java:81)
	at junit.framework.Assert.assertEquals(Assert.java:87)
	at org.joda.time.TestStringConvert.testDateTime(TestStringConvert.java:63)

testMutableDateTime(org.joda.time.TestStringConvert)  Time elapsed: 0.001 sec  <<< FAILURE!
junit.framework.ComparisonFailure: expected:<2010-06-30T0[2:30:50.678+02]:00> but was:<2010-06-30T0[1:30:50.678+01]:00>
	at junit.framework.Assert.assertEquals(Assert.java:81)
	at junit.framework.Assert.assertEquals(Assert.java:87)
	at org.joda.time.TestStringConvert.testMutableDateTime(TestStringConvert.java:70)

testTest(org.joda.time.TestSerialization)  Time elapsed: 0 sec  <<< FAILURE!
junit.framework.ComparisonFailure: expected:<2002-06-09T0[0:00:00.000Z]> but was:<2002-06-09T0[1:00:00.000+01:00]>
	at junit.framework.Assert.assertEquals(Assert.java:81)
	at junit.framework.Assert.assertEquals(Assert.java:87)
	at org.joda.time.TestSerialization.testTest(TestSerialization.java:122)

testToString(org.joda.time.chrono.TestGJChronology)  Time elapsed: 0.002 sec  <<< FAILURE!
junit.framework.ComparisonFailure: expected:<...cutover=1970-01-01T0[0:00:00.001Z],mdfw=2]> but was:<...cutover=1970-01-01T0[1:00:00.001+01:00],mdfw=2]>
	at junit.framework.Assert.assertEquals(Assert.java:81)
	at junit.framework.Assert.assertEquals(Assert.java:87)
	at org.joda.time.chrono.TestGJChronology.testToString(TestGJChronology.java:195)

testParseEquivalence(org.joda.time.chrono.TestGJChronology)  Time elapsed: 0 sec  <<< FAILURE!
junit.framework.AssertionFailedError: expected:<1581-01-01T01:23:45.678-00:01:15> but was:<1581-01-01T01:22:30.678-00:01:15>
	at junit.framework.Assert.fail(Assert.java:47)
	at junit.framework.Assert.failNotEquals(Assert.java:280)
	at junit.framework.Assert.assertEquals(Assert.java:64)
	at junit.framework.Assert.assertEquals(Assert.java:71)
	at org.joda.time.chrono.TestGJChronology.testParse(TestGJChronology.java:375)
	at org.joda.time.chrono.TestGJChronology.testParseEquivalence(TestGJChronology.java:362)

test_MockTurkIsCorrect(org.joda.time.chrono.TestLenientChronology)  Time elapsed: 0.001 sec  <<< FAILURE!
junit.framework.ComparisonFailure: expected:<2007-0[3-31T23:59:59.999-05]:00> but was:<2007-0[4-01T05:59:59.999+01]:00>
	at junit.framework.Assert.assertEquals(Assert.java:81)
	at junit.framework.Assert.assertEquals(Assert.java:87)
	at org.joda.time.chrono.TestLenientChronology.test_MockTurkIsCorrect(TestLenientChronology.java:128)

test_lenientChrononolgy_Chicago(org.joda.time.chrono.TestLenientChronology)  Time elapsed: 0.001 sec  <<< FAILURE!
junit.framework.ComparisonFailure: expected:<2007-03-11T0[3:30:00.000-05:00]> but was:<2007-03-11T0[8:30:00.000Z]>
	at junit.framework.Assert.assertEquals(Assert.java:81)
	at junit.framework.Assert.assertEquals(Assert.java:87)
	at org.joda.time.chrono.TestLenientChronology.test_lenientChrononolgy_Chicago(TestLenientChronology.java:139)

test_lenientChrononolgy_Turk(org.joda.time.chrono.TestLenientChronology)  Time elapsed: 0.002 sec  <<< FAILURE!
junit.framework.ComparisonFailure: expected:<2007-04-01T0[1:30:00.000-04]:00> but was:<2007-04-01T0[6:30:00.000+01]:00>
	at junit.framework.Assert.assertEquals(Assert.java:81)
	at junit.framework.Assert.assertEquals(Assert.java:87)
	at org.joda.time.chrono.TestLenientChronology.test_lenientChrononolgy_Turk(TestLenientChronology.java:145)

testGetInstantMillis_Object_Zone(org.joda.time.convert.TestStringConverter)  Time elapsed: 0.001 sec  <<< FAILURE!
junit.framework.AssertionFailedError: expected:<1086776688501> but was:<1086780288501>
	at junit.framework.Assert.fail(Assert.java:47)
	at junit.framework.Assert.failNotEquals(Assert.java:280)
	at junit.framework.Assert.assertEquals(Assert.java:64)
	at junit.framework.Assert.assertEquals(Assert.java:133)
	at junit.framework.Assert.assertEquals(Assert.java:139)
	at org.joda.time.convert.TestStringConverter.testGetInstantMillis_Object_Zone(TestStringConverter.java:161)

testGetDateTime4(org.joda.time.convert.TestStringConverter)  Time elapsed: 0 sec  <<< FAILURE!
junit.framework.AssertionFailedError: expected:<12> but was:<13>
	at junit.framework.Assert.fail(Assert.java:47)
	at junit.framework.Assert.failNotEquals(Assert.java:280)
	at junit.framework.Assert.assertEquals(Assert.java:64)
	at junit.framework.Assert.assertEquals(Assert.java:198)
	at junit.framework.Assert.assertEquals(Assert.java:204)
	at org.joda.time.convert.TestStringConverter.testGetDateTime4(TestStringConverter.java:257)

testGetDateTime6(org.joda.time.convert.TestStringConverter)  Time elapsed: 0 sec  <<< FAILURE!
junit.framework.AssertionFailedError: expected:<12> but was:<13>
	at junit.framework.Assert.fail(Assert.java:47)
	at junit.framework.Assert.failNotEquals(Assert.java:280)
	at junit.framework.Assert.assertEquals(Assert.java:64)
	at junit.framework.Assert.assertEquals(Assert.java:198)
	at junit.framework.Assert.assertEquals(Assert.java:204)
	at org.joda.time.convert.TestStringConverter.testGetDateTime6(TestStringConverter.java:281)

testPrint_writerMethods(org.joda.time.format.TestDateTimeFormatter)  Time elapsed: 0.001 sec  <<< FAILURE!
junit.framework.ComparisonFailure: expected:<Wed 2004-06-09T1[0:20:30Z]> but was:<Wed 2004-06-09T1[1:20:30+01:00]>
	at junit.framework.Assert.assertEquals(Assert.java:81)
	at junit.framework.Assert.assertEquals(Assert.java:87)
	at org.joda.time.format.TestDateTimeFormatter.testPrint_writerMethods(TestDateTimeFormatter.java:186)

testPrint_appendableMethods(org.joda.time.format.TestDateTimeFormatter)  Time elapsed: 0.001 sec  <<< FAILURE!
junit.framework.ComparisonFailure: expected:<Wed 2004-06-09T1[0:20:30Z]> but was:<Wed 2004-06-09T1[1:20:30+01:00]>
	at junit.framework.Assert.assertEquals(Assert.java:81)
	at junit.framework.Assert.assertEquals(Assert.java:87)
	at org.joda.time.format.TestDateTimeFormatter.testPrint_appendableMethods(TestDateTimeFormatter.java:208)

testPrint_chrono_and_zone(org.joda.time.format.TestDateTimeFormatter)  Time elapsed: 0 sec  <<< FAILURE!
junit.framework.ComparisonFailure: expected:<Wed 2004-06-09T1[0:20:30Z]> but was:<Wed 2004-06-09T1[1:20:30+01:00]>
	at junit.framework.Assert.assertEquals(Assert.java:81)
	at junit.framework.Assert.assertEquals(Assert.java:87)
	at org.joda.time.format.TestDateTimeFormatter.testPrint_chrono_and_zone(TestDateTimeFormatter.java:228)

testParseDateTime_zone3(org.joda.time.format.TestDateTimeFormatter)  Time elapsed: 0.001 sec  <<< FAILURE!
junit.framework.AssertionFailedError: expected:<2004-06-09T09:20:30.000+01:00> but was:<2004-06-09T10:20:30.000+01:00>
	at junit.framework.Assert.fail(Assert.java:47)
	at junit.framework.Assert.failNotEquals(Assert.java:280)
	at junit.framework.Assert.assertEquals(Assert.java:64)
	at junit.framework.Assert.assertEquals(Assert.java:71)
	at org.joda.time.format.TestDateTimeFormatter.testParseDateTime_zone3(TestDateTimeFormatter.java:591)

testParseDateTime_chrono(org.joda.time.format.TestDateTimeFormatter)  Time elapsed: 0 sec  <<< FAILURE!
junit.framework.AssertionFailedError: expected:<2004-06-09T11:20:30.000+01:00> but was:<2004-06-09T11:20:30.000+01:00>
	at junit.framework.Assert.fail(Assert.java:47)
	at junit.framework.Assert.failNotEquals(Assert.java:280)
	at junit.framework.Assert.assertEquals(Assert.java:64)
	at junit.framework.Assert.assertEquals(Assert.java:71)
	at org.joda.time.format.TestDateTimeFormatter.testParseDateTime_chrono(TestDateTimeFormatter.java:623)

testParseMutableDateTime_zone3(org.joda.time.format.TestDateTimeFormatter)  Time elapsed: 0.001 sec  <<< FAILURE!
junit.framework.AssertionFailedError: expected:<2004-06-09T09:20:30.000+01:00> but was:<2004-06-09T10:20:30.000+01:00>
	at junit.framework.Assert.fail(Assert.java:47)
	at junit.framework.Assert.failNotEquals(Assert.java:280)
	at junit.framework.Assert.assertEquals(Assert.java:64)
	at junit.framework.Assert.assertEquals(Assert.java:71)
	at org.joda.time.format.TestDateTimeFormatter.testParseMutableDateTime_zone3(TestDateTimeFormatter.java:686)

testParseMutableDateTime_chrono(org.joda.time.format.TestDateTimeFormatter)  Time elapsed: 0.001 sec  <<< FAILURE!
junit.framework.AssertionFailedError: expected:<2004-06-09T11:20:30.000+01:00> but was:<2004-06-09T11:20:30.000+01:00>
	at junit.framework.Assert.fail(Assert.java:47)
	at junit.framework.Assert.failNotEquals(Assert.java:280)
	at junit.framework.Assert.assertEquals(Assert.java:64)
	at junit.framework.Assert.assertEquals(Assert.java:71)
	at org.joda.time.format.TestDateTimeFormatter.testParseMutableDateTime_chrono(TestDateTimeFormatter.java:718)

testParseInto_zone3(org.joda.time.format.TestDateTimeFormatter)  Time elapsed: 0 sec  <<< FAILURE!
junit.framework.AssertionFailedError: expected:<2004-06-09T09:20:30.000+01:00> but was:<2004-06-09T10:20:30.000+01:00>
	at junit.framework.Assert.fail(Assert.java:47)
	at junit.framework.Assert.failNotEquals(Assert.java:280)
	at junit.framework.Assert.assertEquals(Assert.java:64)
	at junit.framework.Assert.assertEquals(Assert.java:71)
	at org.joda.time.format.TestDateTimeFormatter.testParseInto_zone3(TestDateTimeFormatter.java:806)

testParseInto_chrono(org.joda.time.format.TestDateTimeFormatter)  Time elapsed: 0.001 sec  <<< FAILURE!
junit.framework.AssertionFailedError: expected:<2004-06-09T11:20:30.000+01:00> but was:<2004-06-09T11:20:30.000+01:00>
	at junit.framework.Assert.fail(Assert.java:47)
	at junit.framework.Assert.failNotEquals(Assert.java:280)
	at junit.framework.Assert.assertEquals(Assert.java:64)
	at junit.framework.Assert.assertEquals(Assert.java:71)
	at org.joda.time.format.TestDateTimeFormatter.testParseInto_chrono(TestDateTimeFormatter.java:848)

testParseInto_monthOnly_baseStartYear(org.joda.time.format.TestDateTimeFormatter)  Time elapsed: 0 sec  <<< FAILURE!
junit.framework.AssertionFailedError: expected:<2004-05-01T04:20:30.000+01:00> but was:<2004-05-01T12:20:30.000+01:00>
	at junit.framework.Assert.fail(Assert.java:47)
	at junit.framework.Assert.failNotEquals(Assert.java:280)
	at junit.framework.Assert.assertEquals(Assert.java:64)
	at junit.framework.Assert.assertEquals(Assert.java:71)
	at org.joda.time.format.TestDateTimeFormatter.testParseInto_monthOnly_baseStartYear(TestDateTimeFormatter.java:877)

testParseInto_monthOnly_parseStartYear(org.joda.time.format.TestDateTimeFormatter)  Time elapsed: 0 sec  <<< FAILURE!
junit.framework.AssertionFailedError: expected:<2004-01-01T03:20:30.000Z> but was:<2004-01-01T12:20:30.000Z>
	at junit.framework.Assert.fail(Assert.java:47)
	at junit.framework.Assert.failNotEquals(Assert.java:280)
	at junit.framework.Assert.assertEquals(Assert.java:64)
	at junit.framework.Assert.assertEquals(Assert.java:71)
	at org.joda.time.format.TestDateTimeFormatter.testParseInto_monthOnly_parseStartYear(TestDateTimeFormatter.java:884)

testParseInto_monthOnly_baseEndYear(org.joda.time.format.TestDateTimeFormatter)  Time elapsed: 0.001 sec  <<< FAILURE!
junit.framework.AssertionFailedError: expected:<2004-05-31T04:20:30.000+01:00> but was:<2004-05-31T12:20:30.000+01:00>
	at junit.framework.Assert.fail(Assert.java:47)
	at junit.framework.Assert.failNotEquals(Assert.java:280)
	at junit.framework.Assert.assertEquals(Assert.java:64)
	at junit.framework.Assert.assertEquals(Assert.java:71)
	at org.joda.time.format.TestDateTimeFormatter.testParseInto_monthOnly_baseEndYear(TestDateTimeFormatter.java:891)

testParseInto_monthOnly_parseEndYear(org.joda.time.format.TestDateTimeFormatter)  Time elapsed: 0 sec  <<< FAILURE!
junit.framework.AssertionFailedError: expected:<2004-12-31T03:20:30.000Z> but was:<2004-12-31T12:20:30.000Z>
	at junit.framework.Assert.fail(Assert.java:47)
	at junit.framework.Assert.failNotEquals(Assert.java:280)
	at junit.framework.Assert.assertEquals(Assert.java:64)
	at junit.framework.Assert.assertEquals(Assert.java:71)
	at org.joda.time.format.TestDateTimeFormatter.testParseInto_monthOnly_parseEndYear(TestDateTimeFormatter.java:898)

testPrint_locale(org.joda.time.format.TestDateTimeFormatter)  Time elapsed: 0.001 sec  <<< FAILURE!
junit.framework.ComparisonFailure: expected:<mer. 2004-06-09T1[0:20:30Z]> but was:<mer. 2004-06-09T1[1:20:30+01:00]>
	at junit.framework.Assert.assertEquals(Assert.java:81)
	at junit.framework.Assert.assertEquals(Assert.java:87)
	at org.joda.time.format.TestDateTimeFormatter.testPrint_locale(TestDateTimeFormatter.java:127)

testPrint_zone(org.joda.time.format.TestDateTimeFormatter)  Time elapsed: 0 sec  <<< FAILURE!
junit.framework.ComparisonFailure: expected:<Wed 2004-06-09T[06:20:30-04:00]> but was:<Wed 2004-06-09T[10:20:30Z]>
	at junit.framework.Assert.assertEquals(Assert.java:81)
	at junit.framework.Assert.assertEquals(Assert.java:87)
	at org.joda.time.format.TestDateTimeFormatter.testPrint_zone(TestDateTimeFormatter.java:134)

testPrint_chrono(org.joda.time.format.TestDateTimeFormatter)  Time elapsed: 0 sec  <<< FAILURE!
junit.framework.ComparisonFailure: expected:<Wed 2004-06-09T1[2:20:30+02]:00> but was:<Wed 2004-06-09T1[1:20:30+01]:00>
	at junit.framework.Assert.assertEquals(Assert.java:81)
	at junit.framework.Assert.assertEquals(Assert.java:87)
	at org.joda.time.format.TestDateTimeFormatter.testPrint_chrono(TestDateTimeFormatter.java:148)

testPrint_bufferMethods(org.joda.time.format.TestDateTimeFormatter)  Time elapsed: 0.001 sec  <<< FAILURE!
junit.framework.ComparisonFailure: expected:<Wed 2004-06-09T1[0:20:30Z]> but was:<Wed 2004-06-09T1[1:20:30+01:00]>
	at junit.framework.Assert.assertEquals(Assert.java:81)
	at junit.framework.Assert.assertEquals(Assert.java:87)
	at org.joda.time.format.TestDateTimeFormatter.testPrint_bufferMethods(TestDateTimeFormatter.java:164)

testPrint_simple(org.joda.time.format.TestDateTimeFormatter)  Time elapsed: 0 sec  <<< FAILURE!
junit.framework.ComparisonFailure: expected:<Wed 2004-06-09T1[0:20:30Z]> but was:<Wed 2004-06-09T1[1:20:30+01:00]>
	at junit.framework.Assert.assertEquals(Assert.java:81)
	at junit.framework.Assert.assertEquals(Assert.java:87)
	at org.joda.time.format.TestDateTimeFormatter.testPrint_simple(TestDateTimeFormatter.java:112)

testParseInto_monthDay_feb29_newYork(org.joda.time.format.TestDateTimeFormatter)  Time elapsed: 0 sec  <<< FAILURE!
junit.framework.AssertionFailedError: expected:<2004-02-29T17:20:30.000Z> but was:<2004-02-29T12:20:30.000Z>
	at junit.framework.Assert.fail(Assert.java:47)
	at junit.framework.Assert.failNotEquals(Assert.java:280)
	at junit.framework.Assert.assertEquals(Assert.java:64)
	at junit.framework.Assert.assertEquals(Assert.java:71)
	at org.joda.time.format.TestDateTimeFormatter.testParseInto_monthDay_feb29_newYork(TestDateTimeFormatter.java:926)

testParseInto_monthDay_feb29_newYork_startOfYear(org.joda.time.format.TestDateTimeFormatter)  Time elapsed: 0.001 sec  <<< FAILURE!
junit.framework.AssertionFailedError: expected:<2004-02-29T05:00:00.000Z> but was:<2004-02-29T00:00:00.000Z>
	at junit.framework.Assert.fail(Assert.java:47)
	at junit.framework.Assert.failNotEquals(Assert.java:280)
	at junit.framework.Assert.assertEquals(Assert.java:64)
	at junit.framework.Assert.assertEquals(Assert.java:71)
	at org.joda.time.format.TestDateTimeFormatter.testParseInto_monthDay_feb29_newYork_startOfYear(TestDateTimeFormatter.java:933)

testParseInto_monthDay_feb29_newYork_endOfYear(org.joda.time.format.TestDateTimeFormatter)  Time elapsed: 0 sec  <<< FAILURE!
junit.framework.AssertionFailedError: expected:<2004-03-01T04:59:59.999Z> but was:<2004-02-29T23:59:59.999Z>
	at junit.framework.Assert.fail(Assert.java:47)
	at junit.framework.Assert.failNotEquals(Assert.java:280)
	at junit.framework.Assert.assertEquals(Assert.java:64)
	at junit.framework.Assert.assertEquals(Assert.java:71)
	at org.joda.time.format.TestDateTimeFormatter.testParseInto_monthDay_feb29_newYork_endOfYear(TestDateTimeFormatter.java:940)

testParseInto_monthDay_feb29_tokyo(org.joda.time.format.TestDateTimeFormatter)  Time elapsed: 0.001 sec  <<< FAILURE!
junit.framework.AssertionFailedError: expected:<2004-02-29T03:20:30.000Z> but was:<2004-02-29T12:20:30.000Z>
	at junit.framework.Assert.fail(Assert.java:47)
	at junit.framework.Assert.failNotEquals(Assert.java:280)
	at junit.framework.Assert.assertEquals(Assert.java:64)
	at junit.framework.Assert.assertEquals(Assert.java:71)
	at org.joda.time.format.TestDateTimeFormatter.testParseInto_monthDay_feb29_tokyo(TestDateTimeFormatter.java:947)

testParseInto_monthDay_feb29_tokyo_startOfYear(org.joda.time.format.TestDateTimeFormatter)  Time elapsed: 0 sec  <<< FAILURE!
junit.framework.AssertionFailedError: expected:<2004-02-28T15:00:00.000Z> but was:<2004-02-29T00:00:00.000Z>
	at junit.framework.Assert.fail(Assert.java:47)
	at junit.framework.Assert.failNotEquals(Assert.java:280)
	at junit.framework.Assert.assertEquals(Assert.java:64)
	at junit.framework.Assert.assertEquals(Assert.java:71)
	at org.joda.time.format.TestDateTimeFormatter.testParseInto_monthDay_feb29_tokyo_startOfYear(TestDateTimeFormatter.java:954)

testParseInto_monthDay_feb29_tokyo_endOfYear(org.joda.time.format.TestDateTimeFormatter)  Time elapsed: 0.001 sec  <<< FAILURE!
junit.framework.AssertionFailedError: expected:<2004-02-29T14:59:59.999Z> but was:<2004-02-29T23:59:59.999Z>
	at junit.framework.Assert.fail(Assert.java:47)
	at junit.framework.Assert.failNotEquals(Assert.java:280)
	at junit.framework.Assert.assertEquals(Assert.java:64)
	at junit.framework.Assert.assertEquals(Assert.java:71)
	at org.joda.time.format.TestDateTimeFormatter.testParseInto_monthDay_feb29_tokyo_endOfYear(TestDateTimeFormatter.java:961)

testParseInto_monthDay_withDefaultYear_feb29_newYork(org.joda.time.format.TestDateTimeFormatter)  Time elapsed: 0.001 sec  <<< FAILURE!
junit.framework.AssertionFailedError: expected:<2004-02-29T17:20:30.000Z> but was:<2004-02-29T12:20:30.000Z>
	at junit.framework.Assert.fail(Assert.java:47)
	at junit.framework.Assert.failNotEquals(Assert.java:280)
	at junit.framework.Assert.assertEquals(Assert.java:64)
	at junit.framework.Assert.assertEquals(Assert.java:71)
	at org.joda.time.format.TestDateTimeFormatter.testParseInto_monthDay_withDefaultYear_feb29_newYork(TestDateTimeFormatter.java:975)

testParseInto_monthDay_withDefaultYear_feb29_newYork_endOfYear(org.joda.time.format.TestDateTimeFormatter)  Time elapsed: 0 sec  <<< FAILURE!
junit.framework.AssertionFailedError: expected:<2004-02-29T17:20:30.000Z> but was:<2004-02-29T12:20:30.000Z>
	at junit.framework.Assert.fail(Assert.java:47)
	at junit.framework.Assert.failNotEquals(Assert.java:280)
	at junit.framework.Assert.assertEquals(Assert.java:64)
	at junit.framework.Assert.assertEquals(Assert.java:71)
	at org.joda.time.format.TestDateTimeFormatter.testParseInto_monthDay_withDefaultYear_feb29_newYork_endOfYear(TestDateTimeFormatter.java:982)

testParseMillis_fractionOfSecondLong(org.joda.time.format.TestDateTimeFormatter)  Time elapsed: 0.001 sec  <<< FAILURE!
junit.framework.AssertionFailedError: expected:<10512> but was:<-3589488>
	at junit.framework.Assert.fail(Assert.java:47)
	at junit.framework.Assert.failNotEquals(Assert.java:280)
	at junit.framework.Assert.assertEquals(Assert.java:64)
	at junit.framework.Assert.assertEquals(Assert.java:133)
	at junit.framework.Assert.assertEquals(Assert.java:139)
	at org.joda.time.format.TestDateTimeFormatter.testParseMillis_fractionOfSecondLong(TestDateTimeFormatter.java:989)

testZoneNameNearTransition(org.joda.time.format.TestDateTimeFormatter)  Time elapsed: 0.001 sec  <<< FAILURE!
junit.framework.ComparisonFailure: expected:<2005-10-30 0[1:00:00.0 Eastern Daylight] Time> but was:<2005-10-30 0[5:00:00.0 Greenwich Mean] Time>
	at junit.framework.Assert.assertEquals(Assert.java:81)
	at junit.framework.Assert.assertEquals(Assert.java:87)
	at org.joda.time.format.TestDateTimeFormatter.testZoneNameNearTransition(TestDateTimeFormatter.java:1003)

testZoneShortNameNearTransition(org.joda.time.format.TestDateTimeFormatter)  Time elapsed: 0.001 sec  <<< FAILURE!
junit.framework.ComparisonFailure: expected:<2005-10-30 0[1:00:00.0 ED]T> but was:<2005-10-30 0[5:00:00.0 GM]T>
	at junit.framework.Assert.assertEquals(Assert.java:81)
	at junit.framework.Assert.assertEquals(Assert.java:87)
	at org.joda.time.format.TestDateTimeFormatter.testZoneShortNameNearTransition(TestDateTimeFormatter.java:1019)

testFormat_clockhourOfDay(org.joda.time.format.TestDateTimeFormat)  Time elapsed: 0.001 sec  <<< FAILURE!
junit.framework.ComparisonFailure: 2004-06-09T11:20:30.040+01:00 expected:<1[0]> but was:<1[1]>
	at junit.framework.Assert.assertEquals(Assert.java:81)
	at org.joda.time.format.TestDateTimeFormat.testFormat_clockhourOfDay(TestDateTimeFormat.java:689)

testFormat_zoneText(org.joda.time.format.TestDateTimeFormat)  Time elapsed: 0 sec  <<< FAILURE!
junit.framework.ComparisonFailure: 2004-06-09T11:20:30.040+01:00 expected:<[UTC]> but was:<[BST]>
	at junit.framework.Assert.assertEquals(Assert.java:81)
	at org.joda.time.format.TestDateTimeFormat.testFormat_zoneText(TestDateTimeFormat.java:757)

testFormat_zoneLongText(org.joda.time.format.TestDateTimeFormat)  Time elapsed: 0.001 sec  <<< FAILURE!
junit.framework.ComparisonFailure: 2004-06-09T11:20:30.040+01:00 expected:<[Coordinated Universal] Time> but was:<[British Summer] Time>
	at junit.framework.Assert.assertEquals(Assert.java:81)
	at org.joda.time.format.TestDateTimeFormat.testFormat_zoneLongText(TestDateTimeFormat.java:769)

testFormat_zoneAmount(org.joda.time.format.TestDateTimeFormat)  Time elapsed: 0 sec  <<< FAILURE!
junit.framework.ComparisonFailure: 2004-06-09T11:20:30.040+01:00 expected:<+0[0]00> but was:<+0[1]00>
	at junit.framework.Assert.assertEquals(Assert.java:81)
	at org.joda.time.format.TestDateTimeFormat.testFormat_zoneAmount(TestDateTimeFormat.java:782)

testFormat_zoneAmountColon(org.joda.time.format.TestDateTimeFormat)  Time elapsed: 0.001 sec  <<< FAILURE!
junit.framework.ComparisonFailure: 2004-06-09T11:20:30.040+01:00 expected:<+0[0]:00> but was:<+0[1]:00>
	at junit.framework.Assert.assertEquals(Assert.java:81)
	at org.joda.time.format.TestDateTimeFormat.testFormat_zoneAmountColon(TestDateTimeFormat.java:794)

testFormat_zoneAmountID(org.joda.time.format.TestDateTimeFormat)  Time elapsed: 0.001 sec  <<< FAILURE!
junit.framework.ComparisonFailure: 2004-06-09T11:20:30.040+01:00 expected:<[UTC]> but was:<[Europe/London]>
	at junit.framework.Assert.assertEquals(Assert.java:81)
	at org.joda.time.format.TestDateTimeFormat.testFormat_zoneAmountID(TestDateTimeFormat.java:806)

testFormat_weekyearOfEra_twoDigit(org.joda.time.format.TestDateTimeFormat)  Time elapsed: 0.001 sec  <<< FAILURE!
junit.framework.AssertionFailedError: expected:<0003-12-28T23:58:45.000-00:01:15> but was:<0003-12-29T00:00:00.000-00:01:15>
	at junit.framework.Assert.fail(Assert.java:47)
	at junit.framework.Assert.failNotEquals(Assert.java:280)
	at junit.framework.Assert.assertEquals(Assert.java:64)
	at junit.framework.Assert.assertEquals(Assert.java:71)
	at org.joda.time.format.TestDateTimeFormat.testFormat_weekyearOfEra_twoDigit(TestDateTimeFormat.java:455)

testFormat_yearOfEraParse(org.joda.time.format.TestDateTimeFormat)  Time elapsed: 0 sec  <<< FAILURE!
junit.framework.AssertionFailedError: expected:<2005-10-01T01:00:00.000+01:00> but was:<2005-10-01T00:00:00.000+01:00>
	at junit.framework.Assert.fail(Assert.java:47)
	at junit.framework.Assert.failNotEquals(Assert.java:280)
	at junit.framework.Assert.assertEquals(Assert.java:64)
	at junit.framework.Assert.assertEquals(Assert.java:71)
	at org.joda.time.format.TestDateTimeFormat.testFormat_yearOfEraParse(TestDateTimeFormat.java:200)

testFormat_year_twoDigit(org.joda.time.format.TestDateTimeFormat)  Time elapsed: 0 sec  <<< FAILURE!
junit.framework.AssertionFailedError: expected:<0003-12-31T23:58:45.000-00:01:15> but was:<0004-01-01T00:00:00.000-00:01:15>
	at junit.framework.Assert.fail(Assert.java:47)
	at junit.framework.Assert.failNotEquals(Assert.java:280)
	at junit.framework.Assert.assertEquals(Assert.java:64)
	at junit.framework.Assert.assertEquals(Assert.java:71)
	at org.joda.time.format.TestDateTimeFormat.testFormat_year_twoDigit(TestDateTimeFormat.java:310)

testFormat_samples(org.joda.time.format.TestDateTimeFormat)  Time elapsed: 0.001 sec  <<< FAILURE!
junit.framework.ComparisonFailure: expected:<2004-06-09 1[0].20.30> but was:<2004-06-09 1[1].20.30>
	at junit.framework.Assert.assertEquals(Assert.java:81)
	at junit.framework.Assert.assertEquals(Assert.java:87)
	at org.joda.time.format.TestDateTimeFormat.testFormat_samples(TestDateTimeFormat.java:844)

testFormat_halfdayOfDay(org.joda.time.format.TestDateTimeFormat)  Time elapsed: 0.001 sec  <<< FAILURE!
junit.framework.ComparisonFailure: 2004-06-09T11:20:30.040+01:00 expected:<[P]M> but was:<[A]M>
	at junit.framework.Assert.assertEquals(Assert.java:81)
	at org.joda.time.format.TestDateTimeFormat.testFormat_halfdayOfDay(TestDateTimeFormat.java:634)

testFormat_hourOfHalfday(org.joda.time.format.TestDateTimeFormat)  Time elapsed: 0 sec  <<< FAILURE!
junit.framework.ComparisonFailure: 2004-06-09T11:20:30.040+01:00 expected:<1[0]> but was:<1[1]>
	at junit.framework.Assert.assertEquals(Assert.java:81)
	at org.joda.time.format.TestDateTimeFormat.testFormat_hourOfHalfday(TestDateTimeFormat.java:641)

testFormat_clockhourOfHalfday(org.joda.time.format.TestDateTimeFormat)  Time elapsed: 0.001 sec  <<< FAILURE!
junit.framework.ComparisonFailure: 2004-06-09T11:20:30.040+01:00 expected:<1[0]> but was:<1[1]>
	at junit.framework.Assert.assertEquals(Assert.java:81)
	at org.joda.time.format.TestDateTimeFormat.testFormat_clockhourOfHalfday(TestDateTimeFormat.java:657)

testFormat_hourOfDay(org.joda.time.format.TestDateTimeFormat)  Time elapsed: 0 sec  <<< FAILURE!
junit.framework.ComparisonFailure: 2004-06-09T11:20:30.040+01:00 expected:<1[0]> but was:<1[1]>
	at junit.framework.Assert.assertEquals(Assert.java:81)
	at org.joda.time.format.TestDateTimeFormat.testFormat_hourOfDay(TestDateTimeFormat.java:673)

testFormatParse_textMonthAtEnd_France(org.joda.time.format.TestDateTimeFormat)  Time elapsed: 0.001 sec  <<< FAILURE!
junit.framework.AssertionFailedError: expected:<23> but was:<22>
	at junit.framework.Assert.fail(Assert.java:47)
	at junit.framework.Assert.failNotEquals(Assert.java:280)
	at junit.framework.Assert.assertEquals(Assert.java:64)
	at junit.framework.Assert.assertEquals(Assert.java:198)
	at junit.framework.Assert.assertEquals(Assert.java:204)
	at org.joda.time.format.TestDateTimeFormat.check(TestDateTimeFormat.java:1175)
	at org.joda.time.format.TestDateTimeFormat.testFormatParse_textMonthAtEnd_France(TestDateTimeFormat.java:974)

testFormatParse_textMonthAtEnd_France_withSpecifiedDefault(org.joda.time.format.TestDateTimeFormat)  Time elapsed: 0 sec  <<< FAILURE!
junit.framework.AssertionFailedError: expected:<23> but was:<22>
	at junit.framework.Assert.fail(Assert.java:47)
	at junit.framework.Assert.failNotEquals(Assert.java:280)
	at junit.framework.Assert.assertEquals(Assert.java:64)
	at junit.framework.Assert.assertEquals(Assert.java:198)
	at junit.framework.Assert.assertEquals(Assert.java:204)
	at org.joda.time.format.TestDateTimeFormat.check(TestDateTimeFormat.java:1175)
	at org.joda.time.format.TestDateTimeFormat.testFormatParse_textMonthAtEnd_France_withSpecifiedDefault(TestDateTimeFormat.java:984)

testFormat_dateHourMinuteSecondFraction(org.joda.time.format.TestISODateTimeFormat)  Time elapsed: 0.001 sec  <<< FAILURE!
junit.framework.ComparisonFailure: expected:<2004-06-09T1[0]:20:30.040> but was:<2004-06-09T1[1]:20:30.040>
	at junit.framework.Assert.assertEquals(Assert.java:81)
	at junit.framework.Assert.assertEquals(Assert.java:87)
	at org.joda.time.format.TestISODateTimeFormat.testFormat_dateHourMinuteSecondFraction(TestISODateTimeFormat.java:588)

testFormat_time(org.joda.time.format.TestISODateTimeFormat)  Time elapsed: 0 sec  <<< FAILURE!
junit.framework.ComparisonFailure: expected:<1[0:20:30.040Z]> but was:<1[1:20:30.040+01:00]>
	at junit.framework.Assert.assertEquals(Assert.java:81)
	at junit.framework.Assert.assertEquals(Assert.java:87)
	at org.joda.time.format.TestISODateTimeFormat.testFormat_time(TestISODateTimeFormat.java:116)

testFormat_timeNoMillis(org.joda.time.format.TestISODateTimeFormat)  Time elapsed: 0 sec  <<< FAILURE!
junit.framework.ComparisonFailure: expected:<1[0:20:30Z]> but was:<1[1:20:30+01:00]>
	at junit.framework.Assert.assertEquals(Assert.java:81)
	at junit.framework.Assert.assertEquals(Assert.java:87)
	at org.joda.time.format.TestISODateTimeFormat.testFormat_timeNoMillis(TestISODateTimeFormat.java:135)

testFormat_tTime(org.joda.time.format.TestISODateTimeFormat)  Time elapsed: 0.001 sec  <<< FAILURE!
junit.framework.ComparisonFailure: expected:<T1[0:20:30.040Z]> but was:<T1[1:20:30.040+01:00]>
	at junit.framework.Assert.assertEquals(Assert.java:81)
	at junit.framework.Assert.assertEquals(Assert.java:87)
	at org.joda.time.format.TestISODateTimeFormat.testFormat_tTime(TestISODateTimeFormat.java:154)

testFormat_tTimeNoMillis(org.joda.time.format.TestISODateTimeFormat)  Time elapsed: 0 sec  <<< FAILURE!
junit.framework.ComparisonFailure: expected:<T1[0:20:30Z]> but was:<T1[1:20:30+01:00]>
	at junit.framework.Assert.assertEquals(Assert.java:81)
	at junit.framework.Assert.assertEquals(Assert.java:87)
	at org.joda.time.format.TestISODateTimeFormat.testFormat_tTimeNoMillis(TestISODateTimeFormat.java:165)

testFormat_dateTime(org.joda.time.format.TestISODateTimeFormat)  Time elapsed: 0.001 sec  <<< FAILURE!
junit.framework.ComparisonFailure: expected:<2004-06-09T1[0:20:30.040Z]> but was:<2004-06-09T1[1:20:30.040+01:00]>
	at junit.framework.Assert.assertEquals(Assert.java:81)
	at junit.framework.Assert.assertEquals(Assert.java:87)
	at org.joda.time.format.TestISODateTimeFormat.testFormat_dateTime(TestISODateTimeFormat.java:176)

testFormat_dateTimeNoMillis(org.joda.time.format.TestISODateTimeFormat)  Time elapsed: 0 sec  <<< FAILURE!
junit.framework.ComparisonFailure: expected:<2004-06-09T1[0:20:30Z]> but was:<2004-06-09T1[1:20:30+01:00]>
	at junit.framework.Assert.assertEquals(Assert.java:81)
	at junit.framework.Assert.assertEquals(Assert.java:87)
	at org.joda.time.format.TestISODateTimeFormat.testFormat_dateTimeNoMillis(TestISODateTimeFormat.java:199)

testFormat_ordinalDateTime(org.joda.time.format.TestISODateTimeFormat)  Time elapsed: 0.001 sec  <<< FAILURE!
junit.framework.ComparisonFailure: expected:<2004-161T1[0:20:30.040Z]> but was:<2004-161T1[1:20:30.040+01:00]>
	at junit.framework.Assert.assertEquals(Assert.java:81)
	at junit.framework.Assert.assertEquals(Assert.java:87)
	at org.joda.time.format.TestISODateTimeFormat.testFormat_ordinalDateTime(TestISODateTimeFormat.java:221)

testFormat_ordinalDateTimeNoMillis(org.joda.time.format.TestISODateTimeFormat)  Time elapsed: 0 sec  <<< FAILURE!
junit.framework.ComparisonFailure: expected:<2004-161T1[0:20:30Z]> but was:<2004-161T1[1:20:30+01:00]>
	at junit.framework.Assert.assertEquals(Assert.java:81)
	at junit.framework.Assert.assertEquals(Assert.java:87)
	at org.joda.time.format.TestISODateTimeFormat.testFormat_ordinalDateTimeNoMillis(TestISODateTimeFormat.java:232)

testFormat_weekDateTime(org.joda.time.format.TestISODateTimeFormat)  Time elapsed: 0 sec  <<< FAILURE!
junit.framework.ComparisonFailure: expected:<2004-W24-3T1[0:20:30.040Z]> but was:<2004-W24-3T1[1:20:30.040+01:00]>
	at junit.framework.Assert.assertEquals(Assert.java:81)
	at junit.framework.Assert.assertEquals(Assert.java:87)
	at org.joda.time.format.TestISODateTimeFormat.testFormat_weekDateTime(TestISODateTimeFormat.java:254)

testFormat_weekDateTimeNoMillis(org.joda.time.format.TestISODateTimeFormat)  Time elapsed: 0 sec  <<< FAILURE!
junit.framework.ComparisonFailure: expected:<2004-W24-3T1[0:20:30Z]> but was:<2004-W24-3T1[1:20:30+01:00]>
	at junit.framework.Assert.assertEquals(Assert.java:81)
	at junit.framework.Assert.assertEquals(Assert.java:87)
	at org.joda.time.format.TestISODateTimeFormat.testFormat_weekDateTimeNoMillis(TestISODateTimeFormat.java:265)

testFormat_basicTime(org.joda.time.format.TestISODateTimeFormat)  Time elapsed: 0 sec  <<< FAILURE!
junit.framework.ComparisonFailure: expected:<1[02030.040Z]> but was:<1[12030.040+0100]>
	at junit.framework.Assert.assertEquals(Assert.java:81)
	at junit.framework.Assert.assertEquals(Assert.java:87)
	at org.joda.time.format.TestISODateTimeFormat.testFormat_basicTime(TestISODateTimeFormat.java:288)

testFormat_basicTimeNoMillis(org.joda.time.format.TestISODateTimeFormat)  Time elapsed: 0.001 sec  <<< FAILURE!
junit.framework.ComparisonFailure: expected:<1[02030Z]> but was:<1[12030+0100]>
	at junit.framework.Assert.assertEquals(Assert.java:81)
	at junit.framework.Assert.assertEquals(Assert.java:87)
	at org.joda.time.format.TestISODateTimeFormat.testFormat_basicTimeNoMillis(TestISODateTimeFormat.java:299)

testFormat_basicTTime(org.joda.time.format.TestISODateTimeFormat)  Time elapsed: 0 sec  <<< FAILURE!
junit.framework.ComparisonFailure: expected:<T1[02030.040Z]> but was:<T1[12030.040+0100]>
	at junit.framework.Assert.assertEquals(Assert.java:81)
	at junit.framework.Assert.assertEquals(Assert.java:87)
	at org.joda.time.format.TestISODateTimeFormat.testFormat_basicTTime(TestISODateTimeFormat.java:310)

testFormat_basicTTimeNoMillis(org.joda.time.format.TestISODateTimeFormat)  Time elapsed: 0 sec  <<< FAILURE!
junit.framework.ComparisonFailure: expected:<T1[02030Z]> but was:<T1[12030+0100]>
	at junit.framework.Assert.assertEquals(Assert.java:81)
	at junit.framework.Assert.assertEquals(Assert.java:87)
	at org.joda.time.format.TestISODateTimeFormat.testFormat_basicTTimeNoMillis(TestISODateTimeFormat.java:321)

testFormat_basicDateTime(org.joda.time.format.TestISODateTimeFormat)  Time elapsed: 0.001 sec  <<< FAILURE!
junit.framework.ComparisonFailure: expected:<20040609T1[02030.040Z]> but was:<20040609T1[12030.040+0100]>
	at junit.framework.Assert.assertEquals(Assert.java:81)
	at junit.framework.Assert.assertEquals(Assert.java:87)
	at org.joda.time.format.TestISODateTimeFormat.testFormat_basicDateTime(TestISODateTimeFormat.java:332)

testFormat_basicDateTimeNoMillis(org.joda.time.format.TestISODateTimeFormat)  Time elapsed: 0.001 sec  <<< FAILURE!
junit.framework.ComparisonFailure: expected:<20040609T1[02030Z]> but was:<20040609T1[12030+0100]>
	at junit.framework.Assert.assertEquals(Assert.java:81)
	at junit.framework.Assert.assertEquals(Assert.java:87)
	at org.joda.time.format.TestISODateTimeFormat.testFormat_basicDateTimeNoMillis(TestISODateTimeFormat.java:343)

testFormat_basicOrdinalDateTime(org.joda.time.format.TestISODateTimeFormat)  Time elapsed: 0 sec  <<< FAILURE!
junit.framework.ComparisonFailure: expected:<2004161T1[02030.040Z]> but was:<2004161T1[12030.040+0100]>
	at junit.framework.Assert.assertEquals(Assert.java:81)
	at junit.framework.Assert.assertEquals(Assert.java:87)
	at org.joda.time.format.TestISODateTimeFormat.testFormat_basicOrdinalDateTime(TestISODateTimeFormat.java:365)

testFormat_basicOrdinalDateTimeNoMillis(org.joda.time.format.TestISODateTimeFormat)  Time elapsed: 0 sec  <<< FAILURE!
junit.framework.ComparisonFailure: expected:<2004161T1[02030Z]> but was:<2004161T1[12030+0100]>
	at junit.framework.Assert.assertEquals(Assert.java:81)
	at junit.framework.Assert.assertEquals(Assert.java:87)
	at org.joda.time.format.TestISODateTimeFormat.testFormat_basicOrdinalDateTimeNoMillis(TestISODateTimeFormat.java:376)

testFormat_basicWeekDateTime(org.joda.time.format.TestISODateTimeFormat)  Time elapsed: 0 sec  <<< FAILURE!
junit.framework.ComparisonFailure: expected:<2004W243T1[02030.040Z]> but was:<2004W243T1[12030.040+0100]>
	at junit.framework.Assert.assertEquals(Assert.java:81)
	at junit.framework.Assert.assertEquals(Assert.java:87)
	at org.joda.time.format.TestISODateTimeFormat.testFormat_basicWeekDateTime(TestISODateTimeFormat.java:398)

testFormat_basicWeekDateTimeNoMillis(org.joda.time.format.TestISODateTimeFormat)  Time elapsed: 0.001 sec  <<< FAILURE!
junit.framework.ComparisonFailure: expected:<2004W243T1[02030Z]> but was:<2004W243T1[12030+0100]>
	at junit.framework.Assert.assertEquals(Assert.java:81)
	at junit.framework.Assert.assertEquals(Assert.java:87)
	at org.joda.time.format.TestISODateTimeFormat.testFormat_basicWeekDateTimeNoMillis(TestISODateTimeFormat.java:409)

testFormat_hour(org.joda.time.format.TestISODateTimeFormat)  Time elapsed: 0.001 sec  <<< FAILURE!
junit.framework.ComparisonFailure: expected:<1[0]> but was:<1[1]>
	at junit.framework.Assert.assertEquals(Assert.java:81)
	at junit.framework.Assert.assertEquals(Assert.java:87)
	at org.joda.time.format.TestISODateTimeFormat.testFormat_hour(TestISODateTimeFormat.java:488)

testFormat_hourMinute(org.joda.time.format.TestISODateTimeFormat)  Time elapsed: 0 sec  <<< FAILURE!
junit.framework.ComparisonFailure: expected:<1[0]:20> but was:<1[1]:20>
	at junit.framework.Assert.assertEquals(Assert.java:81)
	at junit.framework.Assert.assertEquals(Assert.java:87)
	at org.joda.time.format.TestISODateTimeFormat.testFormat_hourMinute(TestISODateTimeFormat.java:499)

testFormat_hourMinuteSecond(org.joda.time.format.TestISODateTimeFormat)  Time elapsed: 0.001 sec  <<< FAILURE!
junit.framework.ComparisonFailure: expected:<1[0]:20:30> but was:<1[1]:20:30>
	at junit.framework.Assert.assertEquals(Assert.java:81)
	at junit.framework.Assert.assertEquals(Assert.java:87)
	at org.joda.time.format.TestISODateTimeFormat.testFormat_hourMinuteSecond(TestISODateTimeFormat.java:510)

testFormat_hourMinuteSecondMillis(org.joda.time.format.TestISODateTimeFormat)  Time elapsed: 0 sec  <<< FAILURE!
junit.framework.ComparisonFailure: expected:<1[0]:20:30.040> but was:<1[1]:20:30.040>
	at junit.framework.Assert.assertEquals(Assert.java:81)
	at junit.framework.Assert.assertEquals(Assert.java:87)
	at org.joda.time.format.TestISODateTimeFormat.testFormat_hourMinuteSecondMillis(TestISODateTimeFormat.java:521)

testFormat_hourMinuteSecondFraction(org.joda.time.format.TestISODateTimeFormat)  Time elapsed: 0 sec  <<< FAILURE!
junit.framework.ComparisonFailure: expected:<1[0]:20:30.040> but was:<1[1]:20:30.040>
	at junit.framework.Assert.assertEquals(Assert.java:81)
	at junit.framework.Assert.assertEquals(Assert.java:87)
	at org.joda.time.format.TestISODateTimeFormat.testFormat_hourMinuteSecondFraction(TestISODateTimeFormat.java:532)

testFormat_dateHour(org.joda.time.format.TestISODateTimeFormat)  Time elapsed: 0.001 sec  <<< FAILURE!
junit.framework.ComparisonFailure: expected:<2004-06-09T1[0]> but was:<2004-06-09T1[1]>
	at junit.framework.Assert.assertEquals(Assert.java:81)
	at junit.framework.Assert.assertEquals(Assert.java:87)
	at org.joda.time.format.TestISODateTimeFormat.testFormat_dateHour(TestISODateTimeFormat.java:544)

testFormat_dateHourMinute(org.joda.time.format.TestISODateTimeFormat)  Time elapsed: 0 sec  <<< FAILURE!
junit.framework.ComparisonFailure: expected:<2004-06-09T1[0]:20> but was:<2004-06-09T1[1]:20>
	at junit.framework.Assert.assertEquals(Assert.java:81)
	at junit.framework.Assert.assertEquals(Assert.java:87)
	at org.joda.time.format.TestISODateTimeFormat.testFormat_dateHourMinute(TestISODateTimeFormat.java:555)

testFormat_dateHourMinuteSecond(org.joda.time.format.TestISODateTimeFormat)  Time elapsed: 0.001 sec  <<< FAILURE!
junit.framework.ComparisonFailure: expected:<2004-06-09T1[0]:20:30> but was:<2004-06-09T1[1]:20:30>
	at junit.framework.Assert.assertEquals(Assert.java:81)
	at junit.framework.Assert.assertEquals(Assert.java:87)
	at org.joda.time.format.TestISODateTimeFormat.testFormat_dateHourMinuteSecond(TestISODateTimeFormat.java:566)

testFormat_dateHourMinuteSecondMillis(org.joda.time.format.TestISODateTimeFormat)  Time elapsed: 0 sec  <<< FAILURE!
junit.framework.ComparisonFailure: expected:<2004-06-09T1[0]:20:30.040> but was:<2004-06-09T1[1]:20:30.040>
	at junit.framework.Assert.assertEquals(Assert.java:81)
	at junit.framework.Assert.assertEquals(Assert.java:87)
	at org.joda.time.format.TestISODateTimeFormat.testFormat_dateHourMinuteSecondMillis(TestISODateTimeFormat.java:577)

test_localTimeParser(org.joda.time.format.TestISODateTimeFormatParsing)  Time elapsed: 0.001 sec  <<< FAILURE!
junit.framework.AssertionFailedError: expected:<10512> but was:<-3589488>
	at junit.framework.Assert.fail(Assert.java:47)
	at junit.framework.Assert.failNotEquals(Assert.java:280)
	at junit.framework.Assert.assertEquals(Assert.java:64)
	at junit.framework.Assert.assertEquals(Assert.java:133)
	at junit.framework.Assert.assertEquals(Assert.java:139)
	at org.joda.time.format.TestISODateTimeFormatParsing.test_localTimeParser(TestISODateTimeFormatParsing.java:225)

test_append_Parser(org.joda.time.format.TestDateTimeFormatterBuilder)  Time elapsed: 0.001 sec  <<< FAILURE!
junit.framework.AssertionFailedError: expected:<0> but was:<-3600000>
	at junit.framework.Assert.fail(Assert.java:47)
	at junit.framework.Assert.failNotEquals(Assert.java:280)
	at junit.framework.Assert.assertEquals(Assert.java:64)
	at junit.framework.Assert.assertEquals(Assert.java:133)
	at junit.framework.Assert.assertEquals(Assert.java:139)
	at org.joda.time.format.TestDateTimeFormatterBuilder.test_append_Parser(TestDateTimeFormatterBuilder.java:172)

test_appendOptional_Parser(org.joda.time.format.TestDateTimeFormatterBuilder)  Time elapsed: 0 sec  <<< FAILURE!
junit.framework.AssertionFailedError: expected:<0> but was:<-3600000>
	at junit.framework.Assert.fail(Assert.java:47)
	at junit.framework.Assert.failNotEquals(Assert.java:280)
	at junit.framework.Assert.assertEquals(Assert.java:64)
	at junit.framework.Assert.assertEquals(Assert.java:133)
	at junit.framework.Assert.assertEquals(Assert.java:139)
	at org.joda.time.format.TestDateTimeFormatterBuilder.test_appendOptional_Parser(TestDateTimeFormatterBuilder.java:227)

test_appendTimeZoneOffset_print_min1max1(org.joda.time.format.TestDateTimeFormatterBuilder)  Time elapsed: 0 sec  <<< FAILURE!
junit.framework.ComparisonFailure: expected:<[+02]> but was:<[Z]>
	at junit.framework.Assert.assertEquals(Assert.java:81)
	at junit.framework.Assert.assertEquals(Assert.java:87)
	at org.joda.time.format.TestDateTimeFormatterBuilder.assertPrint(TestDateTimeFormatterBuilder.java:672)
	at org.joda.time.format.TestDateTimeFormatterBuilder.test_appendTimeZoneOffset_print_min1max1(TestDateTimeFormatterBuilder.java:338)

test_appendTimeZoneOffset_print_min1max2(org.joda.time.format.TestDateTimeFormatterBuilder)  Time elapsed: 0.001 sec  <<< FAILURE!
junit.framework.ComparisonFailure: expected:<[+02]> but was:<[Z]>
	at junit.framework.Assert.assertEquals(Assert.java:81)
	at junit.framework.Assert.assertEquals(Assert.java:87)
	at org.joda.time.format.TestDateTimeFormatterBuilder.assertPrint(TestDateTimeFormatterBuilder.java:672)
	at org.joda.time.format.TestDateTimeFormatterBuilder.test_appendTimeZoneOffset_print_min1max2(TestDateTimeFormatterBuilder.java:344)

test_appendTimeZoneOffset_print_min1max3(org.joda.time.format.TestDateTimeFormatterBuilder)  Time elapsed: 0 sec  <<< FAILURE!
junit.framework.ComparisonFailure: expected:<[+02]> but was:<[Z]>
	at junit.framework.Assert.assertEquals(Assert.java:81)
	at junit.framework.Assert.assertEquals(Assert.java:87)
	at org.joda.time.format.TestDateTimeFormatterBuilder.assertPrint(TestDateTimeFormatterBuilder.java:672)
	at org.joda.time.format.TestDateTimeFormatterBuilder.test_appendTimeZoneOffset_print_min1max3(TestDateTimeFormatterBuilder.java:350)

test_appendTimeZoneOffset_print_min2max2(org.joda.time.format.TestDateTimeFormatterBuilder)  Time elapsed: 0.001 sec  <<< FAILURE!
junit.framework.ComparisonFailure: expected:<[+02:00]> but was:<[Z]>
	at junit.framework.Assert.assertEquals(Assert.java:81)
	at junit.framework.Assert.assertEquals(Assert.java:87)
	at org.joda.time.format.TestDateTimeFormatterBuilder.assertPrint(TestDateTimeFormatterBuilder.java:672)
	at org.joda.time.format.TestDateTimeFormatterBuilder.test_appendTimeZoneOffset_print_min2max2(TestDateTimeFormatterBuilder.java:356)

test_appendTimeZoneOffset_print_min2max3(org.joda.time.format.TestDateTimeFormatterBuilder)  Time elapsed: 0 sec  <<< FAILURE!
junit.framework.ComparisonFailure: expected:<[+02:00]> but was:<[Z]>
	at junit.framework.Assert.assertEquals(Assert.java:81)
	at junit.framework.Assert.assertEquals(Assert.java:87)
	at org.joda.time.format.TestDateTimeFormatterBuilder.assertPrint(TestDateTimeFormatterBuilder.java:672)
	at org.joda.time.format.TestDateTimeFormatterBuilder.test_appendTimeZoneOffset_print_min2max3(TestDateTimeFormatterBuilder.java:362)

test_appendTimeZoneOffset_print_min3max3(org.joda.time.format.TestDateTimeFormatterBuilder)  Time elapsed: 0.001 sec  <<< FAILURE!
junit.framework.ComparisonFailure: expected:<[+02:00:00]> but was:<[Z]>
	at junit.framework.Assert.assertEquals(Assert.java:81)
	at junit.framework.Assert.assertEquals(Assert.java:87)
	at org.joda.time.format.TestDateTimeFormatterBuilder.assertPrint(TestDateTimeFormatterBuilder.java:672)
	at org.joda.time.format.TestDateTimeFormatterBuilder.test_appendTimeZoneOffset_print_min3max3(TestDateTimeFormatterBuilder.java:368)

test_appendTimeZoneId(org.joda.time.format.TestDateTimeFormatterBuilder)  Time elapsed: 0.001 sec  <<< FAILURE!
junit.framework.ComparisonFailure: expected:<[Asia/Tokyo]> but was:<[Europe/London]>
	at junit.framework.Assert.assertEquals(Assert.java:81)
	at junit.framework.Assert.assertEquals(Assert.java:87)
	at org.joda.time.format.TestDateTimeFormatterBuilder.test_appendTimeZoneId(TestDateTimeFormatterBuilder.java:398)

test_printParseZoneTokyo(org.joda.time.format.TestDateTimeFormatterBuilder)  Time elapsed: 0 sec  <<< FAILURE!
junit.framework.ComparisonFailure: expected:<2007-03-04 [12:30 Asia/Tokyo]> but was:<2007-03-04 [03:30 Europe/London]>
	at junit.framework.Assert.assertEquals(Assert.java:81)
	at junit.framework.Assert.assertEquals(Assert.java:87)
	at org.joda.time.format.TestDateTimeFormatterBuilder.test_printParseZoneTokyo(TestDateTimeFormatterBuilder.java:413)

test_printParseZoneParis(org.joda.time.format.TestDateTimeFormatterBuilder)  Time elapsed: 0.001 sec  <<< FAILURE!
junit.framework.ComparisonFailure: expected:<2007-03-04 1[2:30 Europe/Paris]> but was:<2007-03-04 1[1:30 Europe/London]>
	at junit.framework.Assert.assertEquals(Assert.java:81)
	at junit.framework.Assert.assertEquals(Assert.java:87)
	at org.joda.time.format.TestDateTimeFormatterBuilder.test_printParseZoneParis(TestDateTimeFormatterBuilder.java:423)

test_printParseZoneDawsonCreek(org.joda.time.format.TestDateTimeFormatterBuilder)  Time elapsed: 0.001 sec  <<< FAILURE!
junit.framework.ComparisonFailure: expected:<2007-03-04 1[2:30 America/Dawson_Creek]> but was:<2007-03-04 1[9:30 Europe/London]>
	at junit.framework.Assert.assertEquals(Assert.java:81)
	at junit.framework.Assert.assertEquals(Assert.java:87)
	at org.joda.time.format.TestDateTimeFormatterBuilder.test_printParseZoneDawsonCreek(TestDateTimeFormatterBuilder.java:434)

test_printParseZoneBahiaBanderas(org.joda.time.format.TestDateTimeFormatterBuilder)  Time elapsed: 0.001 sec  <<< FAILURE!
junit.framework.ComparisonFailure: expected:<2007-03-04 1[2:30 America/Bahia_Banderas]> but was:<2007-03-04 1[9:30 Europe/London]>
	at junit.framework.Assert.assertEquals(Assert.java:81)
	at junit.framework.Assert.assertEquals(Assert.java:87)
	at org.joda.time.format.TestDateTimeFormatterBuilder.test_printParseZoneBahiaBanderas(TestDateTimeFormatterBuilder.java:444)

test_printParseOffset(org.joda.time.format.TestDateTimeFormatterBuilder)  Time elapsed: 0 sec  <<< FAILURE!
junit.framework.ComparisonFailure: expected:<2007-03-04 [12:30 +09:00]> but was:<2007-03-04 [03:30 Z]>
	at junit.framework.Assert.assertEquals(Assert.java:81)
	at junit.framework.Assert.assertEquals(Assert.java:87)
	at org.joda.time.format.TestDateTimeFormatterBuilder.test_printParseOffset(TestDateTimeFormatterBuilder.java:454)

test_printParseOffsetAndZone(org.joda.time.format.TestDateTimeFormatterBuilder)  Time elapsed: 0 sec  <<< FAILURE!
junit.framework.ComparisonFailure: expected:<2007-03-04 [12:30 +09:00 Asia/Tokyo]> but was:<2007-03-04 [03:30 Z Europe/London]>
	at junit.framework.Assert.assertEquals(Assert.java:81)
	at junit.framework.Assert.assertEquals(Assert.java:87)
	at org.joda.time.format.TestDateTimeFormatterBuilder.test_printParseOffsetAndZone(TestDateTimeFormatterBuilder.java:466)

test_localPrintParseZoneTokyo(org.joda.time.format.TestDateTimeFormatterBuilder)  Time elapsed: 0.001 sec  <<< FAILURE!
junit.framework.ComparisonFailure: expected:<2007-03-04 [12:30 Asia/Tokyo]> but was:<2007-03-04 [03:30 Europe/London]>
	at junit.framework.Assert.assertEquals(Assert.java:81)
	at junit.framework.Assert.assertEquals(Assert.java:87)
	at org.joda.time.format.TestDateTimeFormatterBuilder.test_localPrintParseZoneTokyo(TestDateTimeFormatterBuilder.java:507)

test_localPrintParseOffset(org.joda.time.format.TestDateTimeFormatterBuilder)  Time elapsed: 0.001 sec  <<< FAILURE!
junit.framework.ComparisonFailure: expected:<2007-03-04 [12:30 +09:00]> but was:<2007-03-04 [03:30 Z]>
	at junit.framework.Assert.assertEquals(Assert.java:81)
	at junit.framework.Assert.assertEquals(Assert.java:87)
	at org.joda.time.format.TestDateTimeFormatterBuilder.test_localPrintParseOffset(TestDateTimeFormatterBuilder.java:519)

test_localPrintParseOffsetAndZone(org.joda.time.format.TestDateTimeFormatterBuilder)  Time elapsed: 0.002 sec  <<< FAILURE!
junit.framework.ComparisonFailure: expected:<2007-03-04 [12:30 +09:00 Asia/Tokyo]> but was:<2007-03-04 [03:30 Z Europe/London]>
	at junit.framework.Assert.assertEquals(Assert.java:81)
	at junit.framework.Assert.assertEquals(Assert.java:87)
	at org.joda.time.format.TestDateTimeFormatterBuilder.test_localPrintParseOffsetAndZone(TestDateTimeFormatterBuilder.java:533)

test_printParseShortNameWithAutoLookup(org.joda.time.format.TestDateTimeFormatterBuilder)  Time elapsed: 0.001 sec  <<< FAILURE!
junit.framework.ComparisonFailure: expected:<2011-01-04 1[2:30 ES]T> but was:<2011-01-04 1[7:30 GM]T>
	at junit.framework.Assert.assertEquals(Assert.java:81)
	at junit.framework.Assert.assertEquals(Assert.java:87)
	at org.joda.time.format.TestDateTimeFormatterBuilder.test_printParseShortNameWithAutoLookup(TestDateTimeFormatterBuilder.java:605)

testMonthNames_monthStart(org.joda.time.format.TestTextFields)  Time elapsed: 0 sec  <<< FAILURE!
junit.framework.ComparisonFailure: expected:<[April]> but was:<[March]>
	at junit.framework.Assert.assertEquals(Assert.java:81)
	at junit.framework.Assert.assertEquals(Assert.java:87)
	at org.joda.time.format.TestTextFields.testMonthNames_monthStart(TestTextFields.java:95)

testMonthNames_monthEnd(org.joda.time.format.TestTextFields)  Time elapsed: 0.002 sec  <<< FAILURE!
junit.framework.ComparisonFailure: expected:<[Jan]uary> but was:<[Febr]uary>
	at junit.framework.Assert.assertEquals(Assert.java:81)
	at junit.framework.Assert.assertEquals(Assert.java:87)
	at org.joda.time.format.TestTextFields.testMonthNames_monthEnd(TestTextFields.java:120)

testWeekdayNames(org.joda.time.format.TestTextFields)  Time elapsed: 0.003 sec  <<< FAILURE!
junit.framework.ComparisonFailure: expected:<[Mo]nday> but was:<[Su]nday>
	at junit.framework.Assert.assertEquals(Assert.java:81)
	at junit.framework.Assert.assertEquals(Assert.java:87)
	at org.joda.time.format.TestTextFields.testWeekdayNames(TestTextFields.java:133)

testHalfdayNames(org.joda.time.format.TestTextFields)  Time elapsed: 0.001 sec  <<< FAILURE!
junit.framework.ComparisonFailure: expected:<[A]M> but was:<[P]M>
	at junit.framework.Assert.assertEquals(Assert.java:81)
	at junit.framework.Assert.assertEquals(Assert.java:87)
	at org.joda.time.format.TestTextFields.testHalfdayNames(TestTextFields.java:147)


Results :

Failed tests: 
  org.joda.time.TestChronology#testTest ComparisonFailure expected:<2002-06-09T0...
  org.joda.time.TestDateMidnight_Basics#testTest ComparisonFailure expected:<200...
  org.joda.time.TestDateMidnight_Basics#testToString ComparisonFailure expected:...
  org.joda.time.TestDateMidnight_Constructors#testTest ComparisonFailure expecte...
  org.joda.time.TestDateMidnight_Properties#testTest ComparisonFailure expected:...
  org.joda.time.TestDateTimeComparator#testHour AssertionFailedError HourM1b exp...
  org.joda.time.TestDateTimeComparator#testMonth AssertionFailedError MONTHM1a e...
  org.joda.time.TestDateTimeComparator#testYear AssertionFailedError YEARM1c exp...
  org.joda.time.TestDateTimeUtils#testTest ComparisonFailure expected:<2002-06-0...
  org.joda.time.TestDateTimeZoneCutover#testDateTimeCreation_athens ComparisonFailure
  org.joda.time.TestDateTimeZoneCutover#testDateTimeCreation_losAngeles ComparisonFailure
  org.joda.time.TestDateTimeZoneCutover#testDateTimeCreation_newYork ComparisonFailure
  org.joda.time.TestDateTimeZoneCutover#testDateTimeCreation_paris ComparisonFailure
  org.joda.time.TestDateTimeZoneCutover#testPlusMillisInDstChange ComparisonFailure
  org.joda.time.TestDateTimeZoneCutover#testPlusMinutesInDstChange ComparisonFailure
  org.joda.time.TestDateTimeZoneCutover#testPlusSecondsInDstChange ComparisonFailure
  org.joda.time.TestDateTimeZoneCutover#testWithHourOfDayInDstChange ComparisonFailure
  org.joda.time.TestDateTimeZoneCutover#testWithMillisOfSecondInDstChange_NewYork_summer ComparisonFailure
  org.joda.time.TestDateTimeZoneCutover#testWithMillisOfSecondInDstChange_NewYork_winter ComparisonFailure
  org.joda.time.TestDateTimeZoneCutover#testWithMillisOfSecondInDstChange_Paris_summer ComparisonFailure
  org.joda.time.TestDateTimeZoneCutover#testWithMillisOfSecondInDstChange_Paris_winter ComparisonFailure
  org.joda.time.TestDateTimeZoneCutover#testWithMinuteOfHourInDstChange ComparisonFailure
  org.joda.time.TestDateTimeZoneCutover#testWithMinuteOfHourInDstChange_mockZone ComparisonFailure
  org.joda.time.TestDateTimeZoneCutover#testWithSecondOfMinuteInDstChange ComparisonFailure
  org.joda.time.TestDateTimeZoneCutover#test_DateTime_JustAfterLastEverOverlap ComparisonFailure
  org.joda.time.TestDateTimeZoneCutover#test_DateTime_addWrapFieldDay_Gaza ComparisonFailure
  org.joda.time.TestDateTimeZoneCutover#test_DateTime_addWrapFieldDay_Turk ComparisonFailure
  org.joda.time.TestDateTimeZoneCutover#test_DateTime_constructor_Moscow_Autumn ComparisonFailure
  org.joda.time.TestDateTimeZoneCutover#test_DateTime_constructor_NewYork_Autumn ComparisonFailure
  org.joda.time.TestDateTimeZoneCutover#test_DateTime_minusDay_Gaza ComparisonFailure
  org.joda.time.TestDateTimeZoneCutover#test_DateTime_minusDay_Turk ComparisonFailure
  org.joda.time.TestDateTimeZoneCutover#test_DateTime_minusHour_Gaza ComparisonFailure
  org.joda.time.TestDateTimeZoneCutover#test_DateTime_minusHour_Guatemata_Autumn ComparisonFailure
  org.joda.time.TestDateTimeZoneCutover#test_DateTime_minusHour_Moscow_Autumn ComparisonFailure
  org.joda.time.TestDateTimeZoneCutover#test_DateTime_minusHour_NewYork_Autumn ComparisonFailure
  org.joda.time.TestDateTimeZoneCutover#test_DateTime_minusHour_Turk ComparisonFailure
  org.joda.time.TestDateTimeZoneCutover#test_DateTime_parse_Gaza AssertionFailedError
  org.joda.time.TestDateTimeZoneCutover#test_DateTime_parse_Turk AssertionFailedError
  org.joda.time.TestDateTimeZoneCutover#test_DateTime_plusDayMidGap_Gaza ComparisonFailure
  org.joda.time.TestDateTimeZoneCutover#test_DateTime_plusDayMidGap_Turk ComparisonFailure
  org.joda.time.TestDateTimeZoneCutover#test_DateTime_plusDay_Gaza ComparisonFailure
  org.joda.time.TestDateTimeZoneCutover#test_DateTime_plusDay_Turk ComparisonFailure
  org.joda.time.TestDateTimeZoneCutover#test_DateTime_plusHour_Gaza ComparisonFailure
  org.joda.time.TestDateTimeZoneCutover#test_DateTime_plusHour_Guatemata_Autumn ComparisonFailure
  org.joda.time.TestDateTimeZoneCutover#test_DateTime_plusHour_Moscow_Autumn ComparisonFailure
  org.joda.time.TestDateTimeZoneCutover#test_DateTime_plusHour_NewYork_Autumn ComparisonFailure
  org.joda.time.TestDateTimeZoneCutover#test_DateTime_plusHour_Turk ComparisonFailure
  org.joda.time.TestDateTimeZoneCutover#test_DateTime_roundCeiling_Gaza ComparisonFailure
  org.joda.time.TestDateTimeZoneCutover#test_DateTime_roundCeiling_Turk ComparisonFailure
  org.joda.time.TestDateTimeZoneCutover#test_DateTime_roundCeiling_day_NewYork_Autumn_postCutover ComparisonFailure
  org.joda.time.TestDateTimeZoneCutover#test_DateTime_roundCeiling_day_NewYork_Autumn_preCutover ComparisonFailure
  org.joda.time.TestDateTimeZoneCutover#test_DateTime_roundCeiling_day_NewYork_Spring_postCutover ComparisonFailure
  org.joda.time.TestDateTimeZoneCutover#test_DateTime_roundCeiling_day_NewYork_Spring_preCutover ComparisonFailure
  org.joda.time.TestDateTimeZoneCutover#test_DateTime_roundCeiling_hourOfDay_NewYork_Autumn_postCutover ComparisonFailure
  org.joda.time.TestDateTimeZoneCutover#test_DateTime_roundCeiling_hourOfDay_NewYork_Autumn_preCutover ComparisonFailure
  org.joda.time.TestDateTimeZoneCutover#test_DateTime_roundCeiling_hour_NewYork_Spring_postCutover ComparisonFailure
  org.joda.time.TestDateTimeZoneCutover#test_DateTime_roundCeiling_hour_NewYork_Spring_preCutover ComparisonFailure
  org.joda.time.TestDateTimeZoneCutover#test_DateTime_roundCeiling_minuteOfHour_NewYork_Autumn_postCutover ComparisonFailure
  org.joda.time.TestDateTimeZoneCutover#test_DateTime_roundCeiling_minuteOfHour_NewYork_Autumn_preCutover ComparisonFailure
  org.joda.time.TestDateTimeZoneCutover#test_DateTime_roundCeiling_minute_NewYork_Spring_postCutover ComparisonFailure
  org.joda.time.TestDateTimeZoneCutover#test_DateTime_roundCeiling_minute_NewYork_Spring_preCutover ComparisonFailure
  org.joda.time.TestDateTimeZoneCutover#test_DateTime_roundCeiling_secondOfMinute_NewYork_Autumn_postCutover ComparisonFailure
  org.joda.time.TestDateTimeZoneCutover#test_DateTime_roundCeiling_secondOfMinute_NewYork_Autumn_preCutover ComparisonFailure
  org.joda.time.TestDateTimeZoneCutover#test_DateTime_roundFloorNotDST_Turk ComparisonFailure
  org.joda.time.TestDateTimeZoneCutover#test_DateTime_roundFloor_Gaza ComparisonFailure
  org.joda.time.TestDateTimeZoneCutover#test_DateTime_roundFloor_Turk ComparisonFailure
  org.joda.time.TestDateTimeZoneCutover#test_DateTime_roundFloor_day_NewYork_Autumn_postCutover ComparisonFailure
  org.joda.time.TestDateTimeZoneCutover#test_DateTime_roundFloor_day_NewYork_Autumn_preCutover ComparisonFailure
  org.joda.time.TestDateTimeZoneCutover#test_DateTime_roundFloor_day_NewYork_Spring_postCutover ComparisonFailure
  org.joda.time.TestDateTimeZoneCutover#test_DateTime_roundFloor_day_NewYork_Spring_preCutover ComparisonFailure
  org.joda.time.TestDateTimeZoneCutover#test_DateTime_roundFloor_hourOfDay_NewYork_Autumn_postCutover ComparisonFailure
  org.joda.time.TestDateTimeZoneCutover#test_DateTime_roundFloor_hourOfDay_NewYork_Autumn_preCutover ComparisonFailure
  org.joda.time.TestDateTimeZoneCutover#test_DateTime_roundFloor_hour_NewYork_Spring_postCutover ComparisonFailure
  org.joda.time.TestDateTimeZoneCutover#test_DateTime_roundFloor_hour_NewYork_Spring_preCutover ComparisonFailure
  org.joda.time.TestDateTimeZoneCutover#test_DateTime_roundFloor_minuteOfHour_NewYork_Autumn_postCutover ComparisonFailure
  org.joda.time.TestDateTimeZoneCutover#test_DateTime_roundFloor_minuteOfHour_NewYork_Autumn_preCutover ComparisonFailure
  org.joda.time.TestDateTimeZoneCutover#test_DateTime_roundFloor_minute_NewYork_Spring_postCutover ComparisonFailure
  org.joda.time.TestDateTimeZoneCutover#test_DateTime_roundFloor_minute_NewYork_Spring_preCutover ComparisonFailure
  org.joda.time.TestDateTimeZoneCutover#test_DateTime_roundFloor_secondOfMinute_NewYork_Autumn_postCutover ComparisonFailure
  org.joda.time.TestDateTimeZoneCutover#test_DateTime_roundFloor_secondOfMinute_NewYork_Autumn_preCutover ComparisonFailure
  org.joda.time.TestDateTimeZoneCutover#test_DateTime_setHourAcross_Moscow_Spring ComparisonFailure
  org.joda.time.TestDateTimeZoneCutover#test_DateTime_setHourAcross_NewYork_Spring ComparisonFailure
  org.joda.time.TestDateTimeZoneCutover#test_DateTime_setHourBack_Moscow_Spring ComparisonFailure
  org.joda.time.TestDateTimeZoneCutover#test_DateTime_setHourBack_NewYork_Spring ComparisonFailure
  org.joda.time.TestDateTimeZoneCutover#test_DateTime_setHourForward_Moscow_Spring ComparisonFailure
  org.joda.time.TestDateTimeZoneCutover#test_DateTime_setHourForward_NewYork_Spring ComparisonFailure
  org.joda.time.TestDateTimeZoneCutover#test_DateTime_setHourZero_Gaza ComparisonFailure
  org.joda.time.TestDateTimeZoneCutover#test_DateTime_setHourZero_Turk ComparisonFailure
  org.joda.time.TestDateTimeZoneCutover#test_DateTime_withDay_Gaza ComparisonFailure
  org.joda.time.TestDateTimeZoneCutover#test_DateTime_withDay_Turk ComparisonFailure
  org.joda.time.TestDateTimeZoneCutover#test_DateTime_withHourZero_Gaza ComparisonFailure
  org.joda.time.TestDateTimeZoneCutover#test_DateTime_withHourZero_Turk ComparisonFailure
  org.joda.time.TestDateTimeZoneCutover#test_DateTime_withZoneRetainFields_Gaza ComparisonFailure
  org.joda.time.TestDateTimeZoneCutover#test_DateTime_withZoneRetainFields_Turk ComparisonFailure
  org.joda.time.TestDateTimeZoneCutover#test_GuatemataIsCorrect_Autumn ComparisonFailure
  org.joda.time.TestDateTimeZoneCutover#test_MockGazaIsCorrect ComparisonFailure
  org.joda.time.TestDateTimeZoneCutover#test_MockTurkIsCorrect ComparisonFailure
  org.joda.time.TestDateTimeZoneCutover#test_MoscowIsCorrect_Autumn ComparisonFailure
  org.joda.time.TestDateTimeZoneCutover#test_MoscowIsCorrect_Spring ComparisonFailure
  org.joda.time.TestDateTimeZoneCutover#test_MutableDateTime_setZoneRetainFields_Turk ComparisonFailure
  org.joda.time.TestDateTimeZoneCutover#test_MutableDateTime_withZoneRetainFields_Gaza ComparisonFailure
  org.joda.time.TestDateTimeZoneCutover#test_NewYorkIsCorrect_Autumn ComparisonFailure
  org.joda.time.TestDateTimeZoneCutover#test_NewYorkIsCorrect_Spring ComparisonFailure
  org.joda.time.TestDateTimeZoneCutover#test_RioBrancoIsCorrect_Spring ComparisonFailure
  org.joda.time.TestDateTimeZoneCutover#test_getOffsetFromLocal_Gaza ComparisonFailure
  org.joda.time.TestDateTimeZoneCutover#test_getOffsetFromLocal_Guatemata_Autumn ComparisonFailure
  org.joda.time.TestDateTimeZoneCutover#test_getOffsetFromLocal_Moscow_Autumn ComparisonFailure
  org.joda.time.TestDateTimeZoneCutover#test_getOffsetFromLocal_Moscow_Autumn_overlap_mins ComparisonFailure
  org.joda.time.TestDateTimeZoneCutover#test_getOffsetFromLocal_Moscow_Spring ComparisonFailure
  org.joda.time.TestDateTimeZoneCutover#test_getOffsetFromLocal_NewYork_Autumn ComparisonFailure
  org.joda.time.TestDateTimeZoneCutover#test_getOffsetFromLocal_NewYork_Spring ComparisonFailure
  org.joda.time.TestDateTimeZoneCutover#test_getOffsetFromLocal_RioBranco_Spring ComparisonFailure
  org.joda.time.TestDateTimeZoneCutover#test_getOffsetFromLocal_Turk ComparisonFailure
  org.joda.time.TestDateTime_Basics#testTest ComparisonFailure expected:<2002-06...
  org.joda.time.TestDateTime_Basics#testToString ComparisonFailure expected:<200...
  org.joda.time.TestDateTime_Constructors#testParse_formatter AssertionFailedError
  org.joda.time.TestDateTime_Constructors#testTest ComparisonFailure expected:<2...
  org.joda.time.TestDateTime_Properties#testPropertyWithMinimumValueMillisOfDayDSTGap ComparisonFailure
  org.joda.time.TestDateTime_Properties#testTest ComparisonFailure expected:<200...
  org.joda.time.TestDuration_Basics#testTest ComparisonFailure expected:<2002-06...
  org.joda.time.TestInstant_Basics#testTest ComparisonFailure expected:<2002-06-...
  org.joda.time.TestInstant_Basics#testToString ComparisonFailure expected:<2002...
  org.joda.time.TestInstant_Constructors#testParse_formatter AssertionFailedError
  org.joda.time.TestInterval_Basics#testTest ComparisonFailure expected:<2002-06...
  org.joda.time.TestInterval_Basics#testToString ComparisonFailure expected:<200...
  org.joda.time.TestMutableDateTime_Adds#testAddDays_int_dstOverlapSummer_addZero ComparisonFailure
  org.joda.time.TestMutableDateTime_Adds#testAddDays_int_dstOverlapWinter_addZero ComparisonFailure
  org.joda.time.TestMutableDateTime_Adds#testAddHours_int_dstOverlapSummer_addZero ComparisonFailure
  org.joda.time.TestMutableDateTime_Adds#testAddHours_int_dstOverlapWinter_addZero ComparisonFailure
  org.joda.time.TestMutableDateTime_Adds#testAddMillis_int_dstOverlapSummer_addZero ComparisonFailure
  org.joda.time.TestMutableDateTime_Adds#testAddMillis_int_dstOverlapWinter_addZero ComparisonFailure
  org.joda.time.TestMutableDateTime_Adds#testAddMinutes_int_dstOverlapSummer_addZero ComparisonFailure
  org.joda.time.TestMutableDateTime_Adds#testAddMinutes_int_dstOverlapWinter_addZero ComparisonFailure
  org.joda.time.TestMutableDateTime_Adds#testAddMonths_int_dstOverlapSummer_addZero ComparisonFailure
  org.joda.time.TestMutableDateTime_Adds#testAddMonths_int_dstOverlapWinter_addZero ComparisonFailure
  org.joda.time.TestMutableDateTime_Adds#testAddSeconds_int_dstOverlapSummer_addZero ComparisonFailure
  org.joda.time.TestMutableDateTime_Adds#testAddSeconds_int_dstOverlapWinter_addZero ComparisonFailure
  org.joda.time.TestMutableDateTime_Adds#testAddWeeks_int_dstOverlapSummer_addZero ComparisonFailure
  org.joda.time.TestMutableDateTime_Adds#testAddWeeks_int_dstOverlapWinter_addZero ComparisonFailure
  org.joda.time.TestMutableDateTime_Adds#testAddYears_int_dstOverlapSummer_addZero ComparisonFailure
  org.joda.time.TestMutableDateTime_Adds#testAddYears_int_dstOverlapWinter_addZero ComparisonFailure
  org.joda.time.TestMutableDateTime_Adds#testAdd_DurationFieldType_int_dstOverlapSummer_addZero ComparisonFailure
  org.joda.time.TestMutableDateTime_Adds#testAdd_DurationFieldType_int_dstOverlapWinter_addZero ComparisonFailure
  org.joda.time.TestMutableDateTime_Adds#testTest ComparisonFailure expected:<20...
  org.joda.time.TestMutableDateTime_Basics#testTest ComparisonFailure expected:<...
  org.joda.time.TestMutableDateTime_Basics#testToString ComparisonFailure expect...
  org.joda.time.TestMutableDateTime_Constructors#testParse_formatter AssertionFailedError
  org.joda.time.TestMutableDateTime_Constructors#testTest ComparisonFailure expe...
  org.joda.time.TestMutableDateTime_Properties#testTest ComparisonFailure expect...
  org.joda.time.TestMutableDateTime_Sets#testSetDayOfMonth_int_dstOverlapSummer_addZero ComparisonFailure
  org.joda.time.TestMutableDateTime_Sets#testSetDayOfMonth_int_dstOverlapWinter_addZero ComparisonFailure
  org.joda.time.TestMutableDateTime_Sets#testSetDayOfYear_int_dstOverlapSummer_addZero ComparisonFailure
  org.joda.time.TestMutableDateTime_Sets#testSetDayOfYear_int_dstOverlapWinter_addZero ComparisonFailure
  org.joda.time.TestMutableDateTime_Sets#testSetMonthOfYear_int_dstOverlapSummer_addZero ComparisonFailure
  org.joda.time.TestMutableDateTime_Sets#testSetMonthOfYear_int_dstOverlapWinter_addZero ComparisonFailure
  org.joda.time.TestMutableDateTime_Sets#testTest ComparisonFailure expected:<20...
  org.joda.time.TestMutableInterval_Basics#testTest ComparisonFailure expected:<...
  org.joda.time.TestMutableInterval_Basics#testToString ComparisonFailure expect...
  org.joda.time.TestMutableInterval_Constructors#testTest ComparisonFailure expe...
  org.joda.time.TestMutableInterval_Updates#testTest ComparisonFailure expected:...
  org.joda.time.TestMutablePeriod_Basics#testTest ComparisonFailure expected:<20...
  org.joda.time.TestMutablePeriod_Updates#testTest ComparisonFailure expected:<2...
  org.joda.time.TestPeriodType#testTest ComparisonFailure expected:<2002-06-09T0...
  org.joda.time.TestPeriod_Basics#testTest ComparisonFailure expected:<2002-06-0...
  org.joda.time.TestSerialization#testTest ComparisonFailure expected:<2002-06-0...
  org.joda.time.TestStringConvert#testDateMidnight ComparisonFailure expected:<2...
  org.joda.time.TestStringConvert#testDateTime ComparisonFailure expected:<2010-...
  org.joda.time.TestStringConvert#testMutableDateTime ComparisonFailure expected...
  org.joda.time.chrono.TestGJChronology#testParseEquivalence AssertionFailedError
  org.joda.time.chrono.TestGJChronology#testToString ComparisonFailure expected:...
  org.joda.time.chrono.TestLenientChronology#test_MockTurkIsCorrect ComparisonFailure
  org.joda.time.chrono.TestLenientChronology#test_lenientChrononolgy_Chicago ComparisonFailure
  org.joda.time.chrono.TestLenientChronology#test_lenientChrononolgy_Turk ComparisonFailure
  org.joda.time.convert.TestStringConverter#testGetDateTime4 AssertionFailedError
  org.joda.time.convert.TestStringConverter#testGetDateTime6 AssertionFailedError
  org.joda.time.convert.TestStringConverter#testGetInstantMillis_Object_Zone AssertionFailedError
  org.joda.time.format.TestDateTimeFormat#testFormatParse_textMonthAtEnd_France AssertionFailedError
  org.joda.time.format.TestDateTimeFormat#testFormatParse_textMonthAtEnd_France_withSpecifiedDefault AssertionFailedError
  org.joda.time.format.TestDateTimeFormat#testFormat_clockhourOfDay ComparisonFailure
  org.joda.time.format.TestDateTimeFormat#testFormat_clockhourOfHalfday ComparisonFailure
  org.joda.time.format.TestDateTimeFormat#testFormat_halfdayOfDay ComparisonFailure
  org.joda.time.format.TestDateTimeFormat#testFormat_hourOfDay ComparisonFailure
  org.joda.time.format.TestDateTimeFormat#testFormat_hourOfHalfday ComparisonFailure
  org.joda.time.format.TestDateTimeFormat#testFormat_samples ComparisonFailure e...
  org.joda.time.format.TestDateTimeFormat#testFormat_weekyearOfEra_twoDigit AssertionFailedError
  org.joda.time.format.TestDateTimeFormat#testFormat_yearOfEraParse AssertionFailedError
  org.joda.time.format.TestDateTimeFormat#testFormat_year_twoDigit AssertionFailedError
  org.joda.time.format.TestDateTimeFormat#testFormat_zoneAmount ComparisonFailure
  org.joda.time.format.TestDateTimeFormat#testFormat_zoneAmountColon ComparisonFailure
  org.joda.time.format.TestDateTimeFormat#testFormat_zoneAmountID ComparisonFailure
  org.joda.time.format.TestDateTimeFormat#testFormat_zoneLongText ComparisonFailure
  org.joda.time.format.TestDateTimeFormat#testFormat_zoneText ComparisonFailure ...
  org.joda.time.format.TestDateTimeFormatter#testParseDateTime_chrono AssertionFailedError
  org.joda.time.format.TestDateTimeFormatter#testParseDateTime_zone3 AssertionFailedError
  org.joda.time.format.TestDateTimeFormatter#testParseInto_chrono AssertionFailedError
  org.joda.time.format.TestDateTimeFormatter#testParseInto_monthDay_feb29_newYork AssertionFailedError
  org.joda.time.format.TestDateTimeFormatter#testParseInto_monthDay_feb29_newYork_endOfYear AssertionFailedError
  org.joda.time.format.TestDateTimeFormatter#testParseInto_monthDay_feb29_newYork_startOfYear AssertionFailedError
  org.joda.time.format.TestDateTimeFormatter#testParseInto_monthDay_feb29_tokyo AssertionFailedError
  org.joda.time.format.TestDateTimeFormatter#testParseInto_monthDay_feb29_tokyo_endOfYear AssertionFailedError
  org.joda.time.format.TestDateTimeFormatter#testParseInto_monthDay_feb29_tokyo_startOfYear AssertionFailedError
  org.joda.time.format.TestDateTimeFormatter#testParseInto_monthDay_withDefaultYear_feb29_newYork AssertionFailedError
  org.joda.time.format.TestDateTimeFormatter#testParseInto_monthDay_withDefaultYear_feb29_newYork_endOfYear AssertionFailedError
  org.joda.time.format.TestDateTimeFormatter#testParseInto_monthOnly_baseEndYear AssertionFailedError
  org.joda.time.format.TestDateTimeFormatter#testParseInto_monthOnly_baseStartYear AssertionFailedError
  org.joda.time.format.TestDateTimeFormatter#testParseInto_monthOnly_parseEndYear AssertionFailedError
  org.joda.time.format.TestDateTimeFormatter#testParseInto_monthOnly_parseStartYear AssertionFailedError
  org.joda.time.format.TestDateTimeFormatter#testParseInto_zone3 AssertionFailedError
  org.joda.time.format.TestDateTimeFormatter#testParseMillis_fractionOfSecondLong AssertionFailedError
  org.joda.time.format.TestDateTimeFormatter#testParseMutableDateTime_chrono AssertionFailedError
  org.joda.time.format.TestDateTimeFormatter#testParseMutableDateTime_zone3 AssertionFailedError
  org.joda.time.format.TestDateTimeFormatter#testPrint_appendableMethods ComparisonFailure
  org.joda.time.format.TestDateTimeFormatter#testPrint_bufferMethods ComparisonFailure
  org.joda.time.format.TestDateTimeFormatter#testPrint_chrono ComparisonFailure ...
  org.joda.time.format.TestDateTimeFormatter#testPrint_chrono_and_zone ComparisonFailure
  org.joda.time.format.TestDateTimeFormatter#testPrint_locale ComparisonFailure ...
  org.joda.time.format.TestDateTimeFormatter#testPrint_simple ComparisonFailure ...
  org.joda.time.format.TestDateTimeFormatter#testPrint_writerMethods ComparisonFailure
  org.joda.time.format.TestDateTimeFormatter#testPrint_zone ComparisonFailure ex...
  org.joda.time.format.TestDateTimeFormatter#testZoneNameNearTransition ComparisonFailure
  org.joda.time.format.TestDateTimeFormatter#testZoneShortNameNearTransition ComparisonFailure
  org.joda.time.format.TestDateTimeFormatterBuilder#test_appendOptional_Parser AssertionFailedError
  org.joda.time.format.TestDateTimeFormatterBuilder#test_appendTimeZoneId ComparisonFailure
  org.joda.time.format.TestDateTimeFormatterBuilder#test_appendTimeZoneOffset_print_min1max1 ComparisonFailure
  org.joda.time.format.TestDateTimeFormatterBuilder#test_appendTimeZoneOffset_print_min1max2 ComparisonFailure
  org.joda.time.format.TestDateTimeFormatterBuilder#test_appendTimeZoneOffset_print_min1max3 ComparisonFailure
  org.joda.time.format.TestDateTimeFormatterBuilder#test_appendTimeZoneOffset_print_min2max2 ComparisonFailure
  org.joda.time.format.TestDateTimeFormatterBuilder#test_appendTimeZoneOffset_print_min2max3 ComparisonFailure
  org.joda.time.format.TestDateTimeFormatterBuilder#test_appendTimeZoneOffset_print_min3max3 ComparisonFailure
  org.joda.time.format.TestDateTimeFormatterBuilder#test_append_Parser AssertionFailedError
  org.joda.time.format.TestDateTimeFormatterBuilder#test_localPrintParseOffset ComparisonFailure
  org.joda.time.format.TestDateTimeFormatterBuilder#test_localPrintParseOffsetAndZone ComparisonFailure
  org.joda.time.format.TestDateTimeFormatterBuilder#test_localPrintParseZoneTokyo ComparisonFailure
  org.joda.time.format.TestDateTimeFormatterBuilder#test_printParseOffset ComparisonFailure
  org.joda.time.format.TestDateTimeFormatterBuilder#test_printParseOffsetAndZone ComparisonFailure
  org.joda.time.format.TestDateTimeFormatterBuilder#test_printParseShortNameWithAutoLookup ComparisonFailure
  org.joda.time.format.TestDateTimeFormatterBuilder#test_printParseZoneBahiaBanderas ComparisonFailure
  org.joda.time.format.TestDateTimeFormatterBuilder#test_printParseZoneDawsonCreek ComparisonFailure
  org.joda.time.format.TestDateTimeFormatterBuilder#test_printParseZoneParis ComparisonFailure
  org.joda.time.format.TestDateTimeFormatterBuilder#test_printParseZoneTokyo ComparisonFailure
  org.joda.time.format.TestISODateTimeFormat#testFormat_basicDateTime ComparisonFailure
  org.joda.time.format.TestISODateTimeFormat#testFormat_basicDateTimeNoMillis ComparisonFailure
  org.joda.time.format.TestISODateTimeFormat#testFormat_basicOrdinalDateTime ComparisonFailure
  org.joda.time.format.TestISODateTimeFormat#testFormat_basicOrdinalDateTimeNoMillis ComparisonFailure
  org.joda.time.format.TestISODateTimeFormat#testFormat_basicTTime ComparisonFailure
  org.joda.time.format.TestISODateTimeFormat#testFormat_basicTTimeNoMillis ComparisonFailure
  org.joda.time.format.TestISODateTimeFormat#testFormat_basicTime ComparisonFailure
  org.joda.time.format.TestISODateTimeFormat#testFormat_basicTimeNoMillis ComparisonFailure
  org.joda.time.format.TestISODateTimeFormat#testFormat_basicWeekDateTime ComparisonFailure
  org.joda.time.format.TestISODateTimeFormat#testFormat_basicWeekDateTimeNoMillis ComparisonFailure
  org.joda.time.format.TestISODateTimeFormat#testFormat_dateHour ComparisonFailure
  org.joda.time.format.TestISODateTimeFormat#testFormat_dateHourMinute ComparisonFailure
  org.joda.time.format.TestISODateTimeFormat#testFormat_dateHourMinuteSecond ComparisonFailure
  org.joda.time.format.TestISODateTimeFormat#testFormat_dateHourMinuteSecondFraction ComparisonFailure
  org.joda.time.format.TestISODateTimeFormat#testFormat_dateHourMinuteSecondMillis ComparisonFailure
  org.joda.time.format.TestISODateTimeFormat#testFormat_dateTime ComparisonFailure
  org.joda.time.format.TestISODateTimeFormat#testFormat_dateTimeNoMillis ComparisonFailure
  org.joda.time.format.TestISODateTimeFormat#testFormat_hour ComparisonFailure e...
  org.joda.time.format.TestISODateTimeFormat#testFormat_hourMinute ComparisonFailure
  org.joda.time.format.TestISODateTimeFormat#testFormat_hourMinuteSecond ComparisonFailure
  org.joda.time.format.TestISODateTimeFormat#testFormat_hourMinuteSecondFraction ComparisonFailure
  org.joda.time.format.TestISODateTimeFormat#testFormat_hourMinuteSecondMillis ComparisonFailure
  org.joda.time.format.TestISODateTimeFormat#testFormat_ordinalDateTime ComparisonFailure
  org.joda.time.format.TestISODateTimeFormat#testFormat_ordinalDateTimeNoMillis ComparisonFailure
  org.joda.time.format.TestISODateTimeFormat#testFormat_tTime ComparisonFailure ...
  org.joda.time.format.TestISODateTimeFormat#testFormat_tTimeNoMillis ComparisonFailure
  org.joda.time.format.TestISODateTimeFormat#testFormat_time ComparisonFailure e...
  org.joda.time.format.TestISODateTimeFormat#testFormat_timeNoMillis ComparisonFailure
  org.joda.time.format.TestISODateTimeFormat#testFormat_weekDateTime ComparisonFailure
  org.joda.time.format.TestISODateTimeFormat#testFormat_weekDateTimeNoMillis ComparisonFailure
  org.joda.time.format.TestISODateTimeFormatParsing#test_localTimeParser AssertionFailedError
  org.joda.time.format.TestTextFields#testHalfdayNames ComparisonFailure expecte...
  org.joda.time.format.TestTextFields#testMonthNames_monthEnd ComparisonFailure ...
  org.joda.time.format.TestTextFields#testMonthNames_monthStart ComparisonFailure
  org.joda.time.format.TestTextFields#testWeekdayNames ComparisonFailure expecte...

Tests run: 4157, Failures: 275, Errors: 0, Skipped: 0

[INFO] ------------------------------------------------------------------------
[INFO] BUILD FAILURE
[INFO] ------------------------------------------------------------------------
[INFO] Total time: 15.525s
[INFO] Finished at: Thu Aug 06 06:24:04 BST 2015
[INFO] Final Memory: 9M/209M
[INFO] ------------------------------------------------------------------------
[ERROR] Failed to execute goal org.apache.maven.plugins:maven-surefire-plugin:2.18.1:test (default-test) on project joda-time: There are test failures.
[ERROR] 
[ERROR] Please refer to /home/perham/Study/LittleDarwin/Cases/joda-time-2.8.1/target/surefire-reports for the individual test results.
[ERROR] -> [Help 1]
[ERROR] 
[ERROR] To see the full stack trace of the errors, re-run Maven with the -e switch.
[ERROR] Re-run Maven using the -X switch to enable full debug logging.
[ERROR] 
[ERROR] For more information about the errors and possible solutions, please read the following articles:
[ERROR] [Help 1] http://cwiki.apache.org/confluence/display/MAVEN/MojoFailureException
