[INFO] Scanning for projects...
[INFO]                                                                         
[INFO] ------------------------------------------------------------------------
[INFO] Building Joda-Time 2.8.1
[INFO] ------------------------------------------------------------------------
[INFO] 
[INFO] --- maven-resources-plugin:2.7:resources (default-resources) @ joda-time ---
[INFO] Using 'UTF-8' encoding to copy filtered resources.
[INFO] Copying 2 resources to META-INF
[INFO] Copying 10 resources
[INFO] 
[INFO] --- maven-compiler-plugin:3.3:compile (default-compile) @ joda-time ---
[INFO] Changes detected - recompiling the module!
[INFO] Compiling 166 source files to /home/perham/Study/LittleDarwin/Cases/joda-time-2.8.1/target/classes
[INFO] 
[INFO] --- exec-maven-plugin:1.4.0:java (compile-tzdb) @ joda-time ---
Writing zoneinfo files
Writing ZoneInfoMap
[INFO] 
[INFO] --- maven-resources-plugin:2.7:testResources (default-testResources) @ joda-time ---
[INFO] Using 'UTF-8' encoding to copy filtered resources.
[INFO] Copying 34 resources
[INFO] 
[INFO] --- maven-compiler-plugin:3.3:testCompile (default-testCompile) @ joda-time ---
[INFO] Nothing to compile - all classes are up to date
[INFO] 
[INFO] --- maven-surefire-plugin:2.18.1:test (default-test) @ joda-time ---
[INFO] Surefire report directory: /home/perham/Study/LittleDarwin/Cases/joda-time-2.8.1/target/surefire-reports

-------------------------------------------------------
 T E S T S
-------------------------------------------------------
Running org.joda.time.TestAllPackages

TestBuddhistChronology.testCalendar

TestCopticChronology.testCalendar

TestEthiopicChronology.testCalendar

TestIslamicChronology.testCalendar

Testing Gregorian chronology over 1000 iterations
100% complete (i=1000)

Testing Julian chronology over 1000 iterations
100% complete (i=1000)
Writing zoneinfo files
Writing ZoneInfoMap
Tests run: 4157, Failures: 34, Errors: 1, Skipped: 0, Time elapsed: 5.299 sec <<< FAILURE! - in org.joda.time.TestAllPackages
testToString_String_Locale(org.joda.time.TestDateTime_Basics)  Time elapsed: 0.013 sec  <<< FAILURE!
junit.framework.ComparisonFailure: expected:<[dim.] 9/6> but was:<[Sun] 9/6>
	at junit.framework.Assert.assertEquals(Assert.java:81)
	at junit.framework.Assert.assertEquals(Assert.java:87)
	at org.joda.time.TestDateTime_Basics.testToString_String_Locale(TestDateTime_Basics.java:519)

testToString_String_String(org.joda.time.TestMutableDateTime_Basics)  Time elapsed: 0.001 sec  <<< FAILURE!
junit.framework.ComparisonFailure: expected:<[dim.] 9/6> but was:<[Sun] 9/6>
	at junit.framework.Assert.assertEquals(Assert.java:81)
	at junit.framework.Assert.assertEquals(Assert.java:87)
	at org.joda.time.TestMutableDateTime_Basics.testToString_String_String(TestMutableDateTime_Basics.java:423)

testToString_String_String(org.joda.time.TestDateMidnight_Basics)  Time elapsed: 0.001 sec  <<< FAILURE!
junit.framework.ComparisonFailure: expected:<[dim.] 9/6> but was:<[Sun] 9/6>
	at junit.framework.Assert.assertEquals(Assert.java:81)
	at junit.framework.Assert.assertEquals(Assert.java:87)
	at org.joda.time.TestDateMidnight_Basics.testToString_String_String(TestDateMidnight_Basics.java:457)

testToString_String_Locale(org.joda.time.TestLocalDateTime_Basics)  Time elapsed: 0 sec  <<< FAILURE!
junit.framework.ComparisonFailure: expected:<[mar.] 9/6> but was:<[Tue] 9/6>
	at junit.framework.Assert.assertEquals(Assert.java:81)
	at junit.framework.Assert.assertEquals(Assert.java:87)
	at org.joda.time.TestLocalDateTime_Basics.testToString_String_Locale(TestLocalDateTime_Basics.java:1086)

testToString_String_Locale(org.joda.time.TestLocalDate_Basics)  Time elapsed: 0 sec  <<< FAILURE!
junit.framework.ComparisonFailure: expected:<[mar.] 9/6> but was:<[Tue] 9/6>
	at junit.framework.Assert.assertEquals(Assert.java:81)
	at junit.framework.Assert.assertEquals(Assert.java:87)
	at org.joda.time.TestLocalDate_Basics.testToString_String_Locale(TestLocalDate_Basics.java:1140)

testPrint_locale(org.joda.time.format.TestDateTimeFormatter)  Time elapsed: 0.001 sec  <<< FAILURE!
junit.framework.ComparisonFailure: expected:<[mer.] 2004-06-09T10:20:30...> but was:<[Wed] 2004-06-09T10:20:30...>
	at junit.framework.Assert.assertEquals(Assert.java:81)
	at junit.framework.Assert.assertEquals(Assert.java:87)
	at org.joda.time.format.TestDateTimeFormatter.testPrint_locale(TestDateTimeFormatter.java:127)

testWithGetLocale(org.joda.time.format.TestDateTimeFormatter)  Time elapsed: 0 sec  <<< FAILURE!
junit.framework.AssertionFailedError: expected:<fr> but was:<null>
	at junit.framework.Assert.fail(Assert.java:47)
	at junit.framework.Assert.failNotEquals(Assert.java:280)
	at junit.framework.Assert.assertEquals(Assert.java:64)
	at junit.framework.Assert.assertEquals(Assert.java:71)
	at org.joda.time.format.TestDateTimeFormatter.testWithGetLocale(TestDateTimeFormatter.java:266)

testFormat_monthOfYearText(org.joda.time.format.TestDateTimeFormat)  Time elapsed: 0.001 sec  <<< FAILURE!
junit.framework.ComparisonFailure: 2004-06-09T19:20:30.040+09:00 expected:<[juin]> but was:<[June]>
	at junit.framework.Assert.assertEquals(Assert.java:81)
	at org.joda.time.format.TestDateTimeFormat.testFormat_monthOfYearText(TestDateTimeFormat.java:608)

testFormatParse_textMonthJanShort_France(org.joda.time.format.TestDateTimeFormat)  Time elapsed: 0 sec  <<< FAILURE!
junit.framework.ComparisonFailure: expected:<23 [janv.] 2007> but was:<23 [Jan] 2007>
	at junit.framework.Assert.assertEquals(Assert.java:81)
	at junit.framework.Assert.assertEquals(Assert.java:87)
	at org.joda.time.format.TestDateTimeFormat.testFormatParse_textMonthJanShort_France(TestDateTimeFormat.java:944)

testFormatParse_textMonthJanLong_France(org.joda.time.format.TestDateTimeFormat)  Time elapsed: 0 sec  <<< ERROR!
java.lang.IllegalArgumentException: Invalid format: "23 janvier 2007" is malformed at "vier 2007"
	at org.joda.time.format.DateTimeFormatter.parseDateTime(DateTimeFormatter.java:158)
	at org.joda.time.format.TestDateTimeFormat.testFormatParse_textMonthJanLong_France(TestDateTimeFormat.java:953)

testFormatParse_textMonthApr_France(org.joda.time.format.TestDateTimeFormat)  Time elapsed: 0.001 sec  <<< FAILURE!
junit.framework.ComparisonFailure: expected:<23 [févr.] 2007> but was:<23 [Feb] 2007>
	at junit.framework.Assert.assertEquals(Assert.java:81)
	at junit.framework.Assert.assertEquals(Assert.java:87)
	at org.joda.time.format.TestDateTimeFormat.testFormatParse_textMonthApr_France(TestDateTimeFormat.java:962)

testFormatParse_textMonthAtEnd_France(org.joda.time.format.TestDateTimeFormat)  Time elapsed: 0 sec  <<< FAILURE!
junit.framework.ComparisonFailure: expected:<23 [jui]n> but was:<23 [Ju]n>
	at junit.framework.Assert.assertEquals(Assert.java:81)
	at junit.framework.Assert.assertEquals(Assert.java:87)
	at org.joda.time.format.TestDateTimeFormat.testFormatParse_textMonthAtEnd_France(TestDateTimeFormat.java:972)

testFormatParse_textMonthAtEnd_France_withSpecifiedDefault(org.joda.time.format.TestDateTimeFormat)  Time elapsed: 0.001 sec  <<< FAILURE!
junit.framework.ComparisonFailure: expected:<23 [jui]n> but was:<23 [Ju]n>
	at junit.framework.Assert.assertEquals(Assert.java:81)
	at junit.framework.Assert.assertEquals(Assert.java:87)
	at org.joda.time.format.TestDateTimeFormat.testFormatParse_textMonthAtEnd_France_withSpecifiedDefault(TestDateTimeFormat.java:982)

testFormatParse_textEraAD_France(org.joda.time.format.TestDateTimeFormat)  Time elapsed: 0.001 sec  <<< FAILURE!
junit.framework.ComparisonFailure: expected:<$[ap. J.-C.]2007> but was:<$[AD]2007>
	at junit.framework.Assert.assertEquals(Assert.java:81)
	at junit.framework.Assert.assertEquals(Assert.java:87)
	at org.joda.time.format.TestDateTimeFormat.testFormatParse_textEraAD_France(TestDateTimeFormat.java:1055)

testFormat_dayOfWeekShortText(org.joda.time.format.TestDateTimeFormat)  Time elapsed: 0.001 sec  <<< FAILURE!
junit.framework.ComparisonFailure: 2004-06-09T19:20:30.040+09:00 expected:<[mer.]> but was:<[Wed]>
	at junit.framework.Assert.assertEquals(Assert.java:81)
	at org.joda.time.format.TestDateTimeFormat.testFormat_dayOfWeekShortText(TestDateTimeFormat.java:534)

testFormat_dayOfWeekText(org.joda.time.format.TestDateTimeFormat)  Time elapsed: 0.001 sec  <<< FAILURE!
junit.framework.ComparisonFailure: 2004-06-09T19:20:30.040+09:00 expected:<[mercredi]> but was:<[Wednesday]>
	at junit.framework.Assert.assertEquals(Assert.java:81)
	at org.joda.time.format.TestDateTimeFormat.testFormat_dayOfWeekText(TestDateTimeFormat.java:550)

testFormat_monthOfYearShortText(org.joda.time.format.TestDateTimeFormat)  Time elapsed: 0.001 sec  <<< FAILURE!
junit.framework.ComparisonFailure: 2004-06-09T19:20:30.040+09:00 expected:<[jui]n> but was:<[Ju]n>
	at junit.framework.Assert.assertEquals(Assert.java:81)
	at org.joda.time.format.TestDateTimeFormat.testFormat_monthOfYearShortText(TestDateTimeFormat.java:592)

testForStyle_shortDate(org.joda.time.format.TestDateTimeFormatStyle)  Time elapsed: 0.012 sec  <<< FAILURE!
junit.framework.ComparisonFailure: expected:<[6/9]/04> but was:<[09/06]/04>
	at junit.framework.Assert.assertEquals(Assert.java:81)
	at junit.framework.Assert.assertEquals(Assert.java:87)
	at org.joda.time.format.TestDateTimeFormatStyle.testForStyle_shortDate(TestDateTimeFormatStyle.java:135)

testForStyle_shortTime(org.joda.time.format.TestDateTimeFormatStyle)  Time elapsed: 0.002 sec  <<< FAILURE!
junit.framework.ComparisonFailure: expected:<10:20[ AM]> but was:<10:20[]>
	at junit.framework.Assert.assertEquals(Assert.java:81)
	at junit.framework.Assert.assertEquals(Assert.java:87)
	at org.joda.time.format.TestDateTimeFormatStyle.testForStyle_shortTime(TestDateTimeFormatStyle.java:152)

testForStyle_shortDateTime(org.joda.time.format.TestDateTimeFormatStyle)  Time elapsed: 0.002 sec  <<< FAILURE!
junit.framework.ComparisonFailure: expected:<[6/9/04 10:20 AM]> but was:<[09/06/04 10:20]>
	at junit.framework.Assert.assertEquals(Assert.java:81)
	at junit.framework.Assert.assertEquals(Assert.java:87)
	at org.joda.time.format.TestDateTimeFormatStyle.testForStyle_shortDateTime(TestDateTimeFormatStyle.java:173)

testForStyle_mediumDate(org.joda.time.format.TestDateTimeFormatStyle)  Time elapsed: 0.001 sec  <<< FAILURE!
junit.framework.ComparisonFailure: expected:<[Jun 9, ]2004> but was:<[09-Jun-]2004>
	at junit.framework.Assert.assertEquals(Assert.java:81)
	at junit.framework.Assert.assertEquals(Assert.java:87)
	at org.joda.time.format.TestDateTimeFormatStyle.testForStyle_mediumDate(TestDateTimeFormatStyle.java:191)

testForStyle_mediumTime(org.joda.time.format.TestDateTimeFormatStyle)  Time elapsed: 0.002 sec  <<< FAILURE!
junit.framework.ComparisonFailure: expected:<10:20:30[ AM]> but was:<10:20:30[]>
	at junit.framework.Assert.assertEquals(Assert.java:81)
	at junit.framework.Assert.assertEquals(Assert.java:87)
	at org.joda.time.format.TestDateTimeFormatStyle.testForStyle_mediumTime(TestDateTimeFormatStyle.java:204)

testForStyle_mediumDateTime(org.joda.time.format.TestDateTimeFormatStyle)  Time elapsed: 0.001 sec  <<< FAILURE!
junit.framework.ComparisonFailure: expected:<[Jun 9, 2004 10:20:30 AM]> but was:<[09-Jun-2004 10:20:30]>
	at junit.framework.Assert.assertEquals(Assert.java:81)
	at junit.framework.Assert.assertEquals(Assert.java:87)
	at org.joda.time.format.TestDateTimeFormatStyle.testForStyle_mediumDateTime(TestDateTimeFormatStyle.java:217)

testForStyle_longDate(org.joda.time.format.TestDateTimeFormatStyle)  Time elapsed: 0.001 sec  <<< FAILURE!
junit.framework.ComparisonFailure: expected:<[June 9,] 2004> but was:<[09 June] 2004>
	at junit.framework.Assert.assertEquals(Assert.java:81)
	at junit.framework.Assert.assertEquals(Assert.java:87)
	at org.joda.time.format.TestDateTimeFormatStyle.testForStyle_longDate(TestDateTimeFormatStyle.java:231)

testForStyle_longTime(org.joda.time.format.TestDateTimeFormatStyle)  Time elapsed: 0.002 sec  <<< FAILURE!
junit.framework.ComparisonFailure: expected:<10:20:30 [AM ]BST> but was:<10:20:30 []BST>
	at junit.framework.Assert.assertEquals(Assert.java:81)
	at junit.framework.Assert.assertEquals(Assert.java:87)
	at org.joda.time.format.TestDateTimeFormatStyle.testForStyle_longTime(TestDateTimeFormatStyle.java:244)

testForStyle_longDateTime(org.joda.time.format.TestDateTimeFormatStyle)  Time elapsed: 0.001 sec  <<< FAILURE!
junit.framework.ComparisonFailure: expected:<[June 9, 2004 10:20:30 AM] BST> but was:<[09 June 2004 10:20:30] BST>
	at junit.framework.Assert.assertEquals(Assert.java:81)
	at junit.framework.Assert.assertEquals(Assert.java:87)
	at org.joda.time.format.TestDateTimeFormatStyle.testForStyle_longDateTime(TestDateTimeFormatStyle.java:257)

testForStyle_fullDate(org.joda.time.format.TestDateTimeFormatStyle)  Time elapsed: 0.002 sec  <<< FAILURE!
junit.framework.ComparisonFailure: expected:<Wednesday, [June 9,] 2004> but was:<Wednesday, [9 June] 2004>
	at junit.framework.Assert.assertEquals(Assert.java:81)
	at junit.framework.Assert.assertEquals(Assert.java:87)
	at org.joda.time.format.TestDateTimeFormatStyle.testForStyle_fullDate(TestDateTimeFormatStyle.java:271)

testForStyle_fullTime(org.joda.time.format.TestDateTimeFormatStyle)  Time elapsed: 0.001 sec  <<< FAILURE!
junit.framework.ComparisonFailure: expected:<10:20:30 [AM] BST> but was:<10:20:30 [o'clock] BST>
	at junit.framework.Assert.assertEquals(Assert.java:81)
	at junit.framework.Assert.assertEquals(Assert.java:87)
	at org.joda.time.format.TestDateTimeFormatStyle.testForStyle_fullTime(TestDateTimeFormatStyle.java:284)

testForStyle_fullDateTime(org.joda.time.format.TestDateTimeFormatStyle)  Time elapsed: 0.002 sec  <<< FAILURE!
junit.framework.ComparisonFailure: expected:<Wednesday, [June 9, 2004 10:20:30 AM] BST> but was:<Wednesday, [9 June 2004 10:20:30 o'clock] BST>
	at junit.framework.Assert.assertEquals(Assert.java:81)
	at junit.framework.Assert.assertEquals(Assert.java:87)
	at org.joda.time.format.TestDateTimeFormatStyle.testForStyle_fullDateTime(TestDateTimeFormatStyle.java:297)

testForStyle_shortMediumDateTime(org.joda.time.format.TestDateTimeFormatStyle)  Time elapsed: 0.001 sec  <<< FAILURE!
junit.framework.ComparisonFailure: expected:<[6/9/04 10:20:30 AM]> but was:<[09/06/04 10:20:30]>
	at junit.framework.Assert.assertEquals(Assert.java:81)
	at junit.framework.Assert.assertEquals(Assert.java:87)
	at org.joda.time.format.TestDateTimeFormatStyle.testForStyle_shortMediumDateTime(TestDateTimeFormatStyle.java:309)

testForStyle_shortLongDateTime(org.joda.time.format.TestDateTimeFormatStyle)  Time elapsed: 0.001 sec  <<< FAILURE!
junit.framework.ComparisonFailure: expected:<[6/9/04 10:20:30 AM] BST> but was:<[09/06/04 10:20:30] BST>
	at junit.framework.Assert.assertEquals(Assert.java:81)
	at junit.framework.Assert.assertEquals(Assert.java:87)
	at org.joda.time.format.TestDateTimeFormatStyle.testForStyle_shortLongDateTime(TestDateTimeFormatStyle.java:320)

testForStyle_shortFullDateTime(org.joda.time.format.TestDateTimeFormatStyle)  Time elapsed: 0.002 sec  <<< FAILURE!
junit.framework.ComparisonFailure: expected:<[6/9/04 10:20:30 AM] BST> but was:<[09/06/04 10:20:30 o'clock] BST>
	at junit.framework.Assert.assertEquals(Assert.java:81)
	at junit.framework.Assert.assertEquals(Assert.java:87)
	at org.joda.time.format.TestDateTimeFormatStyle.testForStyle_shortFullDateTime(TestDateTimeFormatStyle.java:331)

testForStyle_mediumShortDateTime(org.joda.time.format.TestDateTimeFormatStyle)  Time elapsed: 0.001 sec  <<< FAILURE!
junit.framework.ComparisonFailure: expected:<[Jun 9, 2004 10:20 AM]> but was:<[09-Jun-2004 10:20]>
	at junit.framework.Assert.assertEquals(Assert.java:81)
	at junit.framework.Assert.assertEquals(Assert.java:87)
	at org.joda.time.format.TestDateTimeFormatStyle.testForStyle_mediumShortDateTime(TestDateTimeFormatStyle.java:343)

testForStyle_mediumLongDateTime(org.joda.time.format.TestDateTimeFormatStyle)  Time elapsed: 0.001 sec  <<< FAILURE!
junit.framework.ComparisonFailure: expected:<[Jun 9, 2004 10:20:30 AM] BST> but was:<[09-Jun-2004 10:20:30] BST>
	at junit.framework.Assert.assertEquals(Assert.java:81)
	at junit.framework.Assert.assertEquals(Assert.java:87)
	at org.joda.time.format.TestDateTimeFormatStyle.testForStyle_mediumLongDateTime(TestDateTimeFormatStyle.java:354)

testForStyle_mediumFullDateTime(org.joda.time.format.TestDateTimeFormatStyle)  Time elapsed: 0.001 sec  <<< FAILURE!
junit.framework.ComparisonFailure: expected:<[Jun 9, 2004 10:20:30 AM] BST> but was:<[09-Jun-2004 10:20:30 o'clock] BST>
	at junit.framework.Assert.assertEquals(Assert.java:81)
	at junit.framework.Assert.assertEquals(Assert.java:87)
	at org.joda.time.format.TestDateTimeFormatStyle.testForStyle_mediumFullDateTime(TestDateTimeFormatStyle.java:365)


Results :

Failed tests: 
  org.joda.time.TestDateMidnight_Basics#testToString_String_String ComparisonFailure
  org.joda.time.TestDateTime_Basics#testToString_String_Locale ComparisonFailure
  org.joda.time.TestLocalDateTime_Basics#testToString_String_Locale ComparisonFailure
  org.joda.time.TestLocalDate_Basics#testToString_String_Locale ComparisonFailure
  org.joda.time.TestMutableDateTime_Basics#testToString_String_String ComparisonFailure
  org.joda.time.format.TestDateTimeFormat#testFormatParse_textEraAD_France ComparisonFailure
  org.joda.time.format.TestDateTimeFormat#testFormatParse_textMonthApr_France ComparisonFailure
  org.joda.time.format.TestDateTimeFormat#testFormatParse_textMonthAtEnd_France ComparisonFailure
  org.joda.time.format.TestDateTimeFormat#testFormatParse_textMonthAtEnd_France_withSpecifiedDefault ComparisonFailure
  org.joda.time.format.TestDateTimeFormat#testFormatParse_textMonthJanShort_France ComparisonFailure
  org.joda.time.format.TestDateTimeFormat#testFormat_dayOfWeekShortText ComparisonFailure
  org.joda.time.format.TestDateTimeFormat#testFormat_dayOfWeekText ComparisonFailure
  org.joda.time.format.TestDateTimeFormat#testFormat_monthOfYearShortText ComparisonFailure
  org.joda.time.format.TestDateTimeFormat#testFormat_monthOfYearText ComparisonFailure
  org.joda.time.format.TestDateTimeFormatStyle#testForStyle_fullDate ComparisonFailure
  org.joda.time.format.TestDateTimeFormatStyle#testForStyle_fullDateTime ComparisonFailure
  org.joda.time.format.TestDateTimeFormatStyle#testForStyle_fullTime ComparisonFailure
  org.joda.time.format.TestDateTimeFormatStyle#testForStyle_longDate ComparisonFailure
  org.joda.time.format.TestDateTimeFormatStyle#testForStyle_longDateTime ComparisonFailure
  org.joda.time.format.TestDateTimeFormatStyle#testForStyle_longTime ComparisonFailure
  org.joda.time.format.TestDateTimeFormatStyle#testForStyle_mediumDate ComparisonFailure
  org.joda.time.format.TestDateTimeFormatStyle#testForStyle_mediumDateTime ComparisonFailure
  org.joda.time.format.TestDateTimeFormatStyle#testForStyle_mediumFullDateTime ComparisonFailure
  org.joda.time.format.TestDateTimeFormatStyle#testForStyle_mediumLongDateTime ComparisonFailure
  org.joda.time.format.TestDateTimeFormatStyle#testForStyle_mediumShortDateTime ComparisonFailure
  org.joda.time.format.TestDateTimeFormatStyle#testForStyle_mediumTime ComparisonFailure
  org.joda.time.format.TestDateTimeFormatStyle#testForStyle_shortDate ComparisonFailure
  org.joda.time.format.TestDateTimeFormatStyle#testForStyle_shortDateTime ComparisonFailure
  org.joda.time.format.TestDateTimeFormatStyle#testForStyle_shortFullDateTime ComparisonFailure
  org.joda.time.format.TestDateTimeFormatStyle#testForStyle_shortLongDateTime ComparisonFailure
  org.joda.time.format.TestDateTimeFormatStyle#testForStyle_shortMediumDateTime ComparisonFailure
  org.joda.time.format.TestDateTimeFormatStyle#testForStyle_shortTime ComparisonFailure
  org.joda.time.format.TestDateTimeFormatter#testPrint_locale ComparisonFailure ...
  org.joda.time.format.TestDateTimeFormatter#testWithGetLocale AssertionFailedError
Tests in error: 
  org.joda.time.format.TestDateTimeFormat#testFormatParse_textMonthJanLong_France IllegalArgumentException

Tests run: 4157, Failures: 34, Errors: 1, Skipped: 0

[INFO] ------------------------------------------------------------------------
[INFO] BUILD FAILURE
[INFO] ------------------------------------------------------------------------
[INFO] Total time: 15.603s
[INFO] Finished at: Thu Aug 06 06:35:15 BST 2015
[INFO] Final Memory: 8M/213M
[INFO] ------------------------------------------------------------------------
[ERROR] Failed to execute goal org.apache.maven.plugins:maven-surefire-plugin:2.18.1:test (default-test) on project joda-time: There are test failures.
[ERROR] 
[ERROR] Please refer to /home/perham/Study/LittleDarwin/Cases/joda-time-2.8.1/target/surefire-reports for the individual test results.
[ERROR] -> [Help 1]
[ERROR] 
[ERROR] To see the full stack trace of the errors, re-run Maven with the -e switch.
[ERROR] Re-run Maven using the -X switch to enable full debug logging.
[ERROR] 
[ERROR] For more information about the errors and possible solutions, please read the following articles:
[ERROR] [Help 1] http://cwiki.apache.org/confluence/display/MAVEN/MojoFailureException
