[INFO] Scanning for projects...
[INFO]                                                                         
[INFO] ------------------------------------------------------------------------
[INFO] Building Joda-Time 2.8.1
[INFO] ------------------------------------------------------------------------
[INFO] 
[INFO] --- maven-resources-plugin:2.7:resources (default-resources) @ joda-time ---
[INFO] Using 'UTF-8' encoding to copy filtered resources.
[INFO] Copying 2 resources to META-INF
[INFO] Copying 10 resources
[INFO] 
[INFO] --- maven-compiler-plugin:3.3:compile (default-compile) @ joda-time ---
[INFO] Changes detected - recompiling the module!
[INFO] Compiling 166 source files to /home/perham/Study/LittleDarwin/Cases/joda-time-2.8.1/target/classes
[INFO] 
[INFO] --- exec-maven-plugin:1.4.0:java (compile-tzdb) @ joda-time ---
Writing zoneinfo files
Writing ZoneInfoMap
[INFO] 
[INFO] --- maven-resources-plugin:2.7:testResources (default-testResources) @ joda-time ---
[INFO] Using 'UTF-8' encoding to copy filtered resources.
[INFO] Copying 34 resources
[INFO] 
[INFO] --- maven-compiler-plugin:3.3:testCompile (default-testCompile) @ joda-time ---
[INFO] Nothing to compile - all classes are up to date
[INFO] 
[INFO] --- maven-surefire-plugin:2.18.1:test (default-test) @ joda-time ---
[INFO] Surefire report directory: /home/perham/Study/LittleDarwin/Cases/joda-time-2.8.1/target/surefire-reports

-------------------------------------------------------
 T E S T S
-------------------------------------------------------
Running org.joda.time.TestAllPackages

TestBuddhistChronology.testCalendar

TestCopticChronology.testCalendar

TestEthiopicChronology.testCalendar

TestIslamicChronology.testCalendar

Testing Gregorian chronology over 1000 iterations
100% complete (i=1000)

Testing Julian chronology over 1000 iterations
100% complete (i=1000)
Writing zoneinfo files
Writing ZoneInfoMap
Tests run: 4157, Failures: 5, Errors: 33, Skipped: 0, Time elapsed: 5.422 sec <<< FAILURE! - in org.joda.time.TestAllPackages
testParse_noFormatter(org.joda.time.TestLocalDateTime_Constructors)  Time elapsed: 0.004 sec  <<< ERROR!
java.lang.NullPointerException
	at org.joda.time.format.DateTimeFormatter.parseLocalDateTime(DateTimeFormatter.java:138)
	at org.joda.time.LocalDateTime.parse(LocalDateTime.java:168)
	at org.joda.time.LocalDateTime.parse(LocalDateTime.java:157)
	at org.joda.time.TestLocalDateTime_Constructors.testParse_noFormatter(TestLocalDateTime_Constructors.java:95)

testParse_formatter(org.joda.time.TestLocalDateTime_Constructors)  Time elapsed: 0 sec  <<< ERROR!
java.lang.NullPointerException
	at org.joda.time.format.DateTimeFormatter.parseLocalDateTime(DateTimeFormatter.java:138)
	at org.joda.time.LocalDateTime.parse(LocalDateTime.java:168)
	at org.joda.time.TestLocalDateTime_Constructors.testParse_formatter(TestLocalDateTime_Constructors.java:101)

testParse_noFormatter(org.joda.time.TestLocalDate_Constructors)  Time elapsed: 0.001 sec  <<< ERROR!
java.lang.NullPointerException
	at org.joda.time.format.DateTimeFormatter.parseLocalDateTime(DateTimeFormatter.java:138)
	at org.joda.time.format.DateTimeFormatter.parseLocalDate(DateTimeFormatter.java:131)
	at org.joda.time.LocalDate.parse(LocalDate.java:179)
	at org.joda.time.LocalDate.parse(LocalDate.java:168)
	at org.joda.time.TestLocalDate_Constructors.testParse_noFormatter(TestLocalDate_Constructors.java:87)

testParse_formatter(org.joda.time.TestLocalDate_Constructors)  Time elapsed: 0 sec  <<< ERROR!
java.lang.NullPointerException
	at org.joda.time.format.DateTimeFormatter.parseLocalDateTime(DateTimeFormatter.java:138)
	at org.joda.time.format.DateTimeFormatter.parseLocalDate(DateTimeFormatter.java:131)
	at org.joda.time.LocalDate.parse(LocalDate.java:179)
	at org.joda.time.TestLocalDate_Constructors.testParse_formatter(TestLocalDate_Constructors.java:93)

testParse_noFormatter(org.joda.time.TestLocalTime_Constructors)  Time elapsed: 0 sec  <<< ERROR!
java.lang.NullPointerException
	at org.joda.time.format.DateTimeFormatter.parseLocalDateTime(DateTimeFormatter.java:138)
	at org.joda.time.format.DateTimeFormatter.parseLocalTime(DateTimeFormatter.java:132)
	at org.joda.time.LocalTime.parse(LocalTime.java:175)
	at org.joda.time.LocalTime.parse(LocalTime.java:164)
	at org.joda.time.TestLocalTime_Constructors.testParse_noFormatter(TestLocalTime_Constructors.java:113)

testParse_formatter(org.joda.time.TestLocalTime_Constructors)  Time elapsed: 0 sec  <<< ERROR!
java.lang.NullPointerException
	at org.joda.time.format.DateTimeFormatter.parseLocalDateTime(DateTimeFormatter.java:138)
	at org.joda.time.format.DateTimeFormatter.parseLocalTime(DateTimeFormatter.java:132)
	at org.joda.time.LocalTime.parse(LocalTime.java:175)
	at org.joda.time.TestLocalTime_Constructors.testParse_formatter(TestLocalTime_Constructors.java:119)

testParse_noFormatter(org.joda.time.TestYearMonth_Constructors)  Time elapsed: 0 sec  <<< ERROR!
java.lang.NullPointerException
	at org.joda.time.format.DateTimeFormatter.parseLocalDateTime(DateTimeFormatter.java:138)
	at org.joda.time.format.DateTimeFormatter.parseLocalDate(DateTimeFormatter.java:131)
	at org.joda.time.YearMonth.parse(YearMonth.java:152)
	at org.joda.time.YearMonth.parse(YearMonth.java:141)
	at org.joda.time.TestYearMonth_Constructors.testParse_noFormatter(TestYearMonth_Constructors.java:84)

testParse_formatter(org.joda.time.TestYearMonth_Constructors)  Time elapsed: 0.001 sec  <<< ERROR!
java.lang.NullPointerException
	at org.joda.time.format.DateTimeFormatter.parseLocalDateTime(DateTimeFormatter.java:138)
	at org.joda.time.format.DateTimeFormatter.parseLocalDate(DateTimeFormatter.java:131)
	at org.joda.time.YearMonth.parse(YearMonth.java:152)
	at org.joda.time.TestYearMonth_Constructors.testParse_formatter(TestYearMonth_Constructors.java:90)

testParse_noFormatter(org.joda.time.TestMonthDay_Constructors)  Time elapsed: 0 sec  <<< ERROR!
java.lang.NullPointerException
	at org.joda.time.format.DateTimeFormatter.parseLocalDateTime(DateTimeFormatter.java:138)
	at org.joda.time.format.DateTimeFormatter.parseLocalDate(DateTimeFormatter.java:131)
	at org.joda.time.MonthDay.parse(MonthDay.java:160)
	at org.joda.time.MonthDay.parse(MonthDay.java:149)
	at org.joda.time.TestMonthDay_Constructors.testParse_noFormatter(TestMonthDay_Constructors.java:82)

testParse_formatter(org.joda.time.TestMonthDay_Constructors)  Time elapsed: 0.003 sec  <<< ERROR!
java.lang.NullPointerException
	at org.joda.time.format.DateTimeFormatter.parseLocalDateTime(DateTimeFormatter.java:138)
	at org.joda.time.format.DateTimeFormatter.parseLocalDate(DateTimeFormatter.java:131)
	at org.joda.time.MonthDay.parse(MonthDay.java:160)
	at org.joda.time.TestMonthDay_Constructors.testParse_formatter(TestMonthDay_Constructors.java:90)

testLocalDateTime(org.joda.time.TestStringConvert)  Time elapsed: 0.002 sec  <<< ERROR!
java.lang.NullPointerException
	at org.joda.time.format.DateTimeFormatter.parseLocalDateTime(DateTimeFormatter.java:138)
	at org.joda.time.LocalDateTime.parse(LocalDateTime.java:168)
	at org.joda.time.LocalDateTime.parse(LocalDateTime.java:157)
	at sun.reflect.NativeMethodAccessorImpl.invoke0(Native Method)
	at sun.reflect.NativeMethodAccessorImpl.invoke(NativeMethodAccessorImpl.java:57)
	at sun.reflect.DelegatingMethodAccessorImpl.invoke(DelegatingMethodAccessorImpl.java:43)
	at java.lang.reflect.Method.invoke(Method.java:606)
	at org.joda.convert.MethodsStringConverter.convertFromString(MethodsStringConverter.java:70)
	at org.joda.convert.StringConvert.convertFromString(StringConvert.java:163)
	at org.joda.time.TestStringConvert.testLocalDateTime(TestStringConvert.java:78)

testLocalDate(org.joda.time.TestStringConvert)  Time elapsed: 0.003 sec  <<< ERROR!
java.lang.NullPointerException
	at org.joda.time.format.DateTimeFormatter.parseLocalDateTime(DateTimeFormatter.java:138)
	at org.joda.time.format.DateTimeFormatter.parseLocalDate(DateTimeFormatter.java:131)
	at org.joda.time.LocalDate.parse(LocalDate.java:179)
	at org.joda.time.LocalDate.parse(LocalDate.java:168)
	at sun.reflect.NativeMethodAccessorImpl.invoke0(Native Method)
	at sun.reflect.NativeMethodAccessorImpl.invoke(NativeMethodAccessorImpl.java:57)
	at sun.reflect.DelegatingMethodAccessorImpl.invoke(DelegatingMethodAccessorImpl.java:43)
	at java.lang.reflect.Method.invoke(Method.java:606)
	at org.joda.convert.MethodsStringConverter.convertFromString(MethodsStringConverter.java:70)
	at org.joda.convert.StringConvert.convertFromString(StringConvert.java:163)
	at org.joda.time.TestStringConvert.testLocalDate(TestStringConvert.java:85)

testLocalTime(org.joda.time.TestStringConvert)  Time elapsed: 0.002 sec  <<< ERROR!
java.lang.NullPointerException
	at org.joda.time.format.DateTimeFormatter.parseLocalDateTime(DateTimeFormatter.java:138)
	at org.joda.time.format.DateTimeFormatter.parseLocalTime(DateTimeFormatter.java:132)
	at org.joda.time.LocalTime.parse(LocalTime.java:175)
	at org.joda.time.LocalTime.parse(LocalTime.java:164)
	at sun.reflect.NativeMethodAccessorImpl.invoke0(Native Method)
	at sun.reflect.NativeMethodAccessorImpl.invoke(NativeMethodAccessorImpl.java:57)
	at sun.reflect.DelegatingMethodAccessorImpl.invoke(DelegatingMethodAccessorImpl.java:43)
	at java.lang.reflect.Method.invoke(Method.java:606)
	at org.joda.convert.MethodsStringConverter.convertFromString(MethodsStringConverter.java:70)
	at org.joda.convert.StringConvert.convertFromString(StringConvert.java:163)
	at org.joda.time.TestStringConvert.testLocalTime(TestStringConvert.java:92)

testYearMonth(org.joda.time.TestStringConvert)  Time elapsed: 0.001 sec  <<< ERROR!
java.lang.NullPointerException
	at org.joda.time.format.DateTimeFormatter.parseLocalDateTime(DateTimeFormatter.java:138)
	at org.joda.time.format.DateTimeFormatter.parseLocalDate(DateTimeFormatter.java:131)
	at org.joda.time.YearMonth.parse(YearMonth.java:152)
	at org.joda.time.YearMonth.parse(YearMonth.java:141)
	at sun.reflect.NativeMethodAccessorImpl.invoke0(Native Method)
	at sun.reflect.NativeMethodAccessorImpl.invoke(NativeMethodAccessorImpl.java:57)
	at sun.reflect.DelegatingMethodAccessorImpl.invoke(DelegatingMethodAccessorImpl.java:43)
	at java.lang.reflect.Method.invoke(Method.java:606)
	at org.joda.convert.MethodsStringConverter.convertFromString(MethodsStringConverter.java:70)
	at org.joda.convert.StringConvert.convertFromString(StringConvert.java:163)
	at org.joda.time.TestStringConvert.testYearMonth(TestStringConvert.java:99)

testMonthDay(org.joda.time.TestStringConvert)  Time elapsed: 0.002 sec  <<< ERROR!
java.lang.NullPointerException
	at org.joda.time.format.DateTimeFormatter.parseLocalDateTime(DateTimeFormatter.java:138)
	at org.joda.time.format.DateTimeFormatter.parseLocalDate(DateTimeFormatter.java:131)
	at org.joda.time.MonthDay.parse(MonthDay.java:160)
	at org.joda.time.MonthDay.parse(MonthDay.java:149)
	at sun.reflect.NativeMethodAccessorImpl.invoke0(Native Method)
	at sun.reflect.NativeMethodAccessorImpl.invoke(NativeMethodAccessorImpl.java:57)
	at sun.reflect.DelegatingMethodAccessorImpl.invoke(DelegatingMethodAccessorImpl.java:43)
	at java.lang.reflect.Method.invoke(Method.java:606)
	at org.joda.convert.MethodsStringConverter.convertFromString(MethodsStringConverter.java:70)
	at org.joda.convert.StringConvert.convertFromString(StringConvert.java:163)
	at org.joda.time.TestStringConvert.testMonthDay(TestStringConvert.java:106)

testMonthDay_leapDay(org.joda.time.TestStringConvert)  Time elapsed: 0.001 sec  <<< ERROR!
java.lang.NullPointerException
	at org.joda.time.format.DateTimeFormatter.parseLocalDateTime(DateTimeFormatter.java:138)
	at org.joda.time.format.DateTimeFormatter.parseLocalDate(DateTimeFormatter.java:131)
	at org.joda.time.MonthDay.parse(MonthDay.java:160)
	at org.joda.time.MonthDay.parse(MonthDay.java:149)
	at sun.reflect.NativeMethodAccessorImpl.invoke0(Native Method)
	at sun.reflect.NativeMethodAccessorImpl.invoke(NativeMethodAccessorImpl.java:57)
	at sun.reflect.DelegatingMethodAccessorImpl.invoke(DelegatingMethodAccessorImpl.java:43)
	at java.lang.reflect.Method.invoke(Method.java:606)
	at org.joda.convert.MethodsStringConverter.convertFromString(MethodsStringConverter.java:70)
	at org.joda.convert.StringConvert.convertFromString(StringConvert.java:163)
	at org.joda.time.TestStringConvert.testMonthDay_leapDay(TestStringConvert.java:113)

testParseLocalDate_simple(org.joda.time.format.TestDateTimeFormatter)  Time elapsed: 0 sec  <<< FAILURE!
junit.framework.AssertionFailedError: expected:<2004-06-09> but was:<2004-06-08>
	at junit.framework.Assert.fail(Assert.java:47)
	at junit.framework.Assert.failNotEquals(Assert.java:280)
	at junit.framework.Assert.assertEquals(Assert.java:64)
	at junit.framework.Assert.assertEquals(Assert.java:71)
	at org.joda.time.format.TestDateTimeFormatter.testParseLocalDate_simple(TestDateTimeFormatter.java:366)

testParseLocalDate_yearOfEra(org.joda.time.format.TestDateTimeFormatter)  Time elapsed: 0 sec  <<< ERROR!
java.lang.NullPointerException
	at org.joda.time.format.DateTimeFormatter.parseLocalDateTime(DateTimeFormatter.java:138)
	at org.joda.time.format.DateTimeFormatter.parseLocalDate(DateTimeFormatter.java:131)
	at org.joda.time.format.TestDateTimeFormatter.testParseLocalDate_yearOfEra(TestDateTimeFormatter.java:384)

testParseLocalDate_yearOfCentury(org.joda.time.format.TestDateTimeFormatter)  Time elapsed: 0.001 sec  <<< ERROR!
java.lang.NullPointerException
	at org.joda.time.format.DateTimeFormatter.parseLocalDateTime(DateTimeFormatter.java:138)
	at org.joda.time.format.DateTimeFormatter.parseLocalDate(DateTimeFormatter.java:131)
	at org.joda.time.format.TestDateTimeFormatter.testParseLocalDate_yearOfCentury(TestDateTimeFormatter.java:401)

testParseLocalDate_monthDay_feb29(org.joda.time.format.TestDateTimeFormatter)  Time elapsed: 0.001 sec  <<< ERROR!
java.lang.NullPointerException
	at org.joda.time.format.DateTimeFormatter.parseLocalDateTime(DateTimeFormatter.java:138)
	at org.joda.time.format.DateTimeFormatter.parseLocalDate(DateTimeFormatter.java:131)
	at org.joda.time.format.TestDateTimeFormatter.testParseLocalDate_monthDay_feb29(TestDateTimeFormatter.java:411)

testParseLocalDate_monthDay_withDefaultYear_feb29(org.joda.time.format.TestDateTimeFormatter)  Time elapsed: 0.001 sec  <<< ERROR!
java.lang.NullPointerException
	at org.joda.time.format.DateTimeFormatter.parseLocalDateTime(DateTimeFormatter.java:138)
	at org.joda.time.format.DateTimeFormatter.parseLocalDate(DateTimeFormatter.java:131)
	at org.joda.time.format.TestDateTimeFormatter.testParseLocalDate_monthDay_withDefaultYear_feb29(TestDateTimeFormatter.java:422)

testParseLocalDate_weekyear_month_week_2010(org.joda.time.format.TestDateTimeFormatter)  Time elapsed: 0 sec  <<< ERROR!
java.lang.NullPointerException
	at org.joda.time.format.DateTimeFormatter.parseLocalDateTime(DateTimeFormatter.java:138)
	at org.joda.time.format.DateTimeFormatter.parseLocalDate(DateTimeFormatter.java:131)
	at org.joda.time.format.TestDateTimeFormatter.testParseLocalDate_weekyear_month_week_2010(TestDateTimeFormatter.java:428)

testParseLocalDate_weekyear_month_week_2011(org.joda.time.format.TestDateTimeFormatter)  Time elapsed: 0.001 sec  <<< ERROR!
java.lang.NullPointerException
	at org.joda.time.format.DateTimeFormatter.parseLocalDateTime(DateTimeFormatter.java:138)
	at org.joda.time.format.DateTimeFormatter.parseLocalDate(DateTimeFormatter.java:131)
	at org.joda.time.format.TestDateTimeFormatter.testParseLocalDate_weekyear_month_week_2011(TestDateTimeFormatter.java:434)

testParseLocalDate_weekyear_month_week_2012(org.joda.time.format.TestDateTimeFormatter)  Time elapsed: 0.001 sec  <<< ERROR!
java.lang.NullPointerException
	at org.joda.time.format.DateTimeFormatter.parseLocalDateTime(DateTimeFormatter.java:138)
	at org.joda.time.format.DateTimeFormatter.parseLocalDate(DateTimeFormatter.java:131)
	at org.joda.time.format.TestDateTimeFormatter.testParseLocalDate_weekyear_month_week_2012(TestDateTimeFormatter.java:440)

testParseLocalDate_year_month_week_2010(org.joda.time.format.TestDateTimeFormatter)  Time elapsed: 0.001 sec  <<< ERROR!
java.lang.NullPointerException
	at org.joda.time.format.DateTimeFormatter.parseLocalDateTime(DateTimeFormatter.java:138)
	at org.joda.time.format.DateTimeFormatter.parseLocalDate(DateTimeFormatter.java:131)
	at org.joda.time.format.TestDateTimeFormatter.testParseLocalDate_year_month_week_2010(TestDateTimeFormatter.java:454)

testParseLocalDate_year_month_week_2011(org.joda.time.format.TestDateTimeFormatter)  Time elapsed: 0 sec  <<< ERROR!
java.lang.NullPointerException
	at org.joda.time.format.DateTimeFormatter.parseLocalDateTime(DateTimeFormatter.java:138)
	at org.joda.time.format.DateTimeFormatter.parseLocalDate(DateTimeFormatter.java:131)
	at org.joda.time.format.TestDateTimeFormatter.testParseLocalDate_year_month_week_2011(TestDateTimeFormatter.java:460)

testParseLocalDate_year_month_week_2012(org.joda.time.format.TestDateTimeFormatter)  Time elapsed: 0.001 sec  <<< ERROR!
java.lang.NullPointerException
	at org.joda.time.format.DateTimeFormatter.parseLocalDateTime(DateTimeFormatter.java:138)
	at org.joda.time.format.DateTimeFormatter.parseLocalDate(DateTimeFormatter.java:131)
	at org.joda.time.format.TestDateTimeFormatter.testParseLocalDate_year_month_week_2012(TestDateTimeFormatter.java:466)

testParseLocalDate_year_month_week_2013(org.joda.time.format.TestDateTimeFormatter)  Time elapsed: 0 sec  <<< ERROR!
java.lang.NullPointerException
	at org.joda.time.format.DateTimeFormatter.parseLocalDateTime(DateTimeFormatter.java:138)
	at org.joda.time.format.DateTimeFormatter.parseLocalDate(DateTimeFormatter.java:131)
	at org.joda.time.format.TestDateTimeFormatter.testParseLocalDate_year_month_week_2013(TestDateTimeFormatter.java:472)

testParseLocalDate_year_month_week_2014(org.joda.time.format.TestDateTimeFormatter)  Time elapsed: 0.001 sec  <<< ERROR!
java.lang.NullPointerException
	at org.joda.time.format.DateTimeFormatter.parseLocalDateTime(DateTimeFormatter.java:138)
	at org.joda.time.format.DateTimeFormatter.parseLocalDate(DateTimeFormatter.java:131)
	at org.joda.time.format.TestDateTimeFormatter.testParseLocalDate_year_month_week_2014(TestDateTimeFormatter.java:478)

testParseLocalDate_year_month_week_2015(org.joda.time.format.TestDateTimeFormatter)  Time elapsed: 0.001 sec  <<< ERROR!
java.lang.NullPointerException
	at org.joda.time.format.DateTimeFormatter.parseLocalDateTime(DateTimeFormatter.java:138)
	at org.joda.time.format.DateTimeFormatter.parseLocalDate(DateTimeFormatter.java:131)
	at org.joda.time.format.TestDateTimeFormatter.testParseLocalDate_year_month_week_2015(TestDateTimeFormatter.java:484)

testParseLocalDate_year_month_week_2016(org.joda.time.format.TestDateTimeFormatter)  Time elapsed: 0 sec  <<< ERROR!
java.lang.NullPointerException
	at org.joda.time.format.DateTimeFormatter.parseLocalDateTime(DateTimeFormatter.java:138)
	at org.joda.time.format.DateTimeFormatter.parseLocalDate(DateTimeFormatter.java:131)
	at org.joda.time.format.TestDateTimeFormatter.testParseLocalDate_year_month_week_2016(TestDateTimeFormatter.java:490)

testParseLocalTime_simple(org.joda.time.format.TestDateTimeFormatter)  Time elapsed: 0.001 sec  <<< FAILURE!
junit.framework.AssertionFailedError: expected:<10:20:30.000> but was:<16:20:30.000>
	at junit.framework.Assert.fail(Assert.java:47)
	at junit.framework.Assert.failNotEquals(Assert.java:280)
	at junit.framework.Assert.assertEquals(Assert.java:64)
	at junit.framework.Assert.assertEquals(Assert.java:71)
	at org.joda.time.format.TestDateTimeFormatter.testParseLocalTime_simple(TestDateTimeFormatter.java:496)

testParseLocalDateTime_simple(org.joda.time.format.TestDateTimeFormatter)  Time elapsed: 0.001 sec  <<< FAILURE!
junit.framework.AssertionFailedError: expected:<2004-06-09T10:20:30.000> but was:<2004-06-08T16:20:30.000>
	at junit.framework.Assert.fail(Assert.java:47)
	at junit.framework.Assert.failNotEquals(Assert.java:280)
	at junit.framework.Assert.assertEquals(Assert.java:64)
	at junit.framework.Assert.assertEquals(Assert.java:71)
	at org.joda.time.format.TestDateTimeFormatter.testParseLocalDateTime_simple(TestDateTimeFormatter.java:509)

testParseLocalDateTime_monthDay_feb29(org.joda.time.format.TestDateTimeFormatter)  Time elapsed: 0.001 sec  <<< ERROR!
java.lang.NullPointerException
	at org.joda.time.format.DateTimeFormatter.parseLocalDateTime(DateTimeFormatter.java:138)
	at org.joda.time.format.TestDateTimeFormatter.testParseLocalDateTime_monthDay_feb29(TestDateTimeFormatter.java:526)

testParseLocalDateTime_monthDay_withDefaultYear_feb29(org.joda.time.format.TestDateTimeFormatter)  Time elapsed: 0 sec  <<< ERROR!
java.lang.NullPointerException
	at org.joda.time.format.DateTimeFormatter.parseLocalDateTime(DateTimeFormatter.java:138)
	at org.joda.time.format.TestDateTimeFormatter.testParseLocalDateTime_monthDay_withDefaultYear_feb29(TestDateTimeFormatter.java:537)

test_localPrintParseZoneTokyo(org.joda.time.format.TestDateTimeFormatterBuilder)  Time elapsed: 0.001 sec  <<< ERROR!
java.lang.NullPointerException
	at org.joda.time.format.DateTimeFormatter.parseLocalDateTime(DateTimeFormatter.java:138)
	at org.joda.time.format.TestDateTimeFormatterBuilder.test_localPrintParseZoneTokyo(TestDateTimeFormatterBuilder.java:510)

test_localPrintParseOffset(org.joda.time.format.TestDateTimeFormatterBuilder)  Time elapsed: 0 sec  <<< FAILURE!
junit.framework.AssertionFailedError: expected:<2007-03-04T12:30:00.000> but was:<2007-03-04T03:30:00.000>
	at junit.framework.Assert.fail(Assert.java:47)
	at junit.framework.Assert.failNotEquals(Assert.java:280)
	at junit.framework.Assert.assertEquals(Assert.java:64)
	at junit.framework.Assert.assertEquals(Assert.java:71)
	at org.joda.time.format.TestDateTimeFormatterBuilder.test_localPrintParseOffset(TestDateTimeFormatterBuilder.java:522)

test_localParseWrongOffsetAndZone(org.joda.time.format.TestDateTimeFormatterBuilder)  Time elapsed: 0.002 sec  <<< FAILURE!
junit.framework.AssertionFailedError: expected:<2007-03-04T12:30:00.000> but was:<2007-03-04T14:30:00.000>
	at junit.framework.Assert.fail(Assert.java:47)
	at junit.framework.Assert.failNotEquals(Assert.java:280)
	at junit.framework.Assert.assertEquals(Assert.java:64)
	at junit.framework.Assert.assertEquals(Assert.java:71)
	at org.joda.time.format.TestDateTimeFormatterBuilder.test_localParseWrongOffsetAndZone(TestDateTimeFormatterBuilder.java:547)


Results :

Failed tests: 
  org.joda.time.format.TestDateTimeFormatter#testParseLocalDateTime_simple AssertionFailedError
  org.joda.time.format.TestDateTimeFormatter#testParseLocalDate_simple AssertionFailedError
  org.joda.time.format.TestDateTimeFormatter#testParseLocalTime_simple AssertionFailedError
  org.joda.time.format.TestDateTimeFormatterBuilder#test_localParseWrongOffsetAndZone AssertionFailedError
  org.joda.time.format.TestDateTimeFormatterBuilder#test_localPrintParseOffset AssertionFailedError
Tests in error: 
  org.joda.time.TestLocalDateTime_Constructors#testParse_formatter NullPointerException
  org.joda.time.TestLocalDateTime_Constructors#testParse_noFormatter NullPointerException
  org.joda.time.TestLocalDate_Constructors#testParse_formatter NullPointerException
  org.joda.time.TestLocalDate_Constructors#testParse_noFormatter NullPointerException
  org.joda.time.TestLocalTime_Constructors#testParse_formatter NullPointerException
  org.joda.time.TestLocalTime_Constructors#testParse_noFormatter NullPointerException
  org.joda.time.TestMonthDay_Constructors#testParse_formatter NullPointerException
  org.joda.time.TestMonthDay_Constructors#testParse_noFormatter NullPointerException
  org.joda.time.TestStringConvert#testLocalDate NullPointerException
  org.joda.time.TestStringConvert#testLocalDateTime NullPointerException
  org.joda.time.TestStringConvert#testLocalTime NullPointerException
  org.joda.time.TestStringConvert#testMonthDay NullPointerException
  org.joda.time.TestStringConvert#testMonthDay_leapDay NullPointerException
  org.joda.time.TestStringConvert#testYearMonth NullPointerException
  org.joda.time.TestYearMonth_Constructors#testParse_formatter NullPointerException
  org.joda.time.TestYearMonth_Constructors#testParse_noFormatter NullPointerException
  org.joda.time.format.TestDateTimeFormatter#testParseLocalDateTime_monthDay_feb29 NullPointerException
  org.joda.time.format.TestDateTimeFormatter#testParseLocalDateTime_monthDay_withDefaultYear_feb29 NullPointerException
  org.joda.time.format.TestDateTimeFormatter#testParseLocalDate_monthDay_feb29 NullPointerException
  org.joda.time.format.TestDateTimeFormatter#testParseLocalDate_monthDay_withDefaultYear_feb29 NullPointerException
  org.joda.time.format.TestDateTimeFormatter#testParseLocalDate_weekyear_month_week_2010 NullPointerException
  org.joda.time.format.TestDateTimeFormatter#testParseLocalDate_weekyear_month_week_2011 NullPointerException
  org.joda.time.format.TestDateTimeFormatter#testParseLocalDate_weekyear_month_week_2012 NullPointerException
  org.joda.time.format.TestDateTimeFormatter#testParseLocalDate_yearOfCentury NullPointerException
  org.joda.time.format.TestDateTimeFormatter#testParseLocalDate_yearOfEra NullPointerException
  org.joda.time.format.TestDateTimeFormatter#testParseLocalDate_year_month_week_2010 NullPointerException
  org.joda.time.format.TestDateTimeFormatter#testParseLocalDate_year_month_week_2011 NullPointerException
  org.joda.time.format.TestDateTimeFormatter#testParseLocalDate_year_month_week_2012 NullPointerException
  org.joda.time.format.TestDateTimeFormatter#testParseLocalDate_year_month_week_2013 NullPointerException
  org.joda.time.format.TestDateTimeFormatter#testParseLocalDate_year_month_week_2014 NullPointerException
  org.joda.time.format.TestDateTimeFormatter#testParseLocalDate_year_month_week_2015 NullPointerException
  org.joda.time.format.TestDateTimeFormatter#testParseLocalDate_year_month_week_2016 NullPointerException
  org.joda.time.format.TestDateTimeFormatterBuilder#test_localPrintParseZoneTokyo NullPointerException

Tests run: 4157, Failures: 5, Errors: 33, Skipped: 0

[INFO] ------------------------------------------------------------------------
[INFO] BUILD FAILURE
[INFO] ------------------------------------------------------------------------
[INFO] Total time: 15.461s
[INFO] Finished at: Thu Aug 06 06:27:51 BST 2015
[INFO] Final Memory: 7M/155M
[INFO] ------------------------------------------------------------------------
[ERROR] Failed to execute goal org.apache.maven.plugins:maven-surefire-plugin:2.18.1:test (default-test) on project joda-time: There are test failures.
[ERROR] 
[ERROR] Please refer to /home/perham/Study/LittleDarwin/Cases/joda-time-2.8.1/target/surefire-reports for the individual test results.
[ERROR] -> [Help 1]
[ERROR] 
[ERROR] To see the full stack trace of the errors, re-run Maven with the -e switch.
[ERROR] Re-run Maven using the -X switch to enable full debug logging.
[ERROR] 
[ERROR] For more information about the errors and possible solutions, please read the following articles:
[ERROR] [Help 1] http://cwiki.apache.org/confluence/display/MAVEN/MojoFailureException
