[INFO] Scanning for projects...
[INFO]                                                                         
[INFO] ------------------------------------------------------------------------
[INFO] Building Joda-Time 2.8.1
[INFO] ------------------------------------------------------------------------
[INFO] 
[INFO] --- maven-resources-plugin:2.7:resources (default-resources) @ joda-time ---
[INFO] Using 'UTF-8' encoding to copy filtered resources.
[INFO] Copying 2 resources to META-INF
[INFO] Copying 10 resources
[INFO] 
[INFO] --- maven-compiler-plugin:3.3:compile (default-compile) @ joda-time ---
[INFO] Changes detected - recompiling the module!
[INFO] Compiling 166 source files to /home/perham/Study/LittleDarwin/Cases/joda-time-2.8.1/target/classes
[INFO] 
[INFO] --- exec-maven-plugin:1.4.0:java (compile-tzdb) @ joda-time ---
Writing zoneinfo files
Writing ZoneInfoMap
[INFO] 
[INFO] --- maven-resources-plugin:2.7:testResources (default-testResources) @ joda-time ---
[INFO] Using 'UTF-8' encoding to copy filtered resources.
[INFO] Copying 34 resources
[INFO] 
[INFO] --- maven-compiler-plugin:3.3:testCompile (default-testCompile) @ joda-time ---
[INFO] Nothing to compile - all classes are up to date
[INFO] 
[INFO] --- maven-surefire-plugin:2.18.1:test (default-test) @ joda-time ---
[INFO] Surefire report directory: /home/perham/Study/LittleDarwin/Cases/joda-time-2.8.1/target/surefire-reports

-------------------------------------------------------
 T E S T S
-------------------------------------------------------
Running org.joda.time.TestAllPackages

TestBuddhistChronology.testCalendar

TestCopticChronology.testCalendar

TestEthiopicChronology.testCalendar

TestIslamicChronology.testCalendar

Testing Gregorian chronology over 1000 iterations
100% complete (i=1000)

Testing Julian chronology over 1000 iterations
100% complete (i=1000)
Writing zoneinfo files
Writing ZoneInfoMap
Tests run: 4157, Failures: 0, Errors: 24, Skipped: 0, Time elapsed: 5.234 sec <<< FAILURE! - in org.joda.time.TestAllPackages
testPropertyWithMaximumValueMillisOfDayDSTGap(org.joda.time.TestDateTime_Properties)  Time elapsed: 0.005 sec  <<< ERROR!
java.lang.IllegalArgumentException: Illegal pattern component: T
	at org.joda.time.format.DateTimeFormat.parsePatternTo(DateTimeFormat.java:124)
	at org.joda.time.format.DateTimeFormat.createFormatterForPattern(DateTimeFormat.java:155)
	at org.joda.time.format.DateTimeFormat.forPattern(DateTimeFormat.java:30)
	at org.joda.time.IllegalInstantException.createMessage(IllegalInstantException.java:67)
	at org.joda.time.IllegalInstantException.<init>(IllegalInstantException.java:63)
	at org.joda.time.chrono.ZonedChronology$ZonedDateTimeField.set(ZonedChronology.java:485)
	at org.joda.time.DateTime$Property.setCopy(DateTime.java:2220)
	at org.joda.time.DateTime$Property.withMaximumValue(DateTime.java:2281)
	at org.joda.time.TestDateTime_Properties.testPropertyWithMaximumValueMillisOfDayDSTGap(TestDateTime_Properties.java:650)

testPropertyWithMinimumValueMillisOfDayDSTGap(org.joda.time.TestDateTime_Properties)  Time elapsed: 0.002 sec  <<< ERROR!
java.lang.IllegalArgumentException: Illegal pattern component: T
	at org.joda.time.format.DateTimeFormat.parsePatternTo(DateTimeFormat.java:124)
	at org.joda.time.format.DateTimeFormat.createFormatterForPattern(DateTimeFormat.java:155)
	at org.joda.time.format.DateTimeFormat.forPattern(DateTimeFormat.java:30)
	at org.joda.time.IllegalInstantException.createMessage(IllegalInstantException.java:67)
	at org.joda.time.IllegalInstantException.<init>(IllegalInstantException.java:63)
	at org.joda.time.chrono.ZonedChronology$ZonedDateTimeField.set(ZonedChronology.java:485)
	at org.joda.time.DateTime$Property.setCopy(DateTime.java:2220)
	at org.joda.time.DateTime$Property.withMinimumValue(DateTime.java:2310)
	at org.joda.time.TestDateTime_Properties.testPropertyWithMinimumValueMillisOfDayDSTGap(TestDateTime_Properties.java:664)

testToDateTime_Zone_dstGap(org.joda.time.TestLocalDateTime_Basics)  Time elapsed: 0 sec  <<< ERROR!
java.lang.IllegalArgumentException: Illegal pattern component: T
	at org.joda.time.format.DateTimeFormat.parsePatternTo(DateTimeFormat.java:124)
	at org.joda.time.format.DateTimeFormat.createFormatterForPattern(DateTimeFormat.java:155)
	at org.joda.time.format.DateTimeFormat.forPattern(DateTimeFormat.java:30)
	at org.joda.time.IllegalInstantException.createMessage(IllegalInstantException.java:67)
	at org.joda.time.IllegalInstantException.<init>(IllegalInstantException.java:63)
	at org.joda.time.chrono.ZonedChronology.localToUTC(ZonedChronology.java:143)
	at org.joda.time.chrono.ZonedChronology.getDateTimeMillis(ZonedChronology.java:118)
	at org.joda.time.chrono.AssembledChronology.getDateTimeMillis(AssembledChronology.java:133)
	at org.joda.time.base.BaseDateTime.<init>(BaseDateTime.java:258)
	at org.joda.time.DateTime.<init>(DateTime.java:532)
	at org.joda.time.LocalDateTime.toDateTime(LocalDateTime.java:750)
	at org.joda.time.TestLocalDateTime_Basics.testToDateTime_Zone_dstGap(TestLocalDateTime_Basics.java:797)

testToDateTime_LocalTime_Zone_dstGap(org.joda.time.TestLocalDate_Basics)  Time elapsed: 0.001 sec  <<< ERROR!
java.lang.IllegalArgumentException: Illegal pattern component: T
	at org.joda.time.format.DateTimeFormat.parsePatternTo(DateTimeFormat.java:124)
	at org.joda.time.format.DateTimeFormat.createFormatterForPattern(DateTimeFormat.java:155)
	at org.joda.time.format.DateTimeFormat.forPattern(DateTimeFormat.java:30)
	at org.joda.time.IllegalInstantException.createMessage(IllegalInstantException.java:67)
	at org.joda.time.IllegalInstantException.<init>(IllegalInstantException.java:63)
	at org.joda.time.chrono.ZonedChronology.localToUTC(ZonedChronology.java:143)
	at org.joda.time.chrono.ZonedChronology.getDateTimeMillis(ZonedChronology.java:118)
	at org.joda.time.chrono.AssembledChronology.getDateTimeMillis(AssembledChronology.java:133)
	at org.joda.time.base.BaseDateTime.<init>(BaseDateTime.java:258)
	at org.joda.time.DateTime.<init>(DateTime.java:532)
	at org.joda.time.LocalDate.toDateTime(LocalDate.java:958)
	at org.joda.time.TestLocalDate_Basics.testToDateTime_LocalTime_Zone_dstGap(TestLocalDate_Basics.java:870)

testIsLocalDateTimeGap_Berlin(org.joda.time.TestDateTimeZone)  Time elapsed: 0.001 sec  <<< ERROR!
java.lang.IllegalArgumentException: Illegal pattern component: T
	at org.joda.time.format.DateTimeFormat.parsePatternTo(DateTimeFormat.java:124)
	at org.joda.time.format.DateTimeFormat.createFormatterForPattern(DateTimeFormat.java:155)
	at org.joda.time.format.DateTimeFormat.forPattern(DateTimeFormat.java:30)
	at org.joda.time.IllegalInstantException.createMessage(IllegalInstantException.java:67)
	at org.joda.time.IllegalInstantException.<init>(IllegalInstantException.java:63)
	at org.joda.time.chrono.ZonedChronology.localToUTC(ZonedChronology.java:143)
	at org.joda.time.chrono.ZonedChronology.getDateTimeMillis(ZonedChronology.java:118)
	at org.joda.time.chrono.AssembledChronology.getDateTimeMillis(AssembledChronology.java:133)
	at org.joda.time.base.BaseDateTime.<init>(BaseDateTime.java:258)
	at org.joda.time.DateTime.<init>(DateTime.java:532)
	at org.joda.time.LocalDateTime.toDateTime(LocalDateTime.java:750)
	at org.joda.time.DateTimeZone.isLocalDateTimeGap(DateTimeZone.java:1148)
	at org.joda.time.TestDateTimeZone.testIsLocalDateTimeGap_Berlin(TestDateTimeZone.java:934)

testIsLocalDateTimeGap_NewYork(org.joda.time.TestDateTimeZone)  Time elapsed: 0.001 sec  <<< ERROR!
java.lang.IllegalArgumentException: Illegal pattern component: T
	at org.joda.time.format.DateTimeFormat.parsePatternTo(DateTimeFormat.java:124)
	at org.joda.time.format.DateTimeFormat.createFormatterForPattern(DateTimeFormat.java:155)
	at org.joda.time.format.DateTimeFormat.forPattern(DateTimeFormat.java:30)
	at org.joda.time.IllegalInstantException.createMessage(IllegalInstantException.java:67)
	at org.joda.time.IllegalInstantException.<init>(IllegalInstantException.java:63)
	at org.joda.time.chrono.ZonedChronology.localToUTC(ZonedChronology.java:143)
	at org.joda.time.chrono.ZonedChronology.getDateTimeMillis(ZonedChronology.java:118)
	at org.joda.time.chrono.AssembledChronology.getDateTimeMillis(AssembledChronology.java:133)
	at org.joda.time.base.BaseDateTime.<init>(BaseDateTime.java:258)
	at org.joda.time.DateTime.<init>(DateTime.java:532)
	at org.joda.time.LocalDateTime.toDateTime(LocalDateTime.java:750)
	at org.joda.time.DateTimeZone.isLocalDateTimeGap(DateTimeZone.java:1148)
	at org.joda.time.TestDateTimeZone.testIsLocalDateTimeGap_NewYork(TestDateTimeZone.java:951)

test_DateTime_setHourForward_Moscow_Spring(org.joda.time.TestDateTimeZoneCutover)  Time elapsed: 0.001 sec  <<< ERROR!
java.lang.IllegalArgumentException: Illegal pattern component: T
	at org.joda.time.format.DateTimeFormat.parsePatternTo(DateTimeFormat.java:124)
	at org.joda.time.format.DateTimeFormat.createFormatterForPattern(DateTimeFormat.java:155)
	at org.joda.time.format.DateTimeFormat.forPattern(DateTimeFormat.java:30)
	at org.joda.time.IllegalInstantException.createMessage(IllegalInstantException.java:67)
	at org.joda.time.IllegalInstantException.<init>(IllegalInstantException.java:63)
	at org.joda.time.chrono.ZonedChronology$ZonedDateTimeField.set(ZonedChronology.java:485)
	at org.joda.time.DateTime$Property.setCopy(DateTime.java:2220)
	at org.joda.time.TestDateTimeZoneCutover.test_DateTime_setHourForward_Moscow_Spring(TestDateTimeZoneCutover.java:857)

test_DateTime_setHourBack_Moscow_Spring(org.joda.time.TestDateTimeZoneCutover)  Time elapsed: 0 sec  <<< ERROR!
java.lang.IllegalArgumentException: Illegal pattern component: T
	at org.joda.time.format.DateTimeFormat.parsePatternTo(DateTimeFormat.java:124)
	at org.joda.time.format.DateTimeFormat.createFormatterForPattern(DateTimeFormat.java:155)
	at org.joda.time.format.DateTimeFormat.forPattern(DateTimeFormat.java:30)
	at org.joda.time.IllegalInstantException.createMessage(IllegalInstantException.java:67)
	at org.joda.time.IllegalInstantException.<init>(IllegalInstantException.java:63)
	at org.joda.time.chrono.ZonedChronology$ZonedDateTimeField.set(ZonedChronology.java:485)
	at org.joda.time.DateTime$Property.setCopy(DateTime.java:2220)
	at org.joda.time.TestDateTimeZoneCutover.test_DateTime_setHourBack_Moscow_Spring(TestDateTimeZoneCutover.java:869)

test_DateTime_setHourZero_Gaza(org.joda.time.TestDateTimeZoneCutover)  Time elapsed: 0.001 sec  <<< ERROR!
java.lang.IllegalArgumentException: Illegal pattern component: T
	at org.joda.time.format.DateTimeFormat.parsePatternTo(DateTimeFormat.java:124)
	at org.joda.time.format.DateTimeFormat.createFormatterForPattern(DateTimeFormat.java:155)
	at org.joda.time.format.DateTimeFormat.forPattern(DateTimeFormat.java:30)
	at org.joda.time.IllegalInstantException.createMessage(IllegalInstantException.java:67)
	at org.joda.time.IllegalInstantException.<init>(IllegalInstantException.java:63)
	at org.joda.time.chrono.ZonedChronology$ZonedDateTimeField.set(ZonedChronology.java:485)
	at org.joda.time.DateTime$Property.setCopy(DateTime.java:2220)
	at org.joda.time.TestDateTimeZoneCutover.test_DateTime_setHourZero_Gaza(TestDateTimeZoneCutover.java:109)

test_DateTime_withHourZero_Gaza(org.joda.time.TestDateTimeZoneCutover)  Time elapsed: 0.001 sec  <<< ERROR!
java.lang.IllegalArgumentException: Illegal pattern component: T
	at org.joda.time.format.DateTimeFormat.parsePatternTo(DateTimeFormat.java:124)
	at org.joda.time.format.DateTimeFormat.createFormatterForPattern(DateTimeFormat.java:155)
	at org.joda.time.format.DateTimeFormat.forPattern(DateTimeFormat.java:30)
	at org.joda.time.IllegalInstantException.createMessage(IllegalInstantException.java:67)
	at org.joda.time.IllegalInstantException.<init>(IllegalInstantException.java:63)
	at org.joda.time.chrono.ZonedChronology$ZonedDateTimeField.set(ZonedChronology.java:485)
	at org.joda.time.DateTime.withHourOfDay(DateTime.java:1815)
	at org.joda.time.TestDateTimeZoneCutover.test_DateTime_withHourZero_Gaza(TestDateTimeZoneCutover.java:120)

test_DateTime_setHourForward_NewYork_Spring(org.joda.time.TestDateTimeZoneCutover)  Time elapsed: 0.001 sec  <<< ERROR!
java.lang.IllegalArgumentException: Illegal pattern component: T
	at org.joda.time.format.DateTimeFormat.parsePatternTo(DateTimeFormat.java:124)
	at org.joda.time.format.DateTimeFormat.createFormatterForPattern(DateTimeFormat.java:155)
	at org.joda.time.format.DateTimeFormat.forPattern(DateTimeFormat.java:30)
	at org.joda.time.IllegalInstantException.createMessage(IllegalInstantException.java:67)
	at org.joda.time.IllegalInstantException.<init>(IllegalInstantException.java:63)
	at org.joda.time.chrono.ZonedChronology$ZonedDateTimeField.set(ZonedChronology.java:485)
	at org.joda.time.DateTime$Property.setCopy(DateTime.java:2220)
	at org.joda.time.TestDateTimeZoneCutover.test_DateTime_setHourForward_NewYork_Spring(TestDateTimeZoneCutover.java:526)

test_DateTime_setHourBack_NewYork_Spring(org.joda.time.TestDateTimeZoneCutover)  Time elapsed: 0.001 sec  <<< ERROR!
java.lang.IllegalArgumentException: Illegal pattern component: T
	at org.joda.time.format.DateTimeFormat.parsePatternTo(DateTimeFormat.java:124)
	at org.joda.time.format.DateTimeFormat.createFormatterForPattern(DateTimeFormat.java:155)
	at org.joda.time.format.DateTimeFormat.forPattern(DateTimeFormat.java:30)
	at org.joda.time.IllegalInstantException.createMessage(IllegalInstantException.java:67)
	at org.joda.time.IllegalInstantException.<init>(IllegalInstantException.java:63)
	at org.joda.time.chrono.ZonedChronology$ZonedDateTimeField.set(ZonedChronology.java:485)
	at org.joda.time.DateTime$Property.setCopy(DateTime.java:2220)
	at org.joda.time.TestDateTimeZoneCutover.test_DateTime_setHourBack_NewYork_Spring(TestDateTimeZoneCutover.java:538)

test_LocalDate_toDateMidnight_Gaza(org.joda.time.TestDateTimeZoneCutover)  Time elapsed: 0.001 sec  <<< ERROR!
java.lang.IllegalArgumentException: Illegal pattern component: T
	at org.joda.time.format.DateTimeFormat.parsePatternTo(DateTimeFormat.java:124)
	at org.joda.time.format.DateTimeFormat.createFormatterForPattern(DateTimeFormat.java:155)
	at org.joda.time.format.DateTimeFormat.forPattern(DateTimeFormat.java:30)
	at org.joda.time.IllegalInstantException.createMessage(IllegalInstantException.java:67)
	at org.joda.time.IllegalInstantException.<init>(IllegalInstantException.java:63)
	at org.joda.time.chrono.ZonedChronology.localToUTC(ZonedChronology.java:143)
	at org.joda.time.chrono.ZonedChronology.getDateTimeMillis(ZonedChronology.java:118)
	at org.joda.time.chrono.AssembledChronology.getDateTimeMillis(AssembledChronology.java:133)
	at org.joda.time.base.BaseDateTime.<init>(BaseDateTime.java:258)
	at org.joda.time.DateMidnight.<init>(DateMidnight.java:350)
	at org.joda.time.LocalDate.toDateMidnight(LocalDate.java:867)
	at org.joda.time.TestDateTimeZoneCutover.test_LocalDate_toDateMidnight_Gaza(TestDateTimeZoneCutover.java:225)

test_DateTime_setHourZero_Turk(org.joda.time.TestDateTimeZoneCutover)  Time elapsed: 0.001 sec  <<< ERROR!
java.lang.IllegalArgumentException: Illegal pattern component: T
	at org.joda.time.format.DateTimeFormat.parsePatternTo(DateTimeFormat.java:124)
	at org.joda.time.format.DateTimeFormat.createFormatterForPattern(DateTimeFormat.java:155)
	at org.joda.time.format.DateTimeFormat.forPattern(DateTimeFormat.java:30)
	at org.joda.time.IllegalInstantException.createMessage(IllegalInstantException.java:67)
	at org.joda.time.IllegalInstantException.<init>(IllegalInstantException.java:63)
	at org.joda.time.chrono.ZonedChronology$ZonedDateTimeField.set(ZonedChronology.java:485)
	at org.joda.time.DateTime$Property.setCopy(DateTime.java:2220)
	at org.joda.time.TestDateTimeZoneCutover.test_DateTime_setHourZero_Turk(TestDateTimeZoneCutover.java:326)

test_DateTime_withHourZero_Turk(org.joda.time.TestDateTimeZoneCutover)  Time elapsed: 0 sec  <<< ERROR!
java.lang.IllegalArgumentException: Illegal pattern component: T
	at org.joda.time.format.DateTimeFormat.parsePatternTo(DateTimeFormat.java:124)
	at org.joda.time.format.DateTimeFormat.createFormatterForPattern(DateTimeFormat.java:155)
	at org.joda.time.format.DateTimeFormat.forPattern(DateTimeFormat.java:30)
	at org.joda.time.IllegalInstantException.createMessage(IllegalInstantException.java:67)
	at org.joda.time.IllegalInstantException.<init>(IllegalInstantException.java:63)
	at org.joda.time.chrono.ZonedChronology$ZonedDateTimeField.set(ZonedChronology.java:485)
	at org.joda.time.DateTime.withHourOfDay(DateTime.java:1815)
	at org.joda.time.TestDateTimeZoneCutover.test_DateTime_withHourZero_Turk(TestDateTimeZoneCutover.java:337)

test_LocalDate_toDateMidnight_Turk(org.joda.time.TestDateTimeZoneCutover)  Time elapsed: 0.001 sec  <<< ERROR!
java.lang.IllegalArgumentException: Illegal pattern component: T
	at org.joda.time.format.DateTimeFormat.parsePatternTo(DateTimeFormat.java:124)
	at org.joda.time.format.DateTimeFormat.createFormatterForPattern(DateTimeFormat.java:155)
	at org.joda.time.format.DateTimeFormat.forPattern(DateTimeFormat.java:30)
	at org.joda.time.IllegalInstantException.createMessage(IllegalInstantException.java:67)
	at org.joda.time.IllegalInstantException.<init>(IllegalInstantException.java:63)
	at org.joda.time.chrono.ZonedChronology.localToUTC(ZonedChronology.java:143)
	at org.joda.time.chrono.ZonedChronology.getDateTimeMillis(ZonedChronology.java:118)
	at org.joda.time.chrono.AssembledChronology.getDateTimeMillis(AssembledChronology.java:133)
	at org.joda.time.base.BaseDateTime.<init>(BaseDateTime.java:258)
	at org.joda.time.DateMidnight.<init>(DateMidnight.java:350)
	at org.joda.time.LocalDate.toDateMidnight(LocalDate.java:867)
	at org.joda.time.TestDateTimeZoneCutover.test_LocalDate_toDateMidnight_Turk(TestDateTimeZoneCutover.java:442)

test_DateTime_new_Turk(org.joda.time.TestDateTimeZoneCutover)  Time elapsed: 0 sec  <<< ERROR!
java.lang.IllegalArgumentException: Illegal pattern component: T
	at org.joda.time.format.DateTimeFormat.parsePatternTo(DateTimeFormat.java:124)
	at org.joda.time.format.DateTimeFormat.createFormatterForPattern(DateTimeFormat.java:155)
	at org.joda.time.format.DateTimeFormat.forPattern(DateTimeFormat.java:30)
	at org.joda.time.IllegalInstantException.createMessage(IllegalInstantException.java:67)
	at org.joda.time.IllegalInstantException.<init>(IllegalInstantException.java:63)
	at org.joda.time.chrono.ZonedChronology.localToUTC(ZonedChronology.java:143)
	at org.joda.time.chrono.ZonedChronology.getDateTimeMillis(ZonedChronology.java:118)
	at org.joda.time.chrono.AssembledChronology.getDateTimeMillis(AssembledChronology.java:133)
	at org.joda.time.base.BaseDateTime.<init>(BaseDateTime.java:258)
	at org.joda.time.base.BaseDateTime.<init>(BaseDateTime.java:227)
	at org.joda.time.DateTime.<init>(DateTime.java:503)
	at org.joda.time.TestDateTimeZoneCutover.test_DateTime_new_Turk(TestDateTimeZoneCutover.java:451)

test_DateTime_new_Gaza(org.joda.time.TestDateTimeZoneCutover)  Time elapsed: 0 sec  <<< ERROR!
java.lang.IllegalArgumentException: Illegal pattern component: T
	at org.joda.time.format.DateTimeFormat.parsePatternTo(DateTimeFormat.java:124)
	at org.joda.time.format.DateTimeFormat.createFormatterForPattern(DateTimeFormat.java:155)
	at org.joda.time.format.DateTimeFormat.forPattern(DateTimeFormat.java:30)
	at org.joda.time.IllegalInstantException.createMessage(IllegalInstantException.java:67)
	at org.joda.time.IllegalInstantException.<init>(IllegalInstantException.java:63)
	at org.joda.time.chrono.ZonedChronology.localToUTC(ZonedChronology.java:143)
	at org.joda.time.chrono.ZonedChronology.getDateTimeMillis(ZonedChronology.java:118)
	at org.joda.time.chrono.AssembledChronology.getDateTimeMillis(AssembledChronology.java:133)
	at org.joda.time.base.BaseDateTime.<init>(BaseDateTime.java:258)
	at org.joda.time.base.BaseDateTime.<init>(BaseDateTime.java:227)
	at org.joda.time.DateTime.<init>(DateTime.java:503)
	at org.joda.time.TestDateTimeZoneCutover.test_DateTime_new_Gaza(TestDateTimeZoneCutover.java:234)

testZoneTransition(org.joda.time.TestIllegalFieldValueException)  Time elapsed: 0.001 sec  <<< ERROR!
java.lang.IllegalArgumentException: Illegal pattern component: T
	at org.joda.time.format.DateTimeFormat.parsePatternTo(DateTimeFormat.java:124)
	at org.joda.time.format.DateTimeFormat.createFormatterForPattern(DateTimeFormat.java:155)
	at org.joda.time.format.DateTimeFormat.forPattern(DateTimeFormat.java:30)
	at org.joda.time.IllegalInstantException.createMessage(IllegalInstantException.java:67)
	at org.joda.time.IllegalInstantException.<init>(IllegalInstantException.java:63)
	at org.joda.time.chrono.ZonedChronology$ZonedDateTimeField.set(ZonedChronology.java:485)
	at org.joda.time.DateTime$Property.setCopy(DateTime.java:2220)
	at org.joda.time.TestIllegalFieldValueException.testZoneTransition(TestIllegalFieldValueException.java:197)

testFormat_other(org.joda.time.format.TestDateTimeFormat)  Time elapsed: 0 sec  <<< ERROR!
java.lang.IllegalArgumentException: Illegal pattern component: ll
	at org.joda.time.format.DateTimeFormat.parsePatternTo(DateTimeFormat.java:124)
	at org.joda.time.format.DateTimeFormat.createFormatterForPattern(DateTimeFormat.java:155)
	at org.joda.time.format.DateTimeFormat.forPattern(DateTimeFormat.java:30)
	at org.joda.time.format.TestDateTimeFormat.testFormat_other(TestDateTimeFormat.java:818)

testForStyle_fullDateTime(org.joda.time.format.TestDateTimeFormatStyle)  Time elapsed: 0.012 sec  <<< ERROR!
java.lang.IllegalArgumentException: Illegal pattern component: o
	at org.joda.time.format.DateTimeFormat.parsePatternTo(DateTimeFormat.java:124)
	at org.joda.time.format.DateTimeFormat.createFormatterForPattern(DateTimeFormat.java:155)
	at org.joda.time.format.DateTimeFormat.forPattern(DateTimeFormat.java:30)
	at org.joda.time.format.DateTimeFormat$StyleFormatter.getFormatter(DateTimeFormat.java:201)
	at org.joda.time.format.DateTimeFormat$StyleFormatter.printTo(DateTimeFormat.java:191)
	at org.joda.time.format.DateTimeFormatter.printTo(DateTimeFormatter.java:684)
	at org.joda.time.format.DateTimeFormatter.printTo(DateTimeFormatter.java:521)
	at org.joda.time.format.DateTimeFormatter.print(DateTimeFormatter.java:625)
	at org.joda.time.format.TestDateTimeFormatStyle.testForStyle_fullDateTime(TestDateTimeFormatStyle.java:295)

testForStyle_shortFullDateTime(org.joda.time.format.TestDateTimeFormatStyle)  Time elapsed: 0 sec  <<< ERROR!
java.lang.IllegalArgumentException: Illegal pattern component: o
	at org.joda.time.format.DateTimeFormat.parsePatternTo(DateTimeFormat.java:124)
	at org.joda.time.format.DateTimeFormat.createFormatterForPattern(DateTimeFormat.java:155)
	at org.joda.time.format.DateTimeFormat.forPattern(DateTimeFormat.java:30)
	at org.joda.time.format.DateTimeFormat$StyleFormatter.getFormatter(DateTimeFormat.java:201)
	at org.joda.time.format.DateTimeFormat$StyleFormatter.printTo(DateTimeFormat.java:191)
	at org.joda.time.format.DateTimeFormatter.printTo(DateTimeFormatter.java:684)
	at org.joda.time.format.DateTimeFormatter.printTo(DateTimeFormatter.java:521)
	at org.joda.time.format.DateTimeFormatter.print(DateTimeFormatter.java:625)
	at org.joda.time.format.TestDateTimeFormatStyle.testForStyle_shortFullDateTime(TestDateTimeFormatStyle.java:329)

testForStyle_mediumFullDateTime(org.joda.time.format.TestDateTimeFormatStyle)  Time elapsed: 0.001 sec  <<< ERROR!
java.lang.IllegalArgumentException: Illegal pattern component: o
	at org.joda.time.format.DateTimeFormat.parsePatternTo(DateTimeFormat.java:124)
	at org.joda.time.format.DateTimeFormat.createFormatterForPattern(DateTimeFormat.java:155)
	at org.joda.time.format.DateTimeFormat.forPattern(DateTimeFormat.java:30)
	at org.joda.time.format.DateTimeFormat$StyleFormatter.getFormatter(DateTimeFormat.java:201)
	at org.joda.time.format.DateTimeFormat$StyleFormatter.printTo(DateTimeFormat.java:191)
	at org.joda.time.format.DateTimeFormatter.printTo(DateTimeFormatter.java:684)
	at org.joda.time.format.DateTimeFormatter.printTo(DateTimeFormatter.java:521)
	at org.joda.time.format.DateTimeFormatter.print(DateTimeFormatter.java:625)
	at org.joda.time.format.TestDateTimeFormatStyle.testForStyle_mediumFullDateTime(TestDateTimeFormatStyle.java:363)

testForStyle_fullTime(org.joda.time.format.TestDateTimeFormatStyle)  Time elapsed: 0.001 sec  <<< ERROR!
java.lang.IllegalArgumentException: Illegal pattern component: o
	at org.joda.time.format.DateTimeFormat.parsePatternTo(DateTimeFormat.java:124)
	at org.joda.time.format.DateTimeFormat.createFormatterForPattern(DateTimeFormat.java:155)
	at org.joda.time.format.DateTimeFormat.forPattern(DateTimeFormat.java:30)
	at org.joda.time.format.DateTimeFormat$StyleFormatter.getFormatter(DateTimeFormat.java:201)
	at org.joda.time.format.DateTimeFormat$StyleFormatter.printTo(DateTimeFormat.java:191)
	at org.joda.time.format.DateTimeFormatter.printTo(DateTimeFormatter.java:684)
	at org.joda.time.format.DateTimeFormatter.printTo(DateTimeFormatter.java:521)
	at org.joda.time.format.DateTimeFormatter.print(DateTimeFormatter.java:625)
	at org.joda.time.format.TestDateTimeFormatStyle.testForStyle_fullTime(TestDateTimeFormatStyle.java:282)


Results :

Tests in error: 
  org.joda.time.TestDateTimeZone#testIsLocalDateTimeGap_Berlin IllegalArgumentException
  org.joda.time.TestDateTimeZone#testIsLocalDateTimeGap_NewYork IllegalArgumentException
  org.joda.time.TestDateTimeZoneCutover#test_DateTime_new_Gaza IllegalArgumentException
  org.joda.time.TestDateTimeZoneCutover#test_DateTime_new_Turk IllegalArgumentException
  org.joda.time.TestDateTimeZoneCutover#test_DateTime_setHourBack_Moscow_Spring IllegalArgumentException
  org.joda.time.TestDateTimeZoneCutover#test_DateTime_setHourBack_NewYork_Spring IllegalArgumentException
  org.joda.time.TestDateTimeZoneCutover#test_DateTime_setHourForward_Moscow_Spring IllegalArgumentException
  org.joda.time.TestDateTimeZoneCutover#test_DateTime_setHourForward_NewYork_Spring IllegalArgumentException
  org.joda.time.TestDateTimeZoneCutover#test_DateTime_setHourZero_Gaza IllegalArgumentException
  org.joda.time.TestDateTimeZoneCutover#test_DateTime_setHourZero_Turk IllegalArgumentException
  org.joda.time.TestDateTimeZoneCutover#test_DateTime_withHourZero_Gaza IllegalArgumentException
  org.joda.time.TestDateTimeZoneCutover#test_DateTime_withHourZero_Turk IllegalArgumentException
  org.joda.time.TestDateTimeZoneCutover#test_LocalDate_toDateMidnight_Gaza IllegalArgumentException
  org.joda.time.TestDateTimeZoneCutover#test_LocalDate_toDateMidnight_Turk IllegalArgumentException
  org.joda.time.TestDateTime_Properties#testPropertyWithMaximumValueMillisOfDayDSTGap IllegalArgumentException
  org.joda.time.TestDateTime_Properties#testPropertyWithMinimumValueMillisOfDayDSTGap IllegalArgumentException
  org.joda.time.TestIllegalFieldValueException#testZoneTransition IllegalArgumentException
  org.joda.time.TestLocalDateTime_Basics#testToDateTime_Zone_dstGap IllegalArgumentException
  org.joda.time.TestLocalDate_Basics#testToDateTime_LocalTime_Zone_dstGap IllegalArgumentException
  org.joda.time.format.TestDateTimeFormat#testFormat_other IllegalArgumentException
  org.joda.time.format.TestDateTimeFormatStyle#testForStyle_fullDateTime IllegalArgumentException
  org.joda.time.format.TestDateTimeFormatStyle#testForStyle_fullTime IllegalArgumentException
  org.joda.time.format.TestDateTimeFormatStyle#testForStyle_mediumFullDateTime IllegalArgumentException
  org.joda.time.format.TestDateTimeFormatStyle#testForStyle_shortFullDateTime IllegalArgumentException

Tests run: 4157, Failures: 0, Errors: 24, Skipped: 0

[INFO] ------------------------------------------------------------------------
[INFO] BUILD FAILURE
[INFO] ------------------------------------------------------------------------
[INFO] Total time: 15.537s
[INFO] Finished at: Thu Aug 06 06:22:37 BST 2015
[INFO] Final Memory: 8M/213M
[INFO] ------------------------------------------------------------------------
[ERROR] Failed to execute goal org.apache.maven.plugins:maven-surefire-plugin:2.18.1:test (default-test) on project joda-time: There are test failures.
[ERROR] 
[ERROR] Please refer to /home/perham/Study/LittleDarwin/Cases/joda-time-2.8.1/target/surefire-reports for the individual test results.
[ERROR] -> [Help 1]
[ERROR] 
[ERROR] To see the full stack trace of the errors, re-run Maven with the -e switch.
[ERROR] Re-run Maven using the -X switch to enable full debug logging.
[ERROR] 
[ERROR] For more information about the errors and possible solutions, please read the following articles:
[ERROR] [Help 1] http://cwiki.apache.org/confluence/display/MAVEN/MojoFailureException
