[INFO] Scanning for projects...
[INFO]                                                                         
[INFO] ------------------------------------------------------------------------
[INFO] Building Joda-Time 2.8.1
[INFO] ------------------------------------------------------------------------
[INFO] 
[INFO] --- maven-resources-plugin:2.7:resources (default-resources) @ joda-time ---
[INFO] Using 'UTF-8' encoding to copy filtered resources.
[INFO] Copying 2 resources to META-INF
[INFO] Copying 10 resources
[INFO] 
[INFO] --- maven-compiler-plugin:3.3:compile (default-compile) @ joda-time ---
[INFO] Changes detected - recompiling the module!
[INFO] Compiling 166 source files to /home/perham/Study/LittleDarwin/Cases/joda-time-2.8.1/target/classes
[INFO] 
[INFO] --- exec-maven-plugin:1.4.0:java (compile-tzdb) @ joda-time ---
Writing zoneinfo files
Writing ZoneInfoMap
[INFO] 
[INFO] --- maven-resources-plugin:2.7:testResources (default-testResources) @ joda-time ---
[INFO] Using 'UTF-8' encoding to copy filtered resources.
[INFO] Copying 34 resources
[INFO] 
[INFO] --- maven-compiler-plugin:3.3:testCompile (default-testCompile) @ joda-time ---
[INFO] Nothing to compile - all classes are up to date
[INFO] 
[INFO] --- maven-surefire-plugin:2.18.1:test (default-test) @ joda-time ---
[INFO] Surefire report directory: /home/perham/Study/LittleDarwin/Cases/joda-time-2.8.1/target/surefire-reports

-------------------------------------------------------
 T E S T S
-------------------------------------------------------
Running org.joda.time.TestAllPackages

TestBuddhistChronology.testCalendar

TestCopticChronology.testCalendar

TestEthiopicChronology.testCalendar

TestIslamicChronology.testCalendar

Testing Gregorian chronology over 1000 iterations
100% complete (i=1000)

Testing Julian chronology over 1000 iterations
100% complete (i=1000)
Writing zoneinfo files
Writing ZoneInfoMap
Tests run: 4157, Failures: 87, Errors: 163, Skipped: 0, Time elapsed: 5.352 sec <<< FAILURE! - in org.joda.time.TestAllPackages
testParse_formatter(org.joda.time.TestInstant_Constructors)  Time elapsed: 0.009 sec  <<< ERROR!
java.lang.IllegalArgumentException: Invalid format: "2010--30 06 13" is malformed at "--30 06 13"
	at org.joda.time.format.DateTimeFormatter.parseDateTime(DateTimeFormatter.java:899)
	at org.joda.time.Instant.parse(Instant.java:98)
	at org.joda.time.TestInstant_Constructors.testParse_formatter(TestInstant_Constructors.java:106)

testParse_formatter(org.joda.time.TestDateTime_Constructors)  Time elapsed: 0.001 sec  <<< ERROR!
java.lang.IllegalArgumentException: Invalid format: "2010--30 06 13" is malformed at "--30 06 13"
	at org.joda.time.format.DateTimeFormatter.parseDateTime(DateTimeFormatter.java:899)
	at org.joda.time.DateTime.parse(DateTime.java:160)
	at org.joda.time.TestDateTime_Constructors.testParse_formatter(TestDateTime_Constructors.java:178)

testToString_String(org.joda.time.TestDateTime_Basics)  Time elapsed: 0.006 sec  <<< FAILURE!
junit.framework.ComparisonFailure: expected:<2002[ 01]> but was:<2002[]>
	at junit.framework.Assert.assertEquals(Assert.java:81)
	at junit.framework.Assert.assertEquals(Assert.java:87)
	at org.joda.time.TestDateTime_Basics.testToString_String(TestDateTime_Basics.java:512)

testToString_String_Locale(org.joda.time.TestDateTime_Basics)  Time elapsed: 0.006 sec  <<< FAILURE!
junit.framework.ComparisonFailure: expected:<Sun[ 9/6]> but was:<Sun[]>
	at junit.framework.Assert.assertEquals(Assert.java:81)
	at junit.framework.Assert.assertEquals(Assert.java:87)
	at org.joda.time.TestDateTime_Basics.testToString_String_Locale(TestDateTime_Basics.java:518)

testToString_DTFormatter(org.joda.time.TestDateTime_Basics)  Time elapsed: 0.002 sec  <<< FAILURE!
junit.framework.ComparisonFailure: expected:<2002[ 00]> but was:<2002[]>
	at junit.framework.Assert.assertEquals(Assert.java:81)
	at junit.framework.Assert.assertEquals(Assert.java:87)
	at org.joda.time.TestDateTime_Basics.testToString_DTFormatter(TestDateTime_Basics.java:528)

testParse_formatter(org.joda.time.TestMutableDateTime_Constructors)  Time elapsed: 0.001 sec  <<< ERROR!
java.lang.IllegalArgumentException: Invalid format: "2010--30 06 13" is malformed at "--30 06 13"
	at org.joda.time.format.DateTimeFormatter.parseDateTime(DateTimeFormatter.java:899)
	at org.joda.time.MutableDateTime.parse(MutableDateTime.java:160)
	at org.joda.time.TestMutableDateTime_Constructors.testParse_formatter(TestMutableDateTime_Constructors.java:163)

testToString_String(org.joda.time.TestMutableDateTime_Basics)  Time elapsed: 0.001 sec  <<< FAILURE!
junit.framework.ComparisonFailure: expected:<2002[ 01]> but was:<2002[]>
	at junit.framework.Assert.assertEquals(Assert.java:81)
	at junit.framework.Assert.assertEquals(Assert.java:87)
	at org.joda.time.TestMutableDateTime_Basics.testToString_String(TestMutableDateTime_Basics.java:416)

testToString_DTFormatter(org.joda.time.TestMutableDateTime_Basics)  Time elapsed: 0 sec  <<< FAILURE!
junit.framework.ComparisonFailure: expected:<2002[ 01]> but was:<2002[]>
	at junit.framework.Assert.assertEquals(Assert.java:81)
	at junit.framework.Assert.assertEquals(Assert.java:87)
	at org.joda.time.TestMutableDateTime_Basics.testToString_DTFormatter(TestMutableDateTime_Basics.java:431)

testToString_String_String(org.joda.time.TestMutableDateTime_Basics)  Time elapsed: 0 sec  <<< FAILURE!
junit.framework.ComparisonFailure: expected:<Sun[ 9/6]> but was:<Sun[]>
	at junit.framework.Assert.assertEquals(Assert.java:81)
	at junit.framework.Assert.assertEquals(Assert.java:87)
	at org.joda.time.TestMutableDateTime_Basics.testToString_String_String(TestMutableDateTime_Basics.java:422)

testParse_formatter(org.joda.time.TestDateMidnight_Constructors)  Time elapsed: 0.001 sec  <<< ERROR!
java.lang.IllegalArgumentException: Invalid format: "2010--30 06" is malformed at "--30 06"
	at org.joda.time.format.DateTimeFormatter.parseDateTime(DateTimeFormatter.java:899)
	at org.joda.time.DateMidnight.parse(DateMidnight.java:152)
	at org.joda.time.TestDateMidnight_Constructors.testParse_formatter(TestDateMidnight_Constructors.java:179)

testToString_String(org.joda.time.TestDateMidnight_Basics)  Time elapsed: 0.001 sec  <<< FAILURE!
junit.framework.ComparisonFailure: expected:<2002[ 00]> but was:<2002[]>
	at junit.framework.Assert.assertEquals(Assert.java:81)
	at junit.framework.Assert.assertEquals(Assert.java:87)
	at org.joda.time.TestDateMidnight_Basics.testToString_String(TestDateMidnight_Basics.java:450)

testToString_DTFormatter(org.joda.time.TestDateMidnight_Basics)  Time elapsed: 0.001 sec  <<< FAILURE!
junit.framework.ComparisonFailure: expected:<2002[ 00]> but was:<2002[]>
	at junit.framework.Assert.assertEquals(Assert.java:81)
	at junit.framework.Assert.assertEquals(Assert.java:87)
	at org.joda.time.TestDateMidnight_Basics.testToString_DTFormatter(TestDateMidnight_Basics.java:465)

testToString_String_String(org.joda.time.TestDateMidnight_Basics)  Time elapsed: 0 sec  <<< FAILURE!
junit.framework.ComparisonFailure: expected:<Sun[ 9/6]> but was:<Sun[]>
	at junit.framework.Assert.assertEquals(Assert.java:81)
	at junit.framework.Assert.assertEquals(Assert.java:87)
	at org.joda.time.TestDateMidnight_Basics.testToString_String_String(TestDateMidnight_Basics.java:456)

testParse_formatter(org.joda.time.TestLocalDateTime_Constructors)  Time elapsed: 0.001 sec  <<< ERROR!
java.lang.IllegalArgumentException: Invalid format: "2010--30 06 13" is malformed at "--30 06 13"
	at org.joda.time.format.DateTimeFormatter.parseLocalDateTime(DateTimeFormatter.java:854)
	at org.joda.time.LocalDateTime.parse(LocalDateTime.java:168)
	at org.joda.time.TestLocalDateTime_Constructors.testParse_formatter(TestLocalDateTime_Constructors.java:101)

testToString_String(org.joda.time.TestLocalDateTime_Basics)  Time elapsed: 0 sec  <<< FAILURE!
junit.framework.ComparisonFailure: expected:<2002[ 10]> but was:<2002[]>
	at junit.framework.Assert.assertEquals(Assert.java:81)
	at junit.framework.Assert.assertEquals(Assert.java:87)
	at org.joda.time.TestLocalDateTime_Basics.testToString_String(TestLocalDateTime_Basics.java:1078)

testToString_String_Locale(org.joda.time.TestLocalDateTime_Basics)  Time elapsed: 0.001 sec  <<< FAILURE!
junit.framework.ComparisonFailure: expected:<Tue[ 9/6]> but was:<Tue[]>
	at junit.framework.Assert.assertEquals(Assert.java:81)
	at junit.framework.Assert.assertEquals(Assert.java:87)
	at org.joda.time.TestLocalDateTime_Basics.testToString_String_Locale(TestLocalDateTime_Basics.java:1085)

testToString_DTFormatter(org.joda.time.TestLocalDateTime_Basics)  Time elapsed: 0.001 sec  <<< FAILURE!
junit.framework.ComparisonFailure: expected:<2002[ 10]> but was:<2002[]>
	at junit.framework.Assert.assertEquals(Assert.java:81)
	at junit.framework.Assert.assertEquals(Assert.java:87)
	at org.joda.time.TestLocalDateTime_Basics.testToString_DTFormatter(TestLocalDateTime_Basics.java:1095)

testParse_formatter(org.joda.time.TestLocalDate_Constructors)  Time elapsed: 0.001 sec  <<< ERROR!
java.lang.IllegalArgumentException: Invalid format: "2010--30 06" is malformed at "--30 06"
	at org.joda.time.format.DateTimeFormatter.parseLocalDateTime(DateTimeFormatter.java:854)
	at org.joda.time.format.DateTimeFormatter.parseLocalDate(DateTimeFormatter.java:798)
	at org.joda.time.LocalDate.parse(LocalDate.java:179)
	at org.joda.time.TestLocalDate_Constructors.testParse_formatter(TestLocalDate_Constructors.java:93)

testToString_String(org.joda.time.TestLocalDate_Basics)  Time elapsed: 0.001 sec  <<< FAILURE!
junit.framework.ComparisonFailure: expected:<2002[ ��]> but was:<2002[]>
	at junit.framework.Assert.assertEquals(Assert.java:81)
	at junit.framework.Assert.assertEquals(Assert.java:87)
	at org.joda.time.TestLocalDate_Basics.testToString_String(TestLocalDate_Basics.java:1132)

testToString_String_Locale(org.joda.time.TestLocalDate_Basics)  Time elapsed: 0 sec  <<< FAILURE!
junit.framework.ComparisonFailure: expected:<Tue[ 9/6]> but was:<Tue[]>
	at junit.framework.Assert.assertEquals(Assert.java:81)
	at junit.framework.Assert.assertEquals(Assert.java:87)
	at org.joda.time.TestLocalDate_Basics.testToString_String_Locale(TestLocalDate_Basics.java:1139)

testToString_DTFormatter(org.joda.time.TestLocalDate_Basics)  Time elapsed: 0.002 sec  <<< FAILURE!
junit.framework.ComparisonFailure: expected:<2002[ ��]> but was:<2002[]>
	at junit.framework.Assert.assertEquals(Assert.java:81)
	at junit.framework.Assert.assertEquals(Assert.java:87)
	at org.joda.time.TestLocalDate_Basics.testToString_DTFormatter(TestLocalDate_Basics.java:1149)

testParse_formatter(org.joda.time.TestLocalTime_Constructors)  Time elapsed: 0.001 sec  <<< ERROR!
java.lang.IllegalArgumentException: Invalid format: "13 30" is malformed at " 30"
	at org.joda.time.format.DateTimeFormatter.parseLocalDateTime(DateTimeFormatter.java:854)
	at org.joda.time.format.DateTimeFormatter.parseLocalTime(DateTimeFormatter.java:816)
	at org.joda.time.LocalTime.parse(LocalTime.java:175)
	at org.joda.time.TestLocalTime_Constructors.testParse_formatter(TestLocalTime_Constructors.java:119)

testToString_String(org.joda.time.TestLocalTime_Basics)  Time elapsed: 0.001 sec  <<< FAILURE!
junit.framework.ComparisonFailure: expected:<����[ 10]> but was:<����[]>
	at junit.framework.Assert.assertEquals(Assert.java:81)
	at junit.framework.Assert.assertEquals(Assert.java:87)
	at org.joda.time.TestLocalTime_Basics.testToString_String(TestLocalTime_Basics.java:792)

testToString_String_Locale(org.joda.time.TestLocalTime_Basics)  Time elapsed: 0.001 sec  <<< FAILURE!
junit.framework.ComparisonFailure: expected:<10[ 20]> but was:<10[]>
	at junit.framework.Assert.assertEquals(Assert.java:81)
	at junit.framework.Assert.assertEquals(Assert.java:87)
	at org.joda.time.TestLocalTime_Basics.testToString_String_Locale(TestLocalTime_Basics.java:799)

testToString_DTFormatter(org.joda.time.TestLocalTime_Basics)  Time elapsed: 0 sec  <<< FAILURE!
junit.framework.ComparisonFailure: expected:<����[ 10]> but was:<����[]>
	at junit.framework.Assert.assertEquals(Assert.java:81)
	at junit.framework.Assert.assertEquals(Assert.java:87)
	at org.joda.time.TestLocalTime_Basics.testToString_DTFormatter(TestLocalTime_Basics.java:808)

testFactory_monthsBetween_RPartial_MonthDay(org.joda.time.TestMonths)  Time elapsed: 0.001 sec  <<< ERROR!
java.lang.ExceptionInInitializerError
	at org.joda.time.TestMonths.testFactory_monthsBetween_RPartial_MonthDay(TestMonths.java:132)
Caused by: java.lang.UnsupportedOperationException: Both printing and parsing not supported
	at org.joda.time.format.DateTimeFormatterBuilder.toFormatter(DateTimeFormatterBuilder.java:115)
	at org.joda.time.format.DateTimeFormat.createFormatterForPattern(DateTimeFormat.java:156)
	at org.joda.time.format.DateTimeFormat.forPattern(DateTimeFormat.java:30)
	at org.joda.time.MonthDay.<clinit>(MonthDay.java:84)
	... 27 more

testFactory_daysBetween_RPartial_MonthDay(org.joda.time.TestDays)  Time elapsed: 0.001 sec  <<< ERROR!
java.lang.NoClassDefFoundError: Could not initialize class org.joda.time.MonthDay
	at org.joda.time.TestDays.testFactory_daysBetween_RPartial_MonthDay(TestDays.java:125)

testToString_String(org.joda.time.TestTimeOfDay_Basics)  Time elapsed: 0 sec  <<< FAILURE!
junit.framework.ComparisonFailure: expected:<����[ 10]> but was:<����[]>
	at junit.framework.Assert.assertEquals(Assert.java:81)
	at junit.framework.Assert.assertEquals(Assert.java:87)
	at org.joda.time.TestTimeOfDay_Basics.testToString_String(TestTimeOfDay_Basics.java:879)

testToString_String_Locale(org.joda.time.TestTimeOfDay_Basics)  Time elapsed: 0.001 sec  <<< FAILURE!
junit.framework.ComparisonFailure: expected:<10[ 20]> but was:<10[]>
	at junit.framework.Assert.assertEquals(Assert.java:81)
	at junit.framework.Assert.assertEquals(Assert.java:87)
	at org.joda.time.TestTimeOfDay_Basics.testToString_String_Locale(TestTimeOfDay_Basics.java:886)

testToString_DTFormatter(org.joda.time.TestTimeOfDay_Basics)  Time elapsed: 0.001 sec  <<< FAILURE!
junit.framework.ComparisonFailure: expected:<����[ 10]> but was:<����[]>
	at junit.framework.Assert.assertEquals(Assert.java:81)
	at junit.framework.Assert.assertEquals(Assert.java:87)
	at org.joda.time.TestTimeOfDay_Basics.testToString_DTFormatter(TestTimeOfDay_Basics.java:895)

testToString_String(org.joda.time.TestYearMonthDay_Basics)  Time elapsed: 0.001 sec  <<< FAILURE!
junit.framework.ComparisonFailure: expected:<2002[ ��]> but was:<2002[]>
	at junit.framework.Assert.assertEquals(Assert.java:81)
	at junit.framework.Assert.assertEquals(Assert.java:87)
	at org.joda.time.TestYearMonthDay_Basics.testToString_String(TestYearMonthDay_Basics.java:805)

testToString_String_Locale(org.joda.time.TestYearMonthDay_Basics)  Time elapsed: 0 sec  <<< FAILURE!
junit.framework.ComparisonFailure: expected:<�[ 9/6]> but was:<�[]>
	at junit.framework.Assert.assertEquals(Assert.java:81)
	at junit.framework.Assert.assertEquals(Assert.java:87)
	at org.joda.time.TestYearMonthDay_Basics.testToString_String_Locale(TestYearMonthDay_Basics.java:812)

testToString_DTFormatter(org.joda.time.TestYearMonthDay_Basics)  Time elapsed: 0.002 sec  <<< FAILURE!
junit.framework.ComparisonFailure: expected:<2002[ ��]> but was:<2002[]>
	at junit.framework.Assert.assertEquals(Assert.java:81)
	at junit.framework.Assert.assertEquals(Assert.java:87)
	at org.joda.time.TestYearMonthDay_Basics.testToString_DTFormatter(TestYearMonthDay_Basics.java:822)

testToString_String(org.joda.time.TestYearMonth_Basics)  Time elapsed: 0 sec  <<< FAILURE!
junit.framework.ComparisonFailure: expected:<2002[ ��]> but was:<2002[]>
	at junit.framework.Assert.assertEquals(Assert.java:81)
	at junit.framework.Assert.assertEquals(Assert.java:87)
	at org.joda.time.TestYearMonth_Basics.testToString_String(TestYearMonth_Basics.java:629)

testToString_String_Locale(org.joda.time.TestYearMonth_Basics)  Time elapsed: 0.001 sec  <<< FAILURE!
junit.framework.ComparisonFailure: expected:<�[ �/6]> but was:<�[]>
	at junit.framework.Assert.assertEquals(Assert.java:81)
	at junit.framework.Assert.assertEquals(Assert.java:87)
	at org.joda.time.TestYearMonth_Basics.testToString_String_Locale(TestYearMonth_Basics.java:636)

testToString_DTFormatter(org.joda.time.TestYearMonth_Basics)  Time elapsed: 0 sec  <<< FAILURE!
junit.framework.ComparisonFailure: expected:<2002[ ��]> but was:<2002[]>
	at junit.framework.Assert.assertEquals(Assert.java:81)
	at junit.framework.Assert.assertEquals(Assert.java:87)
	at org.joda.time.TestYearMonth_Basics.testToString_DTFormatter(TestYearMonth_Basics.java:646)

testParse_formatter(org.joda.time.TestYearMonth_Constructors)  Time elapsed: 0.001 sec  <<< ERROR!
java.lang.IllegalArgumentException: Invalid format: "2010--06" is malformed at "--06"
	at org.joda.time.format.DateTimeFormatter.parseLocalDateTime(DateTimeFormatter.java:854)
	at org.joda.time.format.DateTimeFormatter.parseLocalDate(DateTimeFormatter.java:798)
	at org.joda.time.YearMonth.parse(YearMonth.java:152)
	at org.joda.time.TestYearMonth_Constructors.testParse_formatter(TestYearMonth_Constructors.java:90)

testToString(org.joda.time.TestMonthDay_Basics)  Time elapsed: 0.001 sec  <<< ERROR!
java.lang.NoClassDefFoundError: Could not initialize class org.joda.time.MonthDay
	at org.joda.time.TestMonthDay_Basics.testToString(TestMonthDay_Basics.java:788)

testSerialization(org.joda.time.TestMonthDay_Basics)  Time elapsed: 0.001 sec  <<< ERROR!
java.lang.NoClassDefFoundError: Could not initialize class org.joda.time.MonthDay
	at org.joda.time.TestMonthDay_Basics.testSerialization(TestMonthDay_Basics.java:767)

testWithers(org.joda.time.TestMonthDay_Basics)  Time elapsed: 0 sec  <<< ERROR!
java.lang.NoClassDefFoundError: Could not initialize class org.joda.time.MonthDay
	at org.joda.time.TestMonthDay_Basics.testWithers(TestMonthDay_Basics.java:737)

testToString_String(org.joda.time.TestMonthDay_Basics)  Time elapsed: 0.001 sec  <<< ERROR!
java.lang.NoClassDefFoundError: Could not initialize class org.joda.time.MonthDay
	at org.joda.time.TestMonthDay_Basics.testToString_String(TestMonthDay_Basics.java:794)

testToString_String_Locale(org.joda.time.TestMonthDay_Basics)  Time elapsed: 0 sec  <<< ERROR!
java.lang.NoClassDefFoundError: Could not initialize class org.joda.time.MonthDay
	at org.joda.time.TestMonthDay_Basics.testToString_String_Locale(TestMonthDay_Basics.java:801)

testToString_DTFormatter(org.joda.time.TestMonthDay_Basics)  Time elapsed: 0 sec  <<< ERROR!
java.lang.NoClassDefFoundError: Could not initialize class org.joda.time.MonthDay
	at org.joda.time.TestMonthDay_Basics.testToString_DTFormatter(TestMonthDay_Basics.java:811)

testToLocalDate(org.joda.time.TestMonthDay_Basics)  Time elapsed: 0.001 sec  <<< ERROR!
java.lang.NoClassDefFoundError: Could not initialize class org.joda.time.MonthDay
	at org.joda.time.TestMonthDay_Basics.testToLocalDate(TestMonthDay_Basics.java:700)

testPlus_RP(org.joda.time.TestMonthDay_Basics)  Time elapsed: 0 sec  <<< ERROR!
java.lang.NoClassDefFoundError: Could not initialize class org.joda.time.MonthDay
	at org.joda.time.TestMonthDay_Basics.testPlus_RP(TestMonthDay_Basics.java:435)

testPlusMonths_int(org.joda.time.TestMonthDay_Basics)  Time elapsed: 0.001 sec  <<< ERROR!
java.lang.NoClassDefFoundError: Could not initialize class org.joda.time.MonthDay
	at org.joda.time.TestMonthDay_Basics.testPlusMonths_int(TestMonthDay_Basics.java:445)

testPlusDays_int(org.joda.time.TestMonthDay_Basics)  Time elapsed: 0 sec  <<< ERROR!
java.lang.NoClassDefFoundError: Could not initialize class org.joda.time.MonthDay
	at org.joda.time.TestMonthDay_Basics.testPlusDays_int(TestMonthDay_Basics.java:501)

testMinus_RP(org.joda.time.TestMonthDay_Basics)  Time elapsed: 0.001 sec  <<< ERROR!
java.lang.NoClassDefFoundError: Could not initialize class org.joda.time.MonthDay
	at org.joda.time.TestMonthDay_Basics.testMinus_RP(TestMonthDay_Basics.java:571)

testMinusMonths_int(org.joda.time.TestMonthDay_Basics)  Time elapsed: 0.001 sec  <<< ERROR!
java.lang.NoClassDefFoundError: Could not initialize class org.joda.time.MonthDay
	at org.joda.time.TestMonthDay_Basics.testMinusMonths_int(TestMonthDay_Basics.java:581)

testMinusDays_int(org.joda.time.TestMonthDay_Basics)  Time elapsed: 0 sec  <<< ERROR!
java.lang.NoClassDefFoundError: Could not initialize class org.joda.time.MonthDay
	at org.joda.time.TestMonthDay_Basics.testMinusDays_int(TestMonthDay_Basics.java:637)

testProperty(org.joda.time.TestMonthDay_Basics)  Time elapsed: 0.001 sec  <<< ERROR!
java.lang.NoClassDefFoundError: Could not initialize class org.joda.time.MonthDay
	at org.joda.time.TestMonthDay_Basics.testProperty(TestMonthDay_Basics.java:752)

testCompareTo(org.joda.time.TestMonthDay_Basics)  Time elapsed: 0 sec  <<< ERROR!
java.lang.NoClassDefFoundError: Could not initialize class org.joda.time.MonthDay
	at org.joda.time.TestMonthDay_Basics.testCompareTo(TestMonthDay_Basics.java:224)

testEqualsHashCode(org.joda.time.TestMonthDay_Basics)  Time elapsed: 0.001 sec  <<< ERROR!
java.lang.NoClassDefFoundError: Could not initialize class org.joda.time.MonthDay
	at org.joda.time.TestMonthDay_Basics.testEqualsHashCode(TestMonthDay_Basics.java:178)

testIsSupported(org.joda.time.TestMonthDay_Basics)  Time elapsed: 0 sec  <<< ERROR!
java.lang.NoClassDefFoundError: Could not initialize class org.joda.time.MonthDay
	at org.joda.time.TestMonthDay_Basics.testIsSupported(TestMonthDay_Basics.java:170)

testGet(org.joda.time.TestMonthDay_Basics)  Time elapsed: 0 sec  <<< ERROR!
java.lang.NoClassDefFoundError: Could not initialize class org.joda.time.MonthDay
	at org.joda.time.TestMonthDay_Basics.testGet(TestMonthDay_Basics.java:87)

testToDateTime_RI(org.joda.time.TestMonthDay_Basics)  Time elapsed: 0.001 sec  <<< ERROR!
java.lang.NoClassDefFoundError: Could not initialize class org.joda.time.MonthDay
	at org.joda.time.TestMonthDay_Basics.testToDateTime_RI(TestMonthDay_Basics.java:711)

testToDateTime_nullRI(org.joda.time.TestMonthDay_Basics)  Time elapsed: 0 sec  <<< ERROR!
java.lang.NoClassDefFoundError: Could not initialize class org.joda.time.MonthDay
	at org.joda.time.TestMonthDay_Basics.testToDateTime_nullRI(TestMonthDay_Basics.java:723)

testSize(org.joda.time.TestMonthDay_Basics)  Time elapsed: 0.001 sec  <<< ERROR!
java.lang.NoClassDefFoundError: Could not initialize class org.joda.time.MonthDay
	at org.joda.time.TestMonthDay_Basics.testSize(TestMonthDay_Basics.java:101)

testGetFieldTypes(org.joda.time.TestMonthDay_Basics)  Time elapsed: 0 sec  <<< ERROR!
java.lang.NoClassDefFoundError: Could not initialize class org.joda.time.MonthDay
	at org.joda.time.TestMonthDay_Basics.testGetFieldTypes(TestMonthDay_Basics.java:119)

testGetFields(org.joda.time.TestMonthDay_Basics)  Time elapsed: 0.001 sec  <<< ERROR!
java.lang.NoClassDefFoundError: Could not initialize class org.joda.time.MonthDay
	at org.joda.time.TestMonthDay_Basics.testGetFields(TestMonthDay_Basics.java:140)

testGetValues(org.joda.time.TestMonthDay_Basics)  Time elapsed: 0 sec  <<< ERROR!
java.lang.NoClassDefFoundError: Could not initialize class org.joda.time.MonthDay
	at org.joda.time.TestMonthDay_Basics.testGetValues(TestMonthDay_Basics.java:161)

testGetFieldType(org.joda.time.TestMonthDay_Basics)  Time elapsed: 0 sec  <<< ERROR!
java.lang.NoClassDefFoundError: Could not initialize class org.joda.time.MonthDay
	at org.joda.time.TestMonthDay_Basics.testGetFieldType(TestMonthDay_Basics.java:106)

testGetField(org.joda.time.TestMonthDay_Basics)  Time elapsed: 0.001 sec  <<< ERROR!
java.lang.NoClassDefFoundError: Could not initialize class org.joda.time.MonthDay
	at org.joda.time.TestMonthDay_Basics.testGetField(TestMonthDay_Basics.java:128)

testGetValue(org.joda.time.TestMonthDay_Basics)  Time elapsed: 0 sec  <<< ERROR!
java.lang.NoClassDefFoundError: Could not initialize class org.joda.time.MonthDay
	at org.joda.time.TestMonthDay_Basics.testGetValue(TestMonthDay_Basics.java:149)

testWithChronologyRetainFields_Chrono(org.joda.time.TestMonthDay_Basics)  Time elapsed: 0.001 sec  <<< ERROR!
java.lang.NoClassDefFoundError: Could not initialize class org.joda.time.MonthDay
	at org.joda.time.TestMonthDay_Basics.testWithChronologyRetainFields_Chrono(TestMonthDay_Basics.java:339)

testWithChronologyRetainFields_sameChrono(org.joda.time.TestMonthDay_Basics)  Time elapsed: 0 sec  <<< ERROR!
java.lang.NoClassDefFoundError: Could not initialize class org.joda.time.MonthDay
	at org.joda.time.TestMonthDay_Basics.testWithChronologyRetainFields_sameChrono(TestMonthDay_Basics.java:348)

testWithChronologyRetainFields_nullChrono(org.joda.time.TestMonthDay_Basics)  Time elapsed: 0 sec  <<< ERROR!
java.lang.NoClassDefFoundError: Could not initialize class org.joda.time.MonthDay
	at org.joda.time.TestMonthDay_Basics.testWithChronologyRetainFields_nullChrono(TestMonthDay_Basics.java:354)

testWithFieldAdded_nullField_zero(org.joda.time.TestMonthDay_Basics)  Time elapsed: 0.001 sec  <<< ERROR!
java.lang.NoClassDefFoundError: Could not initialize class org.joda.time.MonthDay
	at org.joda.time.TestMonthDay_Basics.testWithFieldAdded_nullField_zero(TestMonthDay_Basics.java:404)

testWithFieldAdded_nullField_nonZero(org.joda.time.TestMonthDay_Basics)  Time elapsed: 0 sec  <<< ERROR!
java.lang.NoClassDefFoundError: Could not initialize class org.joda.time.MonthDay
	at org.joda.time.TestMonthDay_Basics.testWithFieldAdded_nullField_nonZero(TestMonthDay_Basics.java:412)

testWithFieldAdded_zero(org.joda.time.TestMonthDay_Basics)  Time elapsed: 0.001 sec  <<< ERROR!
java.lang.NoClassDefFoundError: Could not initialize class org.joda.time.MonthDay
	at org.joda.time.TestMonthDay_Basics.testWithFieldAdded_zero(TestMonthDay_Basics.java:420)

testWithFieldAdded_unknownField(org.joda.time.TestMonthDay_Basics)  Time elapsed: 0 sec  <<< ERROR!
java.lang.NoClassDefFoundError: Could not initialize class org.joda.time.MonthDay
	at org.joda.time.TestMonthDay_Basics.testWithFieldAdded_unknownField(TestMonthDay_Basics.java:426)

testWithField(org.joda.time.TestMonthDay_Basics)  Time elapsed: 0.001 sec  <<< ERROR!
java.lang.NoClassDefFoundError: Could not initialize class org.joda.time.MonthDay
	at org.joda.time.TestMonthDay_Basics.testWithField(TestMonthDay_Basics.java:364)

testWithField_nullField(org.joda.time.TestMonthDay_Basics)  Time elapsed: 0 sec  <<< ERROR!
java.lang.NoClassDefFoundError: Could not initialize class org.joda.time.MonthDay
	at org.joda.time.TestMonthDay_Basics.testWithField_nullField(TestMonthDay_Basics.java:372)

testWithField_unknownField(org.joda.time.TestMonthDay_Basics)  Time elapsed: 0 sec  <<< ERROR!
java.lang.NoClassDefFoundError: Could not initialize class org.joda.time.MonthDay
	at org.joda.time.TestMonthDay_Basics.testWithField_unknownField(TestMonthDay_Basics.java:380)

testWithField_same(org.joda.time.TestMonthDay_Basics)  Time elapsed: 0.001 sec  <<< ERROR!
java.lang.NoClassDefFoundError: Could not initialize class org.joda.time.MonthDay
	at org.joda.time.TestMonthDay_Basics.testWithField_same(TestMonthDay_Basics.java:388)

testWithFieldAdded(org.joda.time.TestMonthDay_Basics)  Time elapsed: 0 sec  <<< ERROR!
java.lang.NoClassDefFoundError: Could not initialize class org.joda.time.MonthDay
	at org.joda.time.TestMonthDay_Basics.testWithFieldAdded(TestMonthDay_Basics.java:396)

testIsEqual_MD(org.joda.time.TestMonthDay_Basics)  Time elapsed: 0.001 sec  <<< ERROR!
java.lang.NoClassDefFoundError: Could not initialize class org.joda.time.MonthDay
	at org.joda.time.TestMonthDay_Basics.testIsEqual_MD(TestMonthDay_Basics.java:267)

testIsBefore_MD(org.joda.time.TestMonthDay_Basics)  Time elapsed: 0 sec  <<< ERROR!
java.lang.NoClassDefFoundError: Could not initialize class org.joda.time.MonthDay
	at org.joda.time.TestMonthDay_Basics.testIsBefore_MD(TestMonthDay_Basics.java:291)

testIsAfter_MD(org.joda.time.TestMonthDay_Basics)  Time elapsed: 0.001 sec  <<< ERROR!
java.lang.NoClassDefFoundError: Could not initialize class org.joda.time.MonthDay
	at org.joda.time.TestMonthDay_Basics.testIsAfter_MD(TestMonthDay_Basics.java:315)

testPlusMonths_int_fromLeap(org.joda.time.TestMonthDay_Basics)  Time elapsed: 0 sec  <<< ERROR!
java.lang.NoClassDefFoundError: Could not initialize class org.joda.time.MonthDay
	at org.joda.time.TestMonthDay_Basics.testPlusMonths_int_fromLeap(TestMonthDay_Basics.java:452)

testPlusMonths_int_negativeFromLeap(org.joda.time.TestMonthDay_Basics)  Time elapsed: 0 sec  <<< ERROR!
java.lang.NoClassDefFoundError: Could not initialize class org.joda.time.MonthDay
	at org.joda.time.TestMonthDay_Basics.testPlusMonths_int_negativeFromLeap(TestMonthDay_Basics.java:459)

testPlusMonths_int_endOfMonthAdjust(org.joda.time.TestMonthDay_Basics)  Time elapsed: 0.001 sec  <<< ERROR!
java.lang.NoClassDefFoundError: Could not initialize class org.joda.time.MonthDay
	at org.joda.time.TestMonthDay_Basics.testPlusMonths_int_endOfMonthAdjust(TestMonthDay_Basics.java:466)

testPlusMonths_int_same(org.joda.time.TestMonthDay_Basics)  Time elapsed: 0 sec  <<< ERROR!
java.lang.NoClassDefFoundError: Could not initialize class org.joda.time.MonthDay
	at org.joda.time.TestMonthDay_Basics.testPlusMonths_int_same(TestMonthDay_Basics.java:480)

testPlusMonths_int_negativeEndOfMonthAdjust(org.joda.time.TestMonthDay_Basics)  Time elapsed: 0.002 sec  <<< ERROR!
java.lang.NoClassDefFoundError: Could not initialize class org.joda.time.MonthDay
	at org.joda.time.TestMonthDay_Basics.testPlusMonths_int_negativeEndOfMonthAdjust(TestMonthDay_Basics.java:473)

testPlusMonths_int_wrap(org.joda.time.TestMonthDay_Basics)  Time elapsed: 0 sec  <<< ERROR!
java.lang.NoClassDefFoundError: Could not initialize class org.joda.time.MonthDay
	at org.joda.time.TestMonthDay_Basics.testPlusMonths_int_wrap(TestMonthDay_Basics.java:486)

testPlusMonths_int_adjust(org.joda.time.TestMonthDay_Basics)  Time elapsed: 0 sec  <<< ERROR!
java.lang.NoClassDefFoundError: Could not initialize class org.joda.time.MonthDay
	at org.joda.time.TestMonthDay_Basics.testPlusMonths_int_adjust(TestMonthDay_Basics.java:493)

testPlusDays_int_wrapMonth(org.joda.time.TestMonthDay_Basics)  Time elapsed: 0.001 sec  <<< ERROR!
java.lang.NoClassDefFoundError: Could not initialize class org.joda.time.MonthDay
	at org.joda.time.TestMonthDay_Basics.testPlusDays_int_wrapMonth(TestMonthDay_Basics.java:508)

testPlusDays_int_wrapMonthTwice(org.joda.time.TestMonthDay_Basics)  Time elapsed: 0 sec  <<< ERROR!
java.lang.NoClassDefFoundError: Could not initialize class org.joda.time.MonthDay
	at org.joda.time.TestMonthDay_Basics.testPlusDays_int_wrapMonthTwice(TestMonthDay_Basics.java:515)

testPlusDays_int_wrapMonthIntoNextYear(org.joda.time.TestMonthDay_Basics)  Time elapsed: 0 sec  <<< ERROR!
java.lang.NoClassDefFoundError: Could not initialize class org.joda.time.MonthDay
	at org.joda.time.TestMonthDay_Basics.testPlusDays_int_wrapMonthIntoNextYear(TestMonthDay_Basics.java:522)

testPlusDays_int_wrapMonthTwiceIntoNextYear(org.joda.time.TestMonthDay_Basics)  Time elapsed: 0.001 sec  <<< ERROR!
java.lang.NoClassDefFoundError: Could not initialize class org.joda.time.MonthDay
	at org.joda.time.TestMonthDay_Basics.testPlusDays_int_wrapMonthTwiceIntoNextYear(TestMonthDay_Basics.java:529)

testPlusDays_int_wrap50(org.joda.time.TestMonthDay_Basics)  Time elapsed: 0.001 sec  <<< ERROR!
java.lang.NoClassDefFoundError: Could not initialize class org.joda.time.MonthDay
	at org.joda.time.TestMonthDay_Basics.testPlusDays_int_wrap50(TestMonthDay_Basics.java:536)

testPlusDays_int_toLeap(org.joda.time.TestMonthDay_Basics)  Time elapsed: 0 sec  <<< ERROR!
java.lang.NoClassDefFoundError: Could not initialize class org.joda.time.MonthDay
	at org.joda.time.TestMonthDay_Basics.testPlusDays_int_toLeap(TestMonthDay_Basics.java:543)

testPlusDays_int_fromLeap(org.joda.time.TestMonthDay_Basics)  Time elapsed: 0.001 sec  <<< ERROR!
java.lang.NoClassDefFoundError: Could not initialize class org.joda.time.MonthDay
	at org.joda.time.TestMonthDay_Basics.testPlusDays_int_fromLeap(TestMonthDay_Basics.java:550)

testPlusDays_int_negativeFromLeap(org.joda.time.TestMonthDay_Basics)  Time elapsed: 0.001 sec  <<< ERROR!
java.lang.NoClassDefFoundError: Could not initialize class org.joda.time.MonthDay
	at org.joda.time.TestMonthDay_Basics.testPlusDays_int_negativeFromLeap(TestMonthDay_Basics.java:557)

testPlusDays_same(org.joda.time.TestMonthDay_Basics)  Time elapsed: 0.001 sec  <<< ERROR!
java.lang.NoClassDefFoundError: Could not initialize class org.joda.time.MonthDay
	at org.joda.time.TestMonthDay_Basics.testPlusDays_same(TestMonthDay_Basics.java:564)

testMinusMonths_int_fromLeap(org.joda.time.TestMonthDay_Basics)  Time elapsed: 0 sec  <<< ERROR!
java.lang.NoClassDefFoundError: Could not initialize class org.joda.time.MonthDay
	at org.joda.time.TestMonthDay_Basics.testMinusMonths_int_fromLeap(TestMonthDay_Basics.java:588)

testMinusMonths_int_negativeFromLeap(org.joda.time.TestMonthDay_Basics)  Time elapsed: 0 sec  <<< ERROR!
java.lang.NoClassDefFoundError: Could not initialize class org.joda.time.MonthDay
	at org.joda.time.TestMonthDay_Basics.testMinusMonths_int_negativeFromLeap(TestMonthDay_Basics.java:595)

testMinusMonths_int_endOfMonthAdjust(org.joda.time.TestMonthDay_Basics)  Time elapsed: 0.001 sec  <<< ERROR!
java.lang.NoClassDefFoundError: Could not initialize class org.joda.time.MonthDay
	at org.joda.time.TestMonthDay_Basics.testMinusMonths_int_endOfMonthAdjust(TestMonthDay_Basics.java:602)

testMinusMonths_int_negativeEndOfMonthAdjust(org.joda.time.TestMonthDay_Basics)  Time elapsed: 0.001 sec  <<< ERROR!
java.lang.NoClassDefFoundError: Could not initialize class org.joda.time.MonthDay
	at org.joda.time.TestMonthDay_Basics.testMinusMonths_int_negativeEndOfMonthAdjust(TestMonthDay_Basics.java:609)

testMinusMonths_int_same(org.joda.time.TestMonthDay_Basics)  Time elapsed: 0 sec  <<< ERROR!
java.lang.NoClassDefFoundError: Could not initialize class org.joda.time.MonthDay
	at org.joda.time.TestMonthDay_Basics.testMinusMonths_int_same(TestMonthDay_Basics.java:616)

testMinusMonths_int_wrap(org.joda.time.TestMonthDay_Basics)  Time elapsed: 0.001 sec  <<< ERROR!
java.lang.NoClassDefFoundError: Could not initialize class org.joda.time.MonthDay
	at org.joda.time.TestMonthDay_Basics.testMinusMonths_int_wrap(TestMonthDay_Basics.java:622)

testMinusMonths_int_adjust(org.joda.time.TestMonthDay_Basics)  Time elapsed: 0.001 sec  <<< ERROR!
java.lang.NoClassDefFoundError: Could not initialize class org.joda.time.MonthDay
	at org.joda.time.TestMonthDay_Basics.testMinusMonths_int_adjust(TestMonthDay_Basics.java:629)

testMinusDays_int_wrapMonth(org.joda.time.TestMonthDay_Basics)  Time elapsed: 0 sec  <<< ERROR!
java.lang.NoClassDefFoundError: Could not initialize class org.joda.time.MonthDay
	at org.joda.time.TestMonthDay_Basics.testMinusDays_int_wrapMonth(TestMonthDay_Basics.java:644)

testMinusDays_int_wrapMonthTwice(org.joda.time.TestMonthDay_Basics)  Time elapsed: 0 sec  <<< ERROR!
java.lang.NoClassDefFoundError: Could not initialize class org.joda.time.MonthDay
	at org.joda.time.TestMonthDay_Basics.testMinusDays_int_wrapMonthTwice(TestMonthDay_Basics.java:651)

testMinusDays_int_wrapMonthIntoLastYear(org.joda.time.TestMonthDay_Basics)  Time elapsed: 0 sec  <<< ERROR!
java.lang.NoClassDefFoundError: Could not initialize class org.joda.time.MonthDay
	at org.joda.time.TestMonthDay_Basics.testMinusDays_int_wrapMonthIntoLastYear(TestMonthDay_Basics.java:658)

testMinusDays_int_wrapMonthTwiceIntoLastYear(org.joda.time.TestMonthDay_Basics)  Time elapsed: 0 sec  <<< ERROR!
java.lang.NoClassDefFoundError: Could not initialize class org.joda.time.MonthDay
	at org.joda.time.TestMonthDay_Basics.testMinusDays_int_wrapMonthTwiceIntoLastYear(TestMonthDay_Basics.java:665)

testMinusDays_int_toLeap(org.joda.time.TestMonthDay_Basics)  Time elapsed: 0.001 sec  <<< ERROR!
java.lang.NoClassDefFoundError: Could not initialize class org.joda.time.MonthDay
	at org.joda.time.TestMonthDay_Basics.testMinusDays_int_toLeap(TestMonthDay_Basics.java:672)

testMinusDays_int_fromLeap(org.joda.time.TestMonthDay_Basics)  Time elapsed: 0 sec  <<< ERROR!
java.lang.NoClassDefFoundError: Could not initialize class org.joda.time.MonthDay
	at org.joda.time.TestMonthDay_Basics.testMinusDays_int_fromLeap(TestMonthDay_Basics.java:679)

testMinusDays_int_negativeFromLeap(org.joda.time.TestMonthDay_Basics)  Time elapsed: 0 sec  <<< ERROR!
java.lang.NoClassDefFoundError: Could not initialize class org.joda.time.MonthDay
	at org.joda.time.TestMonthDay_Basics.testMinusDays_int_negativeFromLeap(TestMonthDay_Basics.java:686)

testMinusDays_same(org.joda.time.TestMonthDay_Basics)  Time elapsed: 0.001 sec  <<< ERROR!
java.lang.NoClassDefFoundError: Could not initialize class org.joda.time.MonthDay
	at org.joda.time.TestMonthDay_Basics.testMinusDays_same(TestMonthDay_Basics.java:693)

testConstructor(org.joda.time.TestMonthDay_Constructors)  Time elapsed: 0 sec  <<< ERROR!
java.lang.NoClassDefFoundError: Could not initialize class org.joda.time.MonthDay
	at org.joda.time.TestMonthDay_Constructors.testConstructor(TestMonthDay_Constructors.java:122)

testParse_noFormatter(org.joda.time.TestMonthDay_Constructors)  Time elapsed: 0.001 sec  <<< ERROR!
java.lang.NoClassDefFoundError: Could not initialize class org.joda.time.MonthDay
	at org.joda.time.TestMonthDay_Constructors.testParse_noFormatter(TestMonthDay_Constructors.java:82)

testParse_formatter(org.joda.time.TestMonthDay_Constructors)  Time elapsed: 0 sec  <<< ERROR!
java.lang.NoClassDefFoundError: Could not initialize class org.joda.time.MonthDay
	at org.joda.time.TestMonthDay_Constructors.testParse_formatter(TestMonthDay_Constructors.java:90)

testConstructor_long1(org.joda.time.TestMonthDay_Constructors)  Time elapsed: 0.001 sec  <<< ERROR!
java.lang.NoClassDefFoundError: Could not initialize class org.joda.time.MonthDay
	at org.joda.time.TestMonthDay_Constructors.testConstructor_long1(TestMonthDay_Constructors.java:190)

testConstructor_long2(org.joda.time.TestMonthDay_Constructors)  Time elapsed: 0 sec  <<< ERROR!
java.lang.NoClassDefFoundError: Could not initialize class org.joda.time.MonthDay
	at org.joda.time.TestMonthDay_Constructors.testConstructor_long2(TestMonthDay_Constructors.java:200)

testConstructor_Object(org.joda.time.TestMonthDay_Constructors)  Time elapsed: 0 sec  <<< ERROR!
java.lang.NoClassDefFoundError: Could not initialize class org.joda.time.MonthDay
	at org.joda.time.TestMonthDay_Constructors.testConstructor_Object(TestMonthDay_Constructors.java:239)

testConstructor_nullObject(org.joda.time.TestMonthDay_Constructors)  Time elapsed: 0.001 sec  <<< ERROR!
java.lang.NoClassDefFoundError: Could not initialize class org.joda.time.MonthDay
	at org.joda.time.TestMonthDay_Constructors.testConstructor_nullObject(TestMonthDay_Constructors.java:246)

testConstructor_long2_Chronology(org.joda.time.TestMonthDay_Constructors)  Time elapsed: 0 sec  <<< ERROR!
java.lang.NoClassDefFoundError: Could not initialize class org.joda.time.MonthDay
	at org.joda.time.TestMonthDay_Constructors.testConstructor_long2_Chronology(TestMonthDay_Constructors.java:220)

testConstructor_long_nullChronology(org.joda.time.TestMonthDay_Constructors)  Time elapsed: 0.005 sec  <<< ERROR!
java.lang.NoClassDefFoundError: Could not initialize class org.joda.time.MonthDay
	at org.joda.time.TestMonthDay_Constructors.testConstructor_long_nullChronology(TestMonthDay_Constructors.java:230)

testConstructor_ObjectString1(org.joda.time.TestMonthDay_Constructors)  Time elapsed: 0 sec  <<< ERROR!
java.lang.NoClassDefFoundError: Could not initialize class org.joda.time.MonthDay
	at org.joda.time.TestMonthDay_Constructors.testConstructor_ObjectString1(TestMonthDay_Constructors.java:253)

testConstructor_ObjectString5(org.joda.time.TestMonthDay_Constructors)  Time elapsed: 0 sec  <<< ERROR!
java.lang.NoClassDefFoundError: Could not initialize class org.joda.time.MonthDay
	at org.joda.time.TestMonthDay_Constructors.testConstructor_ObjectString5(TestMonthDay_Constructors.java:260)

testConstructor_ObjectStringEx1(org.joda.time.TestMonthDay_Constructors)  Time elapsed: 0 sec  <<< ERROR!
java.lang.NoClassDefFoundError: Could not initialize class org.joda.time.MonthDay
	at org.joda.time.TestMonthDay_Constructors.testConstructor_ObjectStringEx1(TestMonthDay_Constructors.java:268)

testConstructor_ObjectStringEx2(org.joda.time.TestMonthDay_Constructors)  Time elapsed: 0 sec  <<< ERROR!
java.lang.NoClassDefFoundError: Could not initialize class org.joda.time.MonthDay
	at org.joda.time.TestMonthDay_Constructors.testConstructor_ObjectStringEx2(TestMonthDay_Constructors.java:277)

testConstructor_Object_Chronology(org.joda.time.TestMonthDay_Constructors)  Time elapsed: 0 sec  <<< ERROR!
java.lang.NoClassDefFoundError: Could not initialize class org.joda.time.MonthDay
	at org.joda.time.TestMonthDay_Constructors.testConstructor_Object_Chronology(TestMonthDay_Constructors.java:308)

testConstructor_nullObject_Chronology(org.joda.time.TestMonthDay_Constructors)  Time elapsed: 0 sec  <<< ERROR!
java.lang.NoClassDefFoundError: Could not initialize class org.joda.time.MonthDay
	at org.joda.time.TestMonthDay_Constructors.testConstructor_nullObject_Chronology(TestMonthDay_Constructors.java:318)

testConstructor_Object_nullChronology(org.joda.time.TestMonthDay_Constructors)  Time elapsed: 0 sec  <<< ERROR!
java.lang.NoClassDefFoundError: Could not initialize class org.joda.time.MonthDay
	at org.joda.time.TestMonthDay_Constructors.testConstructor_Object_nullChronology(TestMonthDay_Constructors.java:329)

testConstructor_nullObject_nullChronology(org.joda.time.TestMonthDay_Constructors)  Time elapsed: 0 sec  <<< ERROR!
java.lang.NoClassDefFoundError: Could not initialize class org.joda.time.MonthDay
	at org.joda.time.TestMonthDay_Constructors.testConstructor_nullObject_nullChronology(TestMonthDay_Constructors.java:339)

testConstructor_DateTimeZone(org.joda.time.TestMonthDay_Constructors)  Time elapsed: 0 sec  <<< ERROR!
java.lang.NoClassDefFoundError: Could not initialize class org.joda.time.MonthDay
	at org.joda.time.TestMonthDay_Constructors.testConstructor_DateTimeZone(TestMonthDay_Constructors.java:137)

testConstructor_nullDateTimeZone(org.joda.time.TestMonthDay_Constructors)  Time elapsed: 0 sec  <<< ERROR!
java.lang.NoClassDefFoundError: Could not initialize class org.joda.time.MonthDay
	at org.joda.time.TestMonthDay_Constructors.testConstructor_nullDateTimeZone(TestMonthDay_Constructors.java:158)

testConstructor_Chronology(org.joda.time.TestMonthDay_Constructors)  Time elapsed: 0 sec  <<< ERROR!
java.lang.NoClassDefFoundError: Could not initialize class org.joda.time.MonthDay
	at org.joda.time.TestMonthDay_Constructors.testConstructor_Chronology(TestMonthDay_Constructors.java:168)

testConstructor_nullChronology(org.joda.time.TestMonthDay_Constructors)  Time elapsed: 0.001 sec  <<< ERROR!
java.lang.NoClassDefFoundError: Could not initialize class org.joda.time.MonthDay
	at org.joda.time.TestMonthDay_Constructors.testConstructor_nullChronology(TestMonthDay_Constructors.java:179)

testConstructor_long1_Chronology(org.joda.time.TestMonthDay_Constructors)  Time elapsed: 0 sec  <<< ERROR!
java.lang.NoClassDefFoundError: Could not initialize class org.joda.time.MonthDay
	at org.joda.time.TestMonthDay_Constructors.testConstructor_long1_Chronology(TestMonthDay_Constructors.java:210)

testConstructor_int_int(org.joda.time.TestMonthDay_Constructors)  Time elapsed: 0.001 sec  <<< ERROR!
java.lang.NoClassDefFoundError: Could not initialize class org.joda.time.MonthDay
	at org.joda.time.TestMonthDay_Constructors.testConstructor_int_int(TestMonthDay_Constructors.java:350)

testConstructor_ObjectStringEx3(org.joda.time.TestMonthDay_Constructors)  Time elapsed: 0 sec  <<< ERROR!
java.lang.NoClassDefFoundError: Could not initialize class org.joda.time.MonthDay
	at org.joda.time.TestMonthDay_Constructors.testConstructor_ObjectStringEx3(TestMonthDay_Constructors.java:286)

testConstructor_ObjectStringEx4(org.joda.time.TestMonthDay_Constructors)  Time elapsed: 0 sec  <<< ERROR!
java.lang.NoClassDefFoundError: Could not initialize class org.joda.time.MonthDay
	at org.joda.time.TestMonthDay_Constructors.testConstructor_ObjectStringEx4(TestMonthDay_Constructors.java:295)

testConstructor_int_int_Chronology(org.joda.time.TestMonthDay_Constructors)  Time elapsed: 0.001 sec  <<< ERROR!
java.lang.NoClassDefFoundError: Could not initialize class org.joda.time.MonthDay
	at org.joda.time.TestMonthDay_Constructors.testConstructor_int_int_Chronology(TestMonthDay_Constructors.java:376)

testConstructor_int_int_nullChronology(org.joda.time.TestMonthDay_Constructors)  Time elapsed: 0 sec  <<< ERROR!
java.lang.NoClassDefFoundError: Could not initialize class org.joda.time.MonthDay
	at org.joda.time.TestMonthDay_Constructors.testConstructor_int_int_nullChronology(TestMonthDay_Constructors.java:402)

testFactory_FromCalendarFields(org.joda.time.TestMonthDay_Constructors)  Time elapsed: 0.001 sec  <<< ERROR!
java.lang.NoClassDefFoundError: Could not initialize class org.joda.time.MonthDay
	at org.joda.time.TestMonthDay_Constructors.testFactory_FromCalendarFields(TestMonthDay_Constructors.java:97)

testFactory_FromDateFields(org.joda.time.TestMonthDay_Constructors)  Time elapsed: 0 sec  <<< ERROR!
java.lang.NoClassDefFoundError: Could not initialize class org.joda.time.MonthDay
	at org.joda.time.TestMonthDay_Constructors.testFactory_FromDateFields(TestMonthDay_Constructors.java:109)

testPropertyEqualsHashCodeLenient(org.joda.time.TestMonthDay_Properties)  Time elapsed: 0.001 sec  <<< ERROR!
java.lang.NoClassDefFoundError: Could not initialize class org.joda.time.MonthDay
	at org.joda.time.TestMonthDay_Properties.testPropertyEqualsHashCodeLenient(TestMonthDay_Properties.java:320)

testPropertyEqualsHashCodeStrict(org.joda.time.TestMonthDay_Properties)  Time elapsed: 0 sec  <<< ERROR!
java.lang.NoClassDefFoundError: Could not initialize class org.joda.time.MonthDay
	at org.joda.time.TestMonthDay_Properties.testPropertyEqualsHashCodeStrict(TestMonthDay_Properties.java:332)

testPropertySetTextMonthOfYear(org.joda.time.TestMonthDay_Properties)  Time elapsed: 0 sec  <<< ERROR!
java.lang.NoClassDefFoundError: Could not initialize class org.joda.time.MonthDay
	at org.joda.time.TestMonthDay_Properties.testPropertySetTextMonthOfYear(TestMonthDay_Properties.java:147)

testPropertyCompareToMonthOfYear(org.joda.time.TestMonthDay_Properties)  Time elapsed: 0.001 sec  <<< ERROR!
java.lang.NoClassDefFoundError: Could not initialize class org.joda.time.MonthDay
	at org.joda.time.TestMonthDay_Properties.testPropertyCompareToMonthOfYear(TestMonthDay_Properties.java:154)

testPropertyGetDayOfMonth(org.joda.time.TestMonthDay_Properties)  Time elapsed: 0 sec  <<< ERROR!
java.lang.NoClassDefFoundError: Could not initialize class org.joda.time.MonthDay
	at org.joda.time.TestMonthDay_Properties.testPropertyGetDayOfMonth(TestMonthDay_Properties.java:177)

testPropertyGetMaxMinValuesDayOfMonth(org.joda.time.TestMonthDay_Properties)  Time elapsed: 0.001 sec  <<< ERROR!
java.lang.NoClassDefFoundError: Could not initialize class org.joda.time.MonthDay
	at org.joda.time.TestMonthDay_Properties.testPropertyGetMaxMinValuesDayOfMonth(TestMonthDay_Properties.java:199)

testPropertyAddDayOfMonth(org.joda.time.TestMonthDay_Properties)  Time elapsed: 0 sec  <<< ERROR!
java.lang.NoClassDefFoundError: Could not initialize class org.joda.time.MonthDay
	at org.joda.time.TestMonthDay_Properties.testPropertyAddDayOfMonth(TestMonthDay_Properties.java:207)

testPropertyAddWrapFieldDayOfMonth(org.joda.time.TestMonthDay_Properties)  Time elapsed: 0 sec  <<< ERROR!
java.lang.NoClassDefFoundError: Could not initialize class org.joda.time.MonthDay
	at org.joda.time.TestMonthDay_Properties.testPropertyAddWrapFieldDayOfMonth(TestMonthDay_Properties.java:223)

testPropertyGetMonthOfYear(org.joda.time.TestMonthDay_Properties)  Time elapsed: 0.001 sec  <<< ERROR!
java.lang.NoClassDefFoundError: Could not initialize class org.joda.time.MonthDay
	at org.joda.time.TestMonthDay_Properties.testPropertyGetMonthOfYear(TestMonthDay_Properties.java:81)

testPropertyAddMonthOfYear(org.joda.time.TestMonthDay_Properties)  Time elapsed: 0 sec  <<< ERROR!
java.lang.NoClassDefFoundError: Could not initialize class org.joda.time.MonthDay
	at org.joda.time.TestMonthDay_Properties.testPropertyAddMonthOfYear(TestMonthDay_Properties.java:108)

testPropertyAddWrapFieldMonthOfYear(org.joda.time.TestMonthDay_Properties)  Time elapsed: 0.001 sec  <<< ERROR!
java.lang.NoClassDefFoundError: Could not initialize class org.joda.time.MonthDay
	at org.joda.time.TestMonthDay_Properties.testPropertyAddWrapFieldMonthOfYear(TestMonthDay_Properties.java:124)

testPropertySetMonthOfYear(org.joda.time.TestMonthDay_Properties)  Time elapsed: 0 sec  <<< ERROR!
java.lang.NoClassDefFoundError: Could not initialize class org.joda.time.MonthDay
	at org.joda.time.TestMonthDay_Properties.testPropertySetMonthOfYear(TestMonthDay_Properties.java:140)

testPropertySetDayOfMonth(org.joda.time.TestMonthDay_Properties)  Time elapsed: 0 sec  <<< ERROR!
java.lang.NoClassDefFoundError: Could not initialize class org.joda.time.MonthDay
	at org.joda.time.TestMonthDay_Properties.testPropertySetDayOfMonth(TestMonthDay_Properties.java:236)

testPropertySetTextDayOfMonth(org.joda.time.TestMonthDay_Properties)  Time elapsed: 0.001 sec  <<< ERROR!
java.lang.NoClassDefFoundError: Could not initialize class org.joda.time.MonthDay
	at org.joda.time.TestMonthDay_Properties.testPropertySetTextDayOfMonth(TestMonthDay_Properties.java:252)

testPropertyCompareToDayOfMonth(org.joda.time.TestMonthDay_Properties)  Time elapsed: 0 sec  <<< ERROR!
java.lang.NoClassDefFoundError: Could not initialize class org.joda.time.MonthDay
	at org.joda.time.TestMonthDay_Properties.testPropertyCompareToDayOfMonth(TestMonthDay_Properties.java:267)

testPropertyGetMaxMinValuesMonthOfYear(org.joda.time.TestMonthDay_Properties)  Time elapsed: 0.001 sec  <<< ERROR!
java.lang.NoClassDefFoundError: Could not initialize class org.joda.time.MonthDay
	at org.joda.time.TestMonthDay_Properties.testPropertyGetMaxMinValuesMonthOfYear(TestMonthDay_Properties.java:100)

testPropertyEquals(org.joda.time.TestMonthDay_Properties)  Time elapsed: 0 sec  <<< ERROR!
java.lang.NoClassDefFoundError: Could not initialize class org.joda.time.MonthDay
	at org.joda.time.TestMonthDay_Properties.testPropertyEquals(TestMonthDay_Properties.java:290)

testPropertyHashCode(org.joda.time.TestMonthDay_Properties)  Time elapsed: 0 sec  <<< ERROR!
java.lang.NoClassDefFoundError: Could not initialize class org.joda.time.MonthDay
	at org.joda.time.TestMonthDay_Properties.testPropertyHashCode(TestMonthDay_Properties.java:311)

testToString_String(org.joda.time.TestPartial_Basics)  Time elapsed: 0 sec  <<< FAILURE!
junit.framework.ComparisonFailure: expected:<����[ 10]> but was:<����[]>
	at junit.framework.Assert.assertEquals(Assert.java:81)
	at junit.framework.Assert.assertEquals(Assert.java:87)
	at org.joda.time.TestPartial_Basics.testToString_String(TestPartial_Basics.java:877)

testToString_String_Locale(org.joda.time.TestPartial_Basics)  Time elapsed: 0.001 sec  <<< FAILURE!
junit.framework.ComparisonFailure: expected:<10[ 20]> but was:<10[]>
	at junit.framework.Assert.assertEquals(Assert.java:81)
	at junit.framework.Assert.assertEquals(Assert.java:87)
	at org.joda.time.TestPartial_Basics.testToString_String_Locale(TestPartial_Basics.java:884)

testToString_DTFormatter(org.joda.time.TestPartial_Basics)  Time elapsed: 0.001 sec  <<< FAILURE!
junit.framework.ComparisonFailure: expected:<����[ 10]> but was:<����[]>
	at junit.framework.Assert.assertEquals(Assert.java:81)
	at junit.framework.Assert.assertEquals(Assert.java:87)
	at org.joda.time.TestPartial_Basics.testToString_DTFormatter(TestPartial_Basics.java:893)

testMonthDay(org.joda.time.TestStringConvert)  Time elapsed: 0 sec  <<< ERROR!
java.lang.NoClassDefFoundError: Could not initialize class org.joda.time.MonthDay
	at org.joda.time.TestStringConvert.testMonthDay(TestStringConvert.java:103)

testMonthDay_leapDay(org.joda.time.TestStringConvert)  Time elapsed: 0 sec  <<< ERROR!
java.lang.NoClassDefFoundError: Could not initialize class org.joda.time.MonthDay
	at org.joda.time.TestStringConvert.testMonthDay_leapDay(TestStringConvert.java:110)

testParseInto_monthDay_feb29(org.joda.time.format.TestDateTimeFormatter)  Time elapsed: 0.001 sec  <<< FAILURE!
junit.framework.AssertionFailedError: expected:<4> but was:<1>
	at junit.framework.Assert.fail(Assert.java:47)
	at junit.framework.Assert.failNotEquals(Assert.java:280)
	at junit.framework.Assert.assertEquals(Assert.java:64)
	at junit.framework.Assert.assertEquals(Assert.java:198)
	at junit.framework.Assert.assertEquals(Assert.java:204)
	at org.joda.time.format.TestDateTimeFormatter.testParseInto_monthDay_feb29(TestDateTimeFormatter.java:904)

testParseInto_monthDay_feb29_startOfYear(org.joda.time.format.TestDateTimeFormatter)  Time elapsed: 0.001 sec  <<< FAILURE!
junit.framework.AssertionFailedError: expected:<4> but was:<1>
	at junit.framework.Assert.fail(Assert.java:47)
	at junit.framework.Assert.failNotEquals(Assert.java:280)
	at junit.framework.Assert.assertEquals(Assert.java:64)
	at junit.framework.Assert.assertEquals(Assert.java:198)
	at junit.framework.Assert.assertEquals(Assert.java:204)
	at org.joda.time.format.TestDateTimeFormatter.testParseInto_monthDay_feb29_startOfYear(TestDateTimeFormatter.java:911)

testParseInto_monthDay_feb29_OfYear(org.joda.time.format.TestDateTimeFormatter)  Time elapsed: 0.001 sec  <<< FAILURE!
junit.framework.AssertionFailedError: expected:<4> but was:<1>
	at junit.framework.Assert.fail(Assert.java:47)
	at junit.framework.Assert.failNotEquals(Assert.java:280)
	at junit.framework.Assert.assertEquals(Assert.java:64)
	at junit.framework.Assert.assertEquals(Assert.java:198)
	at junit.framework.Assert.assertEquals(Assert.java:204)
	at org.joda.time.format.TestDateTimeFormatter.testParseInto_monthDay_feb29_OfYear(TestDateTimeFormatter.java:918)

testParseInto_monthDay_feb29_newYork(org.joda.time.format.TestDateTimeFormatter)  Time elapsed: 0 sec  <<< FAILURE!
junit.framework.AssertionFailedError: expected:<4> but was:<1>
	at junit.framework.Assert.fail(Assert.java:47)
	at junit.framework.Assert.failNotEquals(Assert.java:280)
	at junit.framework.Assert.assertEquals(Assert.java:64)
	at junit.framework.Assert.assertEquals(Assert.java:198)
	at junit.framework.Assert.assertEquals(Assert.java:204)
	at org.joda.time.format.TestDateTimeFormatter.testParseInto_monthDay_feb29_newYork(TestDateTimeFormatter.java:925)

testParseInto_monthDay_feb29_newYork_startOfYear(org.joda.time.format.TestDateTimeFormatter)  Time elapsed: 0.001 sec  <<< FAILURE!
junit.framework.AssertionFailedError: expected:<4> but was:<1>
	at junit.framework.Assert.fail(Assert.java:47)
	at junit.framework.Assert.failNotEquals(Assert.java:280)
	at junit.framework.Assert.assertEquals(Assert.java:64)
	at junit.framework.Assert.assertEquals(Assert.java:198)
	at junit.framework.Assert.assertEquals(Assert.java:204)
	at org.joda.time.format.TestDateTimeFormatter.testParseInto_monthDay_feb29_newYork_startOfYear(TestDateTimeFormatter.java:932)

testParseInto_monthDay_feb29_newYork_endOfYear(org.joda.time.format.TestDateTimeFormatter)  Time elapsed: 0 sec  <<< FAILURE!
junit.framework.AssertionFailedError: expected:<4> but was:<1>
	at junit.framework.Assert.fail(Assert.java:47)
	at junit.framework.Assert.failNotEquals(Assert.java:280)
	at junit.framework.Assert.assertEquals(Assert.java:64)
	at junit.framework.Assert.assertEquals(Assert.java:198)
	at junit.framework.Assert.assertEquals(Assert.java:204)
	at org.joda.time.format.TestDateTimeFormatter.testParseInto_monthDay_feb29_newYork_endOfYear(TestDateTimeFormatter.java:939)

testParseInto_monthDay_feb29_tokyo(org.joda.time.format.TestDateTimeFormatter)  Time elapsed: 0 sec  <<< FAILURE!
junit.framework.AssertionFailedError: expected:<4> but was:<1>
	at junit.framework.Assert.fail(Assert.java:47)
	at junit.framework.Assert.failNotEquals(Assert.java:280)
	at junit.framework.Assert.assertEquals(Assert.java:64)
	at junit.framework.Assert.assertEquals(Assert.java:198)
	at junit.framework.Assert.assertEquals(Assert.java:204)
	at org.joda.time.format.TestDateTimeFormatter.testParseInto_monthDay_feb29_tokyo(TestDateTimeFormatter.java:946)

testParseInto_monthDay_feb29_tokyo_startOfYear(org.joda.time.format.TestDateTimeFormatter)  Time elapsed: 0.001 sec  <<< FAILURE!
junit.framework.AssertionFailedError: expected:<4> but was:<1>
	at junit.framework.Assert.fail(Assert.java:47)
	at junit.framework.Assert.failNotEquals(Assert.java:280)
	at junit.framework.Assert.assertEquals(Assert.java:64)
	at junit.framework.Assert.assertEquals(Assert.java:198)
	at junit.framework.Assert.assertEquals(Assert.java:204)
	at org.joda.time.format.TestDateTimeFormatter.testParseInto_monthDay_feb29_tokyo_startOfYear(TestDateTimeFormatter.java:953)

testParseInto_monthDay_feb29_tokyo_endOfYear(org.joda.time.format.TestDateTimeFormatter)  Time elapsed: 0 sec  <<< FAILURE!
junit.framework.AssertionFailedError: expected:<4> but was:<1>
	at junit.framework.Assert.fail(Assert.java:47)
	at junit.framework.Assert.failNotEquals(Assert.java:280)
	at junit.framework.Assert.assertEquals(Assert.java:64)
	at junit.framework.Assert.assertEquals(Assert.java:198)
	at junit.framework.Assert.assertEquals(Assert.java:204)
	at org.joda.time.format.TestDateTimeFormatter.testParseInto_monthDay_feb29_tokyo_endOfYear(TestDateTimeFormatter.java:960)

testParseInto_monthDay_withDefaultYear_feb29(org.joda.time.format.TestDateTimeFormatter)  Time elapsed: 0.001 sec  <<< FAILURE!
junit.framework.AssertionFailedError: expected:<4> but was:<1>
	at junit.framework.Assert.fail(Assert.java:47)
	at junit.framework.Assert.failNotEquals(Assert.java:280)
	at junit.framework.Assert.assertEquals(Assert.java:64)
	at junit.framework.Assert.assertEquals(Assert.java:198)
	at junit.framework.Assert.assertEquals(Assert.java:204)
	at org.joda.time.format.TestDateTimeFormatter.testParseInto_monthDay_withDefaultYear_feb29(TestDateTimeFormatter.java:967)

testParseInto_monthDay_withDefaultYear_feb29_newYork(org.joda.time.format.TestDateTimeFormatter)  Time elapsed: 0.001 sec  <<< FAILURE!
junit.framework.AssertionFailedError: expected:<4> but was:<1>
	at junit.framework.Assert.fail(Assert.java:47)
	at junit.framework.Assert.failNotEquals(Assert.java:280)
	at junit.framework.Assert.assertEquals(Assert.java:64)
	at junit.framework.Assert.assertEquals(Assert.java:198)
	at junit.framework.Assert.assertEquals(Assert.java:204)
	at org.joda.time.format.TestDateTimeFormatter.testParseInto_monthDay_withDefaultYear_feb29_newYork(TestDateTimeFormatter.java:974)

testParseInto_monthDay_withDefaultYear_feb29_newYork_endOfYear(org.joda.time.format.TestDateTimeFormatter)  Time elapsed: 0 sec  <<< FAILURE!
junit.framework.AssertionFailedError: expected:<4> but was:<1>
	at junit.framework.Assert.fail(Assert.java:47)
	at junit.framework.Assert.failNotEquals(Assert.java:280)
	at junit.framework.Assert.assertEquals(Assert.java:64)
	at junit.framework.Assert.assertEquals(Assert.java:198)
	at junit.framework.Assert.assertEquals(Assert.java:204)
	at org.joda.time.format.TestDateTimeFormatter.testParseInto_monthDay_withDefaultYear_feb29_newYork_endOfYear(TestDateTimeFormatter.java:981)

testZoneNameNearTransition(org.joda.time.format.TestDateTimeFormatter)  Time elapsed: 0 sec  <<< FAILURE!
junit.framework.ComparisonFailure: expected:<2005[-10-30 01:00:00.0 Eastern Daylight Time]> but was:<2005[]>
	at junit.framework.Assert.assertEquals(Assert.java:81)
	at junit.framework.Assert.assertEquals(Assert.java:87)
	at org.joda.time.format.TestDateTimeFormatter.testZoneNameNearTransition(TestDateTimeFormatter.java:1003)

testZoneShortNameNearTransition(org.joda.time.format.TestDateTimeFormatter)  Time elapsed: 0 sec  <<< FAILURE!
junit.framework.ComparisonFailure: expected:<2005[-10-30 01:00:00.0 EDT]> but was:<2005[]>
	at junit.framework.Assert.assertEquals(Assert.java:81)
	at junit.framework.Assert.assertEquals(Assert.java:87)
	at org.joda.time.format.TestDateTimeFormatter.testZoneShortNameNearTransition(TestDateTimeFormatter.java:1019)

testParseLocalDate_yearOfEra(org.joda.time.format.TestDateTimeFormatter)  Time elapsed: 0 sec  <<< ERROR!
java.lang.IllegalArgumentException: Invalid format: "2005-10 AD" is malformed at "-10 AD"
	at org.joda.time.format.DateTimeFormatter.parseLocalDateTime(DateTimeFormatter.java:854)
	at org.joda.time.format.DateTimeFormatter.parseLocalDate(DateTimeFormatter.java:798)
	at org.joda.time.format.TestDateTimeFormatter.testParseLocalDate_yearOfEra(TestDateTimeFormatter.java:384)

testParseLocalDate_yearOfCentury(org.joda.time.format.TestDateTimeFormatter)  Time elapsed: 0.001 sec  <<< ERROR!
java.lang.IllegalArgumentException: Invalid format: "50 8 4" is malformed at " 8 4"
	at org.joda.time.format.DateTimeFormatter.parseLocalDateTime(DateTimeFormatter.java:854)
	at org.joda.time.format.DateTimeFormatter.parseLocalDate(DateTimeFormatter.java:798)
	at org.joda.time.format.TestDateTimeFormatter.testParseLocalDate_yearOfCentury(TestDateTimeFormatter.java:401)

testParseLocalDate_monthDay_feb29(org.joda.time.format.TestDateTimeFormatter)  Time elapsed: 0.001 sec  <<< ERROR!
java.lang.IllegalArgumentException: Invalid format: "2 29" is malformed at " 29"
	at org.joda.time.format.DateTimeFormatter.parseLocalDateTime(DateTimeFormatter.java:854)
	at org.joda.time.format.DateTimeFormatter.parseLocalDate(DateTimeFormatter.java:798)
	at org.joda.time.format.TestDateTimeFormatter.testParseLocalDate_monthDay_feb29(TestDateTimeFormatter.java:411)

testParseLocalDate_monthDay_withDefaultYear_feb29(org.joda.time.format.TestDateTimeFormatter)  Time elapsed: 0.001 sec  <<< ERROR!
java.lang.IllegalArgumentException: Invalid format: "2 29" is malformed at " 29"
	at org.joda.time.format.DateTimeFormatter.parseLocalDateTime(DateTimeFormatter.java:854)
	at org.joda.time.format.DateTimeFormatter.parseLocalDate(DateTimeFormatter.java:798)
	at org.joda.time.format.TestDateTimeFormatter.testParseLocalDate_monthDay_withDefaultYear_feb29(TestDateTimeFormatter.java:422)

testParseLocalDate_weekyear_month_week_2010(org.joda.time.format.TestDateTimeFormatter)  Time elapsed: 0 sec  <<< ERROR!
java.lang.IllegalArgumentException: Invalid format: "2010-01-01" is malformed at "-01-01"
	at org.joda.time.format.DateTimeFormatter.parseLocalDateTime(DateTimeFormatter.java:854)
	at org.joda.time.format.DateTimeFormatter.parseLocalDate(DateTimeFormatter.java:798)
	at org.joda.time.format.TestDateTimeFormatter.testParseLocalDate_weekyear_month_week_2010(TestDateTimeFormatter.java:428)

testParseLocalDate_weekyear_month_week_2011(org.joda.time.format.TestDateTimeFormatter)  Time elapsed: 0.001 sec  <<< ERROR!
java.lang.IllegalArgumentException: Invalid format: "2011-01-01" is malformed at "-01-01"
	at org.joda.time.format.DateTimeFormatter.parseLocalDateTime(DateTimeFormatter.java:854)
	at org.joda.time.format.DateTimeFormatter.parseLocalDate(DateTimeFormatter.java:798)
	at org.joda.time.format.TestDateTimeFormatter.testParseLocalDate_weekyear_month_week_2011(TestDateTimeFormatter.java:434)

testParseLocalDate_weekyear_month_week_2012(org.joda.time.format.TestDateTimeFormatter)  Time elapsed: 0.001 sec  <<< ERROR!
java.lang.IllegalArgumentException: Invalid format: "2012-01-01" is malformed at "-01-01"
	at org.joda.time.format.DateTimeFormatter.parseLocalDateTime(DateTimeFormatter.java:854)
	at org.joda.time.format.DateTimeFormatter.parseLocalDate(DateTimeFormatter.java:798)
	at org.joda.time.format.TestDateTimeFormatter.testParseLocalDate_weekyear_month_week_2012(TestDateTimeFormatter.java:440)

testParseLocalDate_year_month_week_2010(org.joda.time.format.TestDateTimeFormatter)  Time elapsed: 0.001 sec  <<< ERROR!
java.lang.IllegalArgumentException: Invalid format: "2010-01-01" is malformed at "-01-01"
	at org.joda.time.format.DateTimeFormatter.parseLocalDateTime(DateTimeFormatter.java:854)
	at org.joda.time.format.DateTimeFormatter.parseLocalDate(DateTimeFormatter.java:798)
	at org.joda.time.format.TestDateTimeFormatter.testParseLocalDate_year_month_week_2010(TestDateTimeFormatter.java:454)

testParseLocalDate_year_month_week_2011(org.joda.time.format.TestDateTimeFormatter)  Time elapsed: 0 sec  <<< ERROR!
java.lang.IllegalArgumentException: Invalid format: "2011-01-01" is malformed at "-01-01"
	at org.joda.time.format.DateTimeFormatter.parseLocalDateTime(DateTimeFormatter.java:854)
	at org.joda.time.format.DateTimeFormatter.parseLocalDate(DateTimeFormatter.java:798)
	at org.joda.time.format.TestDateTimeFormatter.testParseLocalDate_year_month_week_2011(TestDateTimeFormatter.java:460)

testParseLocalDate_year_month_week_2012(org.joda.time.format.TestDateTimeFormatter)  Time elapsed: 0 sec  <<< ERROR!
java.lang.IllegalArgumentException: Invalid format: "2012-01-01" is malformed at "-01-01"
	at org.joda.time.format.DateTimeFormatter.parseLocalDateTime(DateTimeFormatter.java:854)
	at org.joda.time.format.DateTimeFormatter.parseLocalDate(DateTimeFormatter.java:798)
	at org.joda.time.format.TestDateTimeFormatter.testParseLocalDate_year_month_week_2012(TestDateTimeFormatter.java:466)

testParseLocalDate_year_month_week_2013(org.joda.time.format.TestDateTimeFormatter)  Time elapsed: 0.001 sec  <<< ERROR!
java.lang.IllegalArgumentException: Invalid format: "2013-01-01" is malformed at "-01-01"
	at org.joda.time.format.DateTimeFormatter.parseLocalDateTime(DateTimeFormatter.java:854)
	at org.joda.time.format.DateTimeFormatter.parseLocalDate(DateTimeFormatter.java:798)
	at org.joda.time.format.TestDateTimeFormatter.testParseLocalDate_year_month_week_2013(TestDateTimeFormatter.java:472)

testParseLocalDate_year_month_week_2014(org.joda.time.format.TestDateTimeFormatter)  Time elapsed: 0.001 sec  <<< ERROR!
java.lang.IllegalArgumentException: Invalid format: "2014-01-01" is malformed at "-01-01"
	at org.joda.time.format.DateTimeFormatter.parseLocalDateTime(DateTimeFormatter.java:854)
	at org.joda.time.format.DateTimeFormatter.parseLocalDate(DateTimeFormatter.java:798)
	at org.joda.time.format.TestDateTimeFormatter.testParseLocalDate_year_month_week_2014(TestDateTimeFormatter.java:478)

testParseLocalDate_year_month_week_2015(org.joda.time.format.TestDateTimeFormatter)  Time elapsed: 0.001 sec  <<< ERROR!
java.lang.IllegalArgumentException: Invalid format: "2015-01-01" is malformed at "-01-01"
	at org.joda.time.format.DateTimeFormatter.parseLocalDateTime(DateTimeFormatter.java:854)
	at org.joda.time.format.DateTimeFormatter.parseLocalDate(DateTimeFormatter.java:798)
	at org.joda.time.format.TestDateTimeFormatter.testParseLocalDate_year_month_week_2015(TestDateTimeFormatter.java:484)

testParseLocalDate_year_month_week_2016(org.joda.time.format.TestDateTimeFormatter)  Time elapsed: 0 sec  <<< ERROR!
java.lang.IllegalArgumentException: Invalid format: "2016-01-01" is malformed at "-01-01"
	at org.joda.time.format.DateTimeFormatter.parseLocalDateTime(DateTimeFormatter.java:854)
	at org.joda.time.format.DateTimeFormatter.parseLocalDate(DateTimeFormatter.java:798)
	at org.joda.time.format.TestDateTimeFormatter.testParseLocalDate_year_month_week_2016(TestDateTimeFormatter.java:490)

testParseLocalDateTime_monthDay_feb29(org.joda.time.format.TestDateTimeFormatter)  Time elapsed: 0 sec  <<< ERROR!
java.lang.IllegalArgumentException: Invalid format: "2 29 13 40" is malformed at " 29 13 40"
	at org.joda.time.format.DateTimeFormatter.parseLocalDateTime(DateTimeFormatter.java:854)
	at org.joda.time.format.TestDateTimeFormatter.testParseLocalDateTime_monthDay_feb29(TestDateTimeFormatter.java:526)

testParseLocalDateTime_monthDay_withDefaultYear_feb29(org.joda.time.format.TestDateTimeFormatter)  Time elapsed: 0.001 sec  <<< ERROR!
java.lang.IllegalArgumentException: Invalid format: "2 29 13 40" is malformed at " 29 13 40"
	at org.joda.time.format.DateTimeFormatter.parseLocalDateTime(DateTimeFormatter.java:854)
	at org.joda.time.format.TestDateTimeFormatter.testParseLocalDateTime_monthDay_withDefaultYear_feb29(TestDateTimeFormatter.java:537)

testFormatParse_zoneId_noColon(org.joda.time.format.TestDateTimeFormat)  Time elapsed: 0.001 sec  <<< FAILURE!
junit.framework.ComparisonFailure: expected:<01[:02 +0000]> but was:<01[]>
	at junit.framework.Assert.assertEquals(Assert.java:81)
	at junit.framework.Assert.assertEquals(Assert.java:87)
	at org.joda.time.format.TestDateTimeFormat.testFormatParse_zoneId_noColon(TestDateTimeFormat.java:1142)

testFormatParse_zoneId_noColon_parseZ(org.joda.time.format.TestDateTimeFormat)  Time elapsed: 0.001 sec  <<< ERROR!
java.lang.IllegalArgumentException: Invalid format: "01:02 Z" is malformed at ":02 Z"
	at org.joda.time.format.DateTimeFormatter.parseDateTime(DateTimeFormatter.java:899)
	at org.joda.time.format.TestDateTimeFormat.testFormatParse_zoneId_noColon_parseZ(TestDateTimeFormat.java:1150)

testFormatParse_zoneId_colon_parseZ(org.joda.time.format.TestDateTimeFormat)  Time elapsed: 0 sec  <<< ERROR!
java.lang.IllegalArgumentException: Invalid format: "01:02 Z" is malformed at ":02 Z"
	at org.joda.time.format.DateTimeFormatter.parseDateTime(DateTimeFormatter.java:899)
	at org.joda.time.format.TestDateTimeFormat.testFormatParse_zoneId_colon_parseZ(TestDateTimeFormat.java:1166)

testFormat_yearOfEraParse(org.joda.time.format.TestDateTimeFormat)  Time elapsed: 0.001 sec  <<< ERROR!
java.lang.IllegalArgumentException: Invalid format: "2005-10 AD" is malformed at "-10 AD"
	at org.joda.time.format.DateTimeFormatter.parseDateTime(DateTimeFormatter.java:899)
	at org.joda.time.format.TestDateTimeFormat.testFormat_yearOfEraParse(TestDateTimeFormat.java:200)

testFormat_other(org.joda.time.format.TestDateTimeFormat)  Time elapsed: 0 sec  <<< FAILURE!
junit.framework.ComparisonFailure: expected:<[Hell]o '> but was:<[']o '>
	at junit.framework.Assert.assertEquals(Assert.java:81)
	at junit.framework.Assert.assertEquals(Assert.java:87)
	at org.joda.time.format.TestDateTimeFormat.testFormat_other(TestDateTimeFormat.java:819)

testFormat_invalid(org.joda.time.format.TestDateTimeFormat)  Time elapsed: 0 sec  <<< FAILURE!
junit.framework.AssertionFailedError
	at junit.framework.Assert.fail(Assert.java:47)
	at junit.framework.Assert.fail(Assert.java:53)
	at org.joda.time.format.TestDateTimeFormat.testFormat_invalid(TestDateTimeFormat.java:837)

testFormat_samples(org.joda.time.format.TestDateTimeFormat)  Time elapsed: 0.001 sec  <<< FAILURE!
junit.framework.ComparisonFailure: expected:<2004[-06-09 10.20.30]> but was:<2004[]>
	at junit.framework.Assert.assertEquals(Assert.java:81)
	at junit.framework.Assert.assertEquals(Assert.java:87)
	at org.joda.time.format.TestDateTimeFormat.testFormat_samples(TestDateTimeFormat.java:844)

testFormat_shortBasicParse(org.joda.time.format.TestDateTimeFormat)  Time elapsed: 0.001 sec  <<< ERROR!
java.lang.IllegalArgumentException: Invalid format: "04/03/09" is malformed at "/03/09"
	at org.joda.time.format.DateTimeFormatter.parseDateTime(DateTimeFormatter.java:899)
	at org.joda.time.format.TestDateTimeFormat.testFormat_shortBasicParse(TestDateTimeFormat.java:861)

testParse_pivotYear(org.joda.time.format.TestDateTimeFormat)  Time elapsed: 0.001 sec  <<< ERROR!
java.lang.IllegalArgumentException: Invalid format: "25.12.15" is malformed at ".12.15"
	at org.joda.time.format.DateTimeFormatter.parseDateTime(DateTimeFormatter.java:899)
	at org.joda.time.format.TestDateTimeFormat.testParse_pivotYear(TestDateTimeFormat.java:869)

testParse_pivotYear_ignored4DigitYear(org.joda.time.format.TestDateTimeFormat)  Time elapsed: 0.001 sec  <<< ERROR!
java.lang.IllegalArgumentException: Invalid format: "25.12.15" is malformed at ".12.15"
	at org.joda.time.format.DateTimeFormatter.parseDateTime(DateTimeFormatter.java:899)
	at org.joda.time.format.TestDateTimeFormat.testParse_pivotYear_ignored4DigitYear(TestDateTimeFormat.java:882)

testFormatParse_textMonthJanShort_UK(org.joda.time.format.TestDateTimeFormat)  Time elapsed: 0 sec  <<< FAILURE!
junit.framework.ComparisonFailure: expected:<23[]> but was:<23[ Jan 2007]>
	at junit.framework.Assert.assertEquals(Assert.java:81)
	at junit.framework.Assert.assertEquals(Assert.java:87)
	at org.joda.time.format.TestDateTimeFormat.testFormatParse_textMonthJanShort_UK(TestDateTimeFormat.java:898)

testFormatParse_textMonthJanShortLowerCase_UK(org.joda.time.format.TestDateTimeFormat)  Time elapsed: 0 sec  <<< ERROR!
java.lang.IllegalArgumentException: Invalid format: "23 jan 2007" is malformed at " jan 2007"
	at org.joda.time.format.DateTimeFormatter.parseDateTime(DateTimeFormatter.java:899)
	at org.joda.time.format.TestDateTimeFormat.testFormatParse_textMonthJanShortLowerCase_UK(TestDateTimeFormat.java:906)

testFormatParse_textMonthJanShortUpperCase_UK(org.joda.time.format.TestDateTimeFormat)  Time elapsed: 0.001 sec  <<< ERROR!
java.lang.IllegalArgumentException: Invalid format: "23 JAN 2007" is malformed at " JAN 2007"
	at org.joda.time.format.DateTimeFormatter.parseDateTime(DateTimeFormatter.java:899)
	at org.joda.time.format.TestDateTimeFormat.testFormatParse_textMonthJanShortUpperCase_UK(TestDateTimeFormat.java:913)

testParse_textMonthJanLong_UK(org.joda.time.format.TestDateTimeFormat)  Time elapsed: 0 sec  <<< ERROR!
java.lang.IllegalArgumentException: Invalid format: "23 January 2007" is malformed at " January 2007"
	at org.joda.time.format.DateTimeFormatter.parseDateTime(DateTimeFormatter.java:899)
	at org.joda.time.format.TestDateTimeFormat.testParse_textMonthJanLong_UK(TestDateTimeFormat.java:921)

testFormatParse_textMonthJanLongLowerCase_UK(org.joda.time.format.TestDateTimeFormat)  Time elapsed: 0.001 sec  <<< ERROR!
java.lang.IllegalArgumentException: Invalid format: "23 january 2007" is malformed at " january 2007"
	at org.joda.time.format.DateTimeFormatter.parseDateTime(DateTimeFormatter.java:899)
	at org.joda.time.format.TestDateTimeFormat.testFormatParse_textMonthJanLongLowerCase_UK(TestDateTimeFormat.java:928)

testFormatParse_textMonthJanLongUpperCase_UK(org.joda.time.format.TestDateTimeFormat)  Time elapsed: 0.001 sec  <<< ERROR!
java.lang.IllegalArgumentException: Invalid format: "23 JANUARY 2007" is malformed at " JANUARY 2007"
	at org.joda.time.format.DateTimeFormatter.parseDateTime(DateTimeFormatter.java:899)
	at org.joda.time.format.TestDateTimeFormat.testFormatParse_textMonthJanLongUpperCase_UK(TestDateTimeFormat.java:935)

testFormatParse_textMonthJanShort_France(org.joda.time.format.TestDateTimeFormat)  Time elapsed: 0 sec  <<< FAILURE!
junit.framework.ComparisonFailure: expected:<23[ janv. 2007]> but was:<23[]>
	at junit.framework.Assert.assertEquals(Assert.java:81)
	at junit.framework.Assert.assertEquals(Assert.java:87)
	at org.joda.time.format.TestDateTimeFormat.testFormatParse_textMonthJanShort_France(TestDateTimeFormat.java:944)

testFormatParse_textMonthJanLong_France(org.joda.time.format.TestDateTimeFormat)  Time elapsed: 0.001 sec  <<< ERROR!
java.lang.IllegalArgumentException: Invalid format: "23 janvier 2007" is malformed at " janvier 2007"
	at org.joda.time.format.DateTimeFormatter.parseDateTime(DateTimeFormatter.java:899)
	at org.joda.time.format.TestDateTimeFormat.testFormatParse_textMonthJanLong_France(TestDateTimeFormat.java:953)

testFormatParse_textMonthApr_France(org.joda.time.format.TestDateTimeFormat)  Time elapsed: 0.001 sec  <<< FAILURE!
junit.framework.ComparisonFailure: expected:<23[ févr. 2007]> but was:<23[]>
	at junit.framework.Assert.assertEquals(Assert.java:81)
	at junit.framework.Assert.assertEquals(Assert.java:87)
	at org.joda.time.format.TestDateTimeFormat.testFormatParse_textMonthApr_France(TestDateTimeFormat.java:962)

testFormatParse_textMonthAtEnd_France(org.joda.time.format.TestDateTimeFormat)  Time elapsed: 0 sec  <<< FAILURE!
junit.framework.ComparisonFailure: expected:<23[ juin]> but was:<23[]>
	at junit.framework.Assert.assertEquals(Assert.java:81)
	at junit.framework.Assert.assertEquals(Assert.java:87)
	at org.joda.time.format.TestDateTimeFormat.testFormatParse_textMonthAtEnd_France(TestDateTimeFormat.java:972)

testFormatParse_textMonthAtEnd_France_withSpecifiedDefault(org.joda.time.format.TestDateTimeFormat)  Time elapsed: 0.002 sec  <<< FAILURE!
junit.framework.ComparisonFailure: expected:<23[ juin]> but was:<23[]>
	at junit.framework.Assert.assertEquals(Assert.java:81)
	at junit.framework.Assert.assertEquals(Assert.java:87)
	at org.joda.time.format.TestDateTimeFormat.testFormatParse_textMonthAtEnd_France_withSpecifiedDefault(TestDateTimeFormat.java:982)

testFormatParse_textMonthApr_Korean(org.joda.time.format.TestDateTimeFormat)  Time elapsed: 0.007 sec  <<< FAILURE!
junit.framework.AssertionFailedError: expected:<2007-03-08T22:00:00.000Z> but was:<2000-12-28T00:00:00.000Z>
	at junit.framework.Assert.fail(Assert.java:47)
	at junit.framework.Assert.failNotEquals(Assert.java:280)
	at junit.framework.Assert.assertEquals(Assert.java:64)
	at junit.framework.Assert.assertEquals(Assert.java:71)
	at org.joda.time.format.TestDateTimeFormat.testFormatParse_textMonthApr_Korean(TestDateTimeFormat.java:993)

testFormatParse_zoneId_colon(org.joda.time.format.TestDateTimeFormat)  Time elapsed: 0 sec  <<< FAILURE!
junit.framework.ComparisonFailure: expected:<01[:02 +00:00]> but was:<01[]>
	at junit.framework.Assert.assertEquals(Assert.java:81)
	at junit.framework.Assert.assertEquals(Assert.java:87)
	at org.joda.time.format.TestDateTimeFormat.testFormatParse_zoneId_colon(TestDateTimeFormat.java:1158)

testForStyle_fullDateTime(org.joda.time.format.TestDateTimeFormatStyle)  Time elapsed: 0.009 sec  <<< FAILURE!
junit.framework.ComparisonFailure: expected:<Wednesday[, 9 June 2004 10:20:30 o'clock BST]> but was:<Wednesday[ o'k]>
	at junit.framework.Assert.assertEquals(Assert.java:81)
	at junit.framework.Assert.assertEquals(Assert.java:87)
	at org.joda.time.format.TestDateTimeFormatStyle.testForStyle_fullDateTime(TestDateTimeFormatStyle.java:295)

testForStyle_shortMediumDateTime(org.joda.time.format.TestDateTimeFormatStyle)  Time elapsed: 0.001 sec  <<< FAILURE!
junit.framework.ComparisonFailure: expected:<09[/06/04 10:20:30]> but was:<09[]>
	at junit.framework.Assert.assertEquals(Assert.java:81)
	at junit.framework.Assert.assertEquals(Assert.java:87)
	at org.joda.time.format.TestDateTimeFormatStyle.testForStyle_shortMediumDateTime(TestDateTimeFormatStyle.java:307)

testForStyle_shortLongDateTime(org.joda.time.format.TestDateTimeFormatStyle)  Time elapsed: 0 sec  <<< FAILURE!
junit.framework.ComparisonFailure: expected:<09[/06/04 10:20:30 BST]> but was:<09[]>
	at junit.framework.Assert.assertEquals(Assert.java:81)
	at junit.framework.Assert.assertEquals(Assert.java:87)
	at org.joda.time.format.TestDateTimeFormatStyle.testForStyle_shortLongDateTime(TestDateTimeFormatStyle.java:318)

testForStyle_shortFullDateTime(org.joda.time.format.TestDateTimeFormatStyle)  Time elapsed: 0.001 sec  <<< FAILURE!
junit.framework.ComparisonFailure: expected:<09[/06/04 10:20:30 o'clock BST]> but was:<09[ o'k]>
	at junit.framework.Assert.assertEquals(Assert.java:81)
	at junit.framework.Assert.assertEquals(Assert.java:87)
	at org.joda.time.format.TestDateTimeFormatStyle.testForStyle_shortFullDateTime(TestDateTimeFormatStyle.java:329)

testForStyle_mediumShortDateTime(org.joda.time.format.TestDateTimeFormatStyle)  Time elapsed: 0.001 sec  <<< FAILURE!
junit.framework.ComparisonFailure: expected:<09[-Jun-2004 10:20]> but was:<09[]>
	at junit.framework.Assert.assertEquals(Assert.java:81)
	at junit.framework.Assert.assertEquals(Assert.java:87)
	at org.joda.time.format.TestDateTimeFormatStyle.testForStyle_mediumShortDateTime(TestDateTimeFormatStyle.java:341)

testForStyle_mediumLongDateTime(org.joda.time.format.TestDateTimeFormatStyle)  Time elapsed: 0.001 sec  <<< FAILURE!
junit.framework.ComparisonFailure: expected:<09[-Jun-2004 10:20:30 BST]> but was:<09[]>
	at junit.framework.Assert.assertEquals(Assert.java:81)
	at junit.framework.Assert.assertEquals(Assert.java:87)
	at org.joda.time.format.TestDateTimeFormatStyle.testForStyle_mediumLongDateTime(TestDateTimeFormatStyle.java:352)

testForStyle_mediumFullDateTime(org.joda.time.format.TestDateTimeFormatStyle)  Time elapsed: 0 sec  <<< FAILURE!
junit.framework.ComparisonFailure: expected:<09[-Jun-2004 10:20:30 o'clock BST]> but was:<09[ o'k]>
	at junit.framework.Assert.assertEquals(Assert.java:81)
	at junit.framework.Assert.assertEquals(Assert.java:87)
	at org.joda.time.format.TestDateTimeFormatStyle.testForStyle_mediumFullDateTime(TestDateTimeFormatStyle.java:363)

testForStyle_shortDate(org.joda.time.format.TestDateTimeFormatStyle)  Time elapsed: 0.001 sec  <<< FAILURE!
junit.framework.ComparisonFailure: expected:<09[/06/04]> but was:<09[]>
	at junit.framework.Assert.assertEquals(Assert.java:81)
	at junit.framework.Assert.assertEquals(Assert.java:87)
	at org.joda.time.format.TestDateTimeFormatStyle.testForStyle_shortDate(TestDateTimeFormatStyle.java:133)

testForStyle_shortTime(org.joda.time.format.TestDateTimeFormatStyle)  Time elapsed: 0.001 sec  <<< FAILURE!
junit.framework.ComparisonFailure: expected:<10[:20]> but was:<10[]>
	at junit.framework.Assert.assertEquals(Assert.java:81)
	at junit.framework.Assert.assertEquals(Assert.java:87)
	at org.joda.time.format.TestDateTimeFormatStyle.testForStyle_shortTime(TestDateTimeFormatStyle.java:150)

testForStyle_shortDateTime(org.joda.time.format.TestDateTimeFormatStyle)  Time elapsed: 0.001 sec  <<< FAILURE!
junit.framework.ComparisonFailure: expected:<09[/06/04 10:20]> but was:<09[]>
	at junit.framework.Assert.assertEquals(Assert.java:81)
	at junit.framework.Assert.assertEquals(Assert.java:87)
	at org.joda.time.format.TestDateTimeFormatStyle.testForStyle_shortDateTime(TestDateTimeFormatStyle.java:171)

testForStyle_mediumDate(org.joda.time.format.TestDateTimeFormatStyle)  Time elapsed: 0.001 sec  <<< FAILURE!
junit.framework.ComparisonFailure: expected:<09[-Jun-2004]> but was:<09[]>
	at junit.framework.Assert.assertEquals(Assert.java:81)
	at junit.framework.Assert.assertEquals(Assert.java:87)
	at org.joda.time.format.TestDateTimeFormatStyle.testForStyle_mediumDate(TestDateTimeFormatStyle.java:189)

testForStyle_mediumTime(org.joda.time.format.TestDateTimeFormatStyle)  Time elapsed: 0.001 sec  <<< FAILURE!
junit.framework.ComparisonFailure: expected:<10[:20:30]> but was:<10[]>
	at junit.framework.Assert.assertEquals(Assert.java:81)
	at junit.framework.Assert.assertEquals(Assert.java:87)
	at org.joda.time.format.TestDateTimeFormatStyle.testForStyle_mediumTime(TestDateTimeFormatStyle.java:202)

testForStyle_mediumDateTime(org.joda.time.format.TestDateTimeFormatStyle)  Time elapsed: 0.001 sec  <<< FAILURE!
junit.framework.ComparisonFailure: expected:<09[-Jun-2004 10:20:30]> but was:<09[]>
	at junit.framework.Assert.assertEquals(Assert.java:81)
	at junit.framework.Assert.assertEquals(Assert.java:87)
	at org.joda.time.format.TestDateTimeFormatStyle.testForStyle_mediumDateTime(TestDateTimeFormatStyle.java:215)

testForStyle_longDate(org.joda.time.format.TestDateTimeFormatStyle)  Time elapsed: 0.001 sec  <<< FAILURE!
junit.framework.ComparisonFailure: expected:<09[ June 2004]> but was:<09[]>
	at junit.framework.Assert.assertEquals(Assert.java:81)
	at junit.framework.Assert.assertEquals(Assert.java:87)
	at org.joda.time.format.TestDateTimeFormatStyle.testForStyle_longDate(TestDateTimeFormatStyle.java:229)

testForStyle_longTime(org.joda.time.format.TestDateTimeFormatStyle)  Time elapsed: 0.001 sec  <<< FAILURE!
junit.framework.ComparisonFailure: expected:<10[:20:30 BST]> but was:<10[]>
	at junit.framework.Assert.assertEquals(Assert.java:81)
	at junit.framework.Assert.assertEquals(Assert.java:87)
	at org.joda.time.format.TestDateTimeFormatStyle.testForStyle_longTime(TestDateTimeFormatStyle.java:242)

testForStyle_longDateTime(org.joda.time.format.TestDateTimeFormatStyle)  Time elapsed: 0 sec  <<< FAILURE!
junit.framework.ComparisonFailure: expected:<09[ June 2004 10:20:30 BST]> but was:<09[]>
	at junit.framework.Assert.assertEquals(Assert.java:81)
	at junit.framework.Assert.assertEquals(Assert.java:87)
	at org.joda.time.format.TestDateTimeFormatStyle.testForStyle_longDateTime(TestDateTimeFormatStyle.java:255)

testForStyle_fullDate(org.joda.time.format.TestDateTimeFormatStyle)  Time elapsed: 0.001 sec  <<< FAILURE!
junit.framework.ComparisonFailure: expected:<Wednesday[, 9 June 2004]> but was:<Wednesday[]>
	at junit.framework.Assert.assertEquals(Assert.java:81)
	at junit.framework.Assert.assertEquals(Assert.java:87)
	at org.joda.time.format.TestDateTimeFormatStyle.testForStyle_fullDate(TestDateTimeFormatStyle.java:269)

testForStyle_fullTime(org.joda.time.format.TestDateTimeFormatStyle)  Time elapsed: 0.001 sec  <<< FAILURE!
junit.framework.ComparisonFailure: expected:<10[:20:30 o'clock BST]> but was:<10[ o'k]>
	at junit.framework.Assert.assertEquals(Assert.java:81)
	at junit.framework.Assert.assertEquals(Assert.java:87)
	at org.joda.time.format.TestDateTimeFormatStyle.testForStyle_fullTime(TestDateTimeFormatStyle.java:282)

test_printParseZoneTokyo(org.joda.time.format.TestDateTimeFormatterBuilder)  Time elapsed: 0.001 sec  <<< FAILURE!
junit.framework.ComparisonFailure: expected:<2007[-03-04 12:30 ]Asia/Tokyo> but was:<2007[]Asia/Tokyo>
	at junit.framework.Assert.assertEquals(Assert.java:81)
	at junit.framework.Assert.assertEquals(Assert.java:87)
	at org.joda.time.format.TestDateTimeFormatterBuilder.test_printParseZoneTokyo(TestDateTimeFormatterBuilder.java:413)

test_printParseZoneParis(org.joda.time.format.TestDateTimeFormatterBuilder)  Time elapsed: 0 sec  <<< FAILURE!
junit.framework.ComparisonFailure: expected:<2007[-03-04 12:30 ]Europe/Paris> but was:<2007[]Europe/Paris>
	at junit.framework.Assert.assertEquals(Assert.java:81)
	at junit.framework.Assert.assertEquals(Assert.java:87)
	at org.joda.time.format.TestDateTimeFormatterBuilder.test_printParseZoneParis(TestDateTimeFormatterBuilder.java:423)

test_printParseZoneDawsonCreek(org.joda.time.format.TestDateTimeFormatterBuilder)  Time elapsed: 0.001 sec  <<< FAILURE!
junit.framework.ComparisonFailure: expected:<2007[-03-04 12:30 ]America/Dawson_Creek> but was:<2007[]America/Dawson_Creek>
	at junit.framework.Assert.assertEquals(Assert.java:81)
	at junit.framework.Assert.assertEquals(Assert.java:87)
	at org.joda.time.format.TestDateTimeFormatterBuilder.test_printParseZoneDawsonCreek(TestDateTimeFormatterBuilder.java:434)

test_printParseZoneBahiaBanderas(org.joda.time.format.TestDateTimeFormatterBuilder)  Time elapsed: 0.002 sec  <<< FAILURE!
junit.framework.ComparisonFailure: expected:<2007[-03-04 12:30 ]America/Bahia_Bander...> but was:<2007[]America/Bahia_Bander...>
	at junit.framework.Assert.assertEquals(Assert.java:81)
	at junit.framework.Assert.assertEquals(Assert.java:87)
	at org.joda.time.format.TestDateTimeFormatterBuilder.test_printParseZoneBahiaBanderas(TestDateTimeFormatterBuilder.java:444)

test_printParseOffset(org.joda.time.format.TestDateTimeFormatterBuilder)  Time elapsed: 0 sec  <<< FAILURE!
junit.framework.ComparisonFailure: expected:<2007[-03-04 12:30 ]+09:00> but was:<2007[]+09:00>
	at junit.framework.Assert.assertEquals(Assert.java:81)
	at junit.framework.Assert.assertEquals(Assert.java:87)
	at org.joda.time.format.TestDateTimeFormatterBuilder.test_printParseOffset(TestDateTimeFormatterBuilder.java:454)

test_printParseOffsetAndZone(org.joda.time.format.TestDateTimeFormatterBuilder)  Time elapsed: 0.001 sec  <<< FAILURE!
junit.framework.ComparisonFailure: expected:<2007[-03-04 12:30 ]+09:00 Asia/Tokyo> but was:<2007[]+09:00 Asia/Tokyo>
	at junit.framework.Assert.assertEquals(Assert.java:81)
	at junit.framework.Assert.assertEquals(Assert.java:87)
	at org.joda.time.format.TestDateTimeFormatterBuilder.test_printParseOffsetAndZone(TestDateTimeFormatterBuilder.java:466)

test_parseWrongOffset(org.joda.time.format.TestDateTimeFormatterBuilder)  Time elapsed: 0.001 sec  <<< ERROR!
java.lang.IllegalArgumentException: Invalid format: "2007-03-04 12:30 +07:00" is malformed at "-04 12:30 +07:00"
	at org.joda.time.format.DateTimeFormatter.parseDateTime(DateTimeFormatter.java:899)
	at org.joda.time.format.TestDateTimeFormatterBuilder.test_parseWrongOffset(TestDateTimeFormatterBuilder.java:479)

test_parseWrongOffsetAndZone(org.joda.time.format.TestDateTimeFormatterBuilder)  Time elapsed: 0 sec  <<< ERROR!
java.lang.IllegalArgumentException: Invalid format: "2007-03-04 12:30 +07:00 Asia/Tokyo" is malformed at "-04 12:30 +07:00 Asia/Tokyo"
	at org.joda.time.format.DateTimeFormatter.parseDateTime(DateTimeFormatter.java:899)
	at org.joda.time.format.TestDateTimeFormatterBuilder.test_parseWrongOffsetAndZone(TestDateTimeFormatterBuilder.java:493)

test_localPrintParseZoneTokyo(org.joda.time.format.TestDateTimeFormatterBuilder)  Time elapsed: 0 sec  <<< FAILURE!
junit.framework.ComparisonFailure: expected:<2007[-03-04 12:30 ]Asia/Tokyo> but was:<2007[]Asia/Tokyo>
	at junit.framework.Assert.assertEquals(Assert.java:81)
	at junit.framework.Assert.assertEquals(Assert.java:87)
	at org.joda.time.format.TestDateTimeFormatterBuilder.test_localPrintParseZoneTokyo(TestDateTimeFormatterBuilder.java:507)

test_localPrintParseOffset(org.joda.time.format.TestDateTimeFormatterBuilder)  Time elapsed: 0 sec  <<< FAILURE!
junit.framework.ComparisonFailure: expected:<2007[-03-04 12:30 ]+09:00> but was:<2007[]+09:00>
	at junit.framework.Assert.assertEquals(Assert.java:81)
	at junit.framework.Assert.assertEquals(Assert.java:87)
	at org.joda.time.format.TestDateTimeFormatterBuilder.test_localPrintParseOffset(TestDateTimeFormatterBuilder.java:519)

test_localPrintParseOffsetAndZone(org.joda.time.format.TestDateTimeFormatterBuilder)  Time elapsed: 0 sec  <<< FAILURE!
junit.framework.ComparisonFailure: expected:<2007[-03-04 12:30 ]+09:00 Asia/Tokyo> but was:<2007[]+09:00 Asia/Tokyo>
	at junit.framework.Assert.assertEquals(Assert.java:81)
	at junit.framework.Assert.assertEquals(Assert.java:87)
	at org.joda.time.format.TestDateTimeFormatterBuilder.test_localPrintParseOffsetAndZone(TestDateTimeFormatterBuilder.java:533)

test_localParseWrongOffsetAndZone(org.joda.time.format.TestDateTimeFormatterBuilder)  Time elapsed: 0.001 sec  <<< ERROR!
java.lang.IllegalArgumentException: Invalid format: "2007-03-04 12:30 +07:00 Asia/Tokyo" is malformed at "-04 12:30 +07:00 Asia/Tokyo"
	at org.joda.time.format.DateTimeFormatter.parseLocalDateTime(DateTimeFormatter.java:854)
	at org.joda.time.format.TestDateTimeFormatterBuilder.test_localParseWrongOffsetAndZone(TestDateTimeFormatterBuilder.java:547)

test_printParseShortName(org.joda.time.format.TestDateTimeFormatterBuilder)  Time elapsed: 0 sec  <<< FAILURE!
junit.framework.ComparisonFailure: expected:<2011[-01-04 12:30 ]GMT> but was:<2011[]GMT>
	at junit.framework.Assert.assertEquals(Assert.java:81)
	at junit.framework.Assert.assertEquals(Assert.java:87)
	at org.joda.time.format.TestDateTimeFormatterBuilder.test_printParseShortName(TestDateTimeFormatterBuilder.java:563)

test_printParseShortNameWithLookup(org.joda.time.format.TestDateTimeFormatterBuilder)  Time elapsed: 0.001 sec  <<< FAILURE!
junit.framework.ComparisonFailure: expected:<2011[-01-04 12:30 ]GMT> but was:<2011[]GMT>
	at junit.framework.Assert.assertEquals(Assert.java:81)
	at junit.framework.Assert.assertEquals(Assert.java:87)
	at org.joda.time.format.TestDateTimeFormatterBuilder.test_printParseShortNameWithLookup(TestDateTimeFormatterBuilder.java:584)

test_printParseShortNameWithAutoLookup(org.joda.time.format.TestDateTimeFormatterBuilder)  Time elapsed: 0.001 sec  <<< FAILURE!
junit.framework.ComparisonFailure: expected:<2011[-01-04 12:30 ]EST> but was:<2011[]EST>
	at junit.framework.Assert.assertEquals(Assert.java:81)
	at junit.framework.Assert.assertEquals(Assert.java:87)
	at org.joda.time.format.TestDateTimeFormatterBuilder.test_printParseShortNameWithAutoLookup(TestDateTimeFormatterBuilder.java:605)

test_printParseLongName(org.joda.time.format.TestDateTimeFormatterBuilder)  Time elapsed: 0.001 sec  <<< FAILURE!
junit.framework.ComparisonFailure: expected:<2011[-01-04 12:30 ]Greenwich Mean Time> but was:<2011[]Greenwich Mean Time>
	at junit.framework.Assert.assertEquals(Assert.java:81)
	at junit.framework.Assert.assertEquals(Assert.java:87)
	at org.joda.time.format.TestDateTimeFormatterBuilder.test_printParseLongName(TestDateTimeFormatterBuilder.java:637)

test_printParseLongNameWithLookup(org.joda.time.format.TestDateTimeFormatterBuilder)  Time elapsed: 0.001 sec  <<< FAILURE!
junit.framework.ComparisonFailure: expected:<2011[-01-04 12:30 ]Greenwich Mean Time> but was:<2011[]Greenwich Mean Time>
	at junit.framework.Assert.assertEquals(Assert.java:81)
	at junit.framework.Assert.assertEquals(Assert.java:87)
	at org.joda.time.format.TestDateTimeFormatterBuilder.test_printParseLongNameWithLookup(TestDateTimeFormatterBuilder.java:658)


Results :

Failed tests: 
  org.joda.time.TestDateMidnight_Basics#testToString_DTFormatter ComparisonFailure
  org.joda.time.TestDateMidnight_Basics#testToString_String ComparisonFailure ex...
  org.joda.time.TestDateMidnight_Basics#testToString_String_String ComparisonFailure
  org.joda.time.TestDateTime_Basics#testToString_DTFormatter ComparisonFailure e...
  org.joda.time.TestDateTime_Basics#testToString_String ComparisonFailure expect...
  org.joda.time.TestDateTime_Basics#testToString_String_Locale ComparisonFailure
  org.joda.time.TestLocalDateTime_Basics#testToString_DTFormatter ComparisonFailure
  org.joda.time.TestLocalDateTime_Basics#testToString_String ComparisonFailure e...
  org.joda.time.TestLocalDateTime_Basics#testToString_String_Locale ComparisonFailure
  org.joda.time.TestLocalDate_Basics#testToString_DTFormatter ComparisonFailure ...
  org.joda.time.TestLocalDate_Basics#testToString_String ComparisonFailure expec...
  org.joda.time.TestLocalDate_Basics#testToString_String_Locale ComparisonFailure
  org.joda.time.TestLocalTime_Basics#testToString_DTFormatter ComparisonFailure ...
  org.joda.time.TestLocalTime_Basics#testToString_String ComparisonFailure expec...
  org.joda.time.TestLocalTime_Basics#testToString_String_Locale ComparisonFailure
  org.joda.time.TestMutableDateTime_Basics#testToString_DTFormatter ComparisonFailure
  org.joda.time.TestMutableDateTime_Basics#testToString_String ComparisonFailure
  org.joda.time.TestMutableDateTime_Basics#testToString_String_String ComparisonFailure
  org.joda.time.TestPartial_Basics#testToString_DTFormatter ComparisonFailure ex...
  org.joda.time.TestPartial_Basics#testToString_String ComparisonFailure expecte...
  org.joda.time.TestPartial_Basics#testToString_String_Locale ComparisonFailure ...
  org.joda.time.TestTimeOfDay_Basics#testToString_DTFormatter ComparisonFailure ...
  org.joda.time.TestTimeOfDay_Basics#testToString_String ComparisonFailure expec...
  org.joda.time.TestTimeOfDay_Basics#testToString_String_Locale ComparisonFailure
  org.joda.time.TestYearMonthDay_Basics#testToString_DTFormatter ComparisonFailure
  org.joda.time.TestYearMonthDay_Basics#testToString_String ComparisonFailure ex...
  org.joda.time.TestYearMonthDay_Basics#testToString_String_Locale ComparisonFailure
  org.joda.time.TestYearMonth_Basics#testToString_DTFormatter ComparisonFailure ...
  org.joda.time.TestYearMonth_Basics#testToString_String ComparisonFailure expec...
  org.joda.time.TestYearMonth_Basics#testToString_String_Locale ComparisonFailure
  org.joda.time.format.TestDateTimeFormat#testFormatParse_textMonthApr_France ComparisonFailure
  org.joda.time.format.TestDateTimeFormat#testFormatParse_textMonthApr_Korean AssertionFailedError
  org.joda.time.format.TestDateTimeFormat#testFormatParse_textMonthAtEnd_France ComparisonFailure
  org.joda.time.format.TestDateTimeFormat#testFormatParse_textMonthAtEnd_France_withSpecifiedDefault ComparisonFailure
  org.joda.time.format.TestDateTimeFormat#testFormatParse_textMonthJanShort_France ComparisonFailure
  org.joda.time.format.TestDateTimeFormat#testFormatParse_textMonthJanShort_UK ComparisonFailure
  org.joda.time.format.TestDateTimeFormat#testFormatParse_zoneId_colon ComparisonFailure
  org.joda.time.format.TestDateTimeFormat#testFormatParse_zoneId_noColon ComparisonFailure
  org.joda.time.format.TestDateTimeFormat#testFormat_invalid AssertionFailedError
  org.joda.time.format.TestDateTimeFormat#testFormat_other ComparisonFailure exp...
  org.joda.time.format.TestDateTimeFormat#testFormat_samples ComparisonFailure e...
  org.joda.time.format.TestDateTimeFormatStyle#testForStyle_fullDate ComparisonFailure
  org.joda.time.format.TestDateTimeFormatStyle#testForStyle_fullDateTime ComparisonFailure
  org.joda.time.format.TestDateTimeFormatStyle#testForStyle_fullTime ComparisonFailure
  org.joda.time.format.TestDateTimeFormatStyle#testForStyle_longDate ComparisonFailure
  org.joda.time.format.TestDateTimeFormatStyle#testForStyle_longDateTime ComparisonFailure
  org.joda.time.format.TestDateTimeFormatStyle#testForStyle_longTime ComparisonFailure
  org.joda.time.format.TestDateTimeFormatStyle#testForStyle_mediumDate ComparisonFailure
  org.joda.time.format.TestDateTimeFormatStyle#testForStyle_mediumDateTime ComparisonFailure
  org.joda.time.format.TestDateTimeFormatStyle#testForStyle_mediumFullDateTime ComparisonFailure
  org.joda.time.format.TestDateTimeFormatStyle#testForStyle_mediumLongDateTime ComparisonFailure
  org.joda.time.format.TestDateTimeFormatStyle#testForStyle_mediumShortDateTime ComparisonFailure
  org.joda.time.format.TestDateTimeFormatStyle#testForStyle_mediumTime ComparisonFailure
  org.joda.time.format.TestDateTimeFormatStyle#testForStyle_shortDate ComparisonFailure
  org.joda.time.format.TestDateTimeFormatStyle#testForStyle_shortDateTime ComparisonFailure
  org.joda.time.format.TestDateTimeFormatStyle#testForStyle_shortFullDateTime ComparisonFailure
  org.joda.time.format.TestDateTimeFormatStyle#testForStyle_shortLongDateTime ComparisonFailure
  org.joda.time.format.TestDateTimeFormatStyle#testForStyle_shortMediumDateTime ComparisonFailure
  org.joda.time.format.TestDateTimeFormatStyle#testForStyle_shortTime ComparisonFailure
  org.joda.time.format.TestDateTimeFormatter#testParseInto_monthDay_feb29 AssertionFailedError
  org.joda.time.format.TestDateTimeFormatter#testParseInto_monthDay_feb29_OfYear AssertionFailedError
  org.joda.time.format.TestDateTimeFormatter#testParseInto_monthDay_feb29_newYork AssertionFailedError
  org.joda.time.format.TestDateTimeFormatter#testParseInto_monthDay_feb29_newYork_endOfYear AssertionFailedError
  org.joda.time.format.TestDateTimeFormatter#testParseInto_monthDay_feb29_newYork_startOfYear AssertionFailedError
  org.joda.time.format.TestDateTimeFormatter#testParseInto_monthDay_feb29_startOfYear AssertionFailedError
  org.joda.time.format.TestDateTimeFormatter#testParseInto_monthDay_feb29_tokyo AssertionFailedError
  org.joda.time.format.TestDateTimeFormatter#testParseInto_monthDay_feb29_tokyo_endOfYear AssertionFailedError
  org.joda.time.format.TestDateTimeFormatter#testParseInto_monthDay_feb29_tokyo_startOfYear AssertionFailedError
  org.joda.time.format.TestDateTimeFormatter#testParseInto_monthDay_withDefaultYear_feb29 AssertionFailedError
  org.joda.time.format.TestDateTimeFormatter#testParseInto_monthDay_withDefaultYear_feb29_newYork AssertionFailedError
  org.joda.time.format.TestDateTimeFormatter#testParseInto_monthDay_withDefaultYear_feb29_newYork_endOfYear AssertionFailedError
  org.joda.time.format.TestDateTimeFormatter#testZoneNameNearTransition ComparisonFailure
  org.joda.time.format.TestDateTimeFormatter#testZoneShortNameNearTransition ComparisonFailure
  org.joda.time.format.TestDateTimeFormatterBuilder#test_localPrintParseOffset ComparisonFailure
  org.joda.time.format.TestDateTimeFormatterBuilder#test_localPrintParseOffsetAndZone ComparisonFailure
  org.joda.time.format.TestDateTimeFormatterBuilder#test_localPrintParseZoneTokyo ComparisonFailure
  org.joda.time.format.TestDateTimeFormatterBuilder#test_printParseLongName ComparisonFailure
  org.joda.time.format.TestDateTimeFormatterBuilder#test_printParseLongNameWithLookup ComparisonFailure
  org.joda.time.format.TestDateTimeFormatterBuilder#test_printParseOffset ComparisonFailure
  org.joda.time.format.TestDateTimeFormatterBuilder#test_printParseOffsetAndZone ComparisonFailure
  org.joda.time.format.TestDateTimeFormatterBuilder#test_printParseShortName ComparisonFailure
  org.joda.time.format.TestDateTimeFormatterBuilder#test_printParseShortNameWithAutoLookup ComparisonFailure
  org.joda.time.format.TestDateTimeFormatterBuilder#test_printParseShortNameWithLookup ComparisonFailure
  org.joda.time.format.TestDateTimeFormatterBuilder#test_printParseZoneBahiaBanderas ComparisonFailure
  org.joda.time.format.TestDateTimeFormatterBuilder#test_printParseZoneDawsonCreek ComparisonFailure
  org.joda.time.format.TestDateTimeFormatterBuilder#test_printParseZoneParis ComparisonFailure
  org.joda.time.format.TestDateTimeFormatterBuilder#test_printParseZoneTokyo ComparisonFailure
Tests in error: 
  org.joda.time.TestDateMidnight_Constructors#testParse_formatter IllegalArgumentException
  org.joda.time.TestDateTime_Constructors#testParse_formatter IllegalArgumentException
  org.joda.time.TestDays#testFactory_daysBetween_RPartial_MonthDay NoClassDefFoundError
  org.joda.time.TestInstant_Constructors#testParse_formatter IllegalArgumentException
  org.joda.time.TestLocalDateTime_Constructors#testParse_formatter IllegalArgumentException
  org.joda.time.TestLocalDate_Constructors#testParse_formatter IllegalArgumentException
  org.joda.time.TestLocalTime_Constructors#testParse_formatter IllegalArgumentException
  org.joda.time.TestMonthDay_Basics#testCompareTo NoClassDefFoundError Could not...
  org.joda.time.TestMonthDay_Basics#testEqualsHashCode NoClassDefFoundError Coul...
  org.joda.time.TestMonthDay_Basics#testGet NoClassDefFoundError Could not initi...
  org.joda.time.TestMonthDay_Basics#testGetField NoClassDefFoundError Could not ...
  org.joda.time.TestMonthDay_Basics#testGetFieldType NoClassDefFoundError Could ...
  org.joda.time.TestMonthDay_Basics#testGetFieldTypes NoClassDefFoundError Could...
  org.joda.time.TestMonthDay_Basics#testGetFields NoClassDefFoundError Could not...
  org.joda.time.TestMonthDay_Basics#testGetValue NoClassDefFoundError Could not ...
  org.joda.time.TestMonthDay_Basics#testGetValues NoClassDefFoundError Could not...
  org.joda.time.TestMonthDay_Basics#testIsAfter_MD NoClassDefFoundError Could no...
  org.joda.time.TestMonthDay_Basics#testIsBefore_MD NoClassDefFoundError Could n...
  org.joda.time.TestMonthDay_Basics#testIsEqual_MD NoClassDefFoundError Could no...
  org.joda.time.TestMonthDay_Basics#testIsSupported NoClassDefFoundError Could n...
  org.joda.time.TestMonthDay_Basics#testMinusDays_int NoClassDefFoundError Could...
  org.joda.time.TestMonthDay_Basics#testMinusDays_int_fromLeap NoClassDefFoundError
  org.joda.time.TestMonthDay_Basics#testMinusDays_int_negativeFromLeap NoClassDefFoundError
  org.joda.time.TestMonthDay_Basics#testMinusDays_int_toLeap NoClassDefFoundError
  org.joda.time.TestMonthDay_Basics#testMinusDays_int_wrapMonth NoClassDefFoundError
  org.joda.time.TestMonthDay_Basics#testMinusDays_int_wrapMonthIntoLastYear NoClassDefFoundError
  org.joda.time.TestMonthDay_Basics#testMinusDays_int_wrapMonthTwice NoClassDefFoundError
  org.joda.time.TestMonthDay_Basics#testMinusDays_int_wrapMonthTwiceIntoLastYear NoClassDefFoundError
  org.joda.time.TestMonthDay_Basics#testMinusDays_same NoClassDefFoundError Coul...
  org.joda.time.TestMonthDay_Basics#testMinusMonths_int NoClassDefFoundError Cou...
  org.joda.time.TestMonthDay_Basics#testMinusMonths_int_adjust NoClassDefFoundError
  org.joda.time.TestMonthDay_Basics#testMinusMonths_int_endOfMonthAdjust NoClassDefFoundError
  org.joda.time.TestMonthDay_Basics#testMinusMonths_int_fromLeap NoClassDefFoundError
  org.joda.time.TestMonthDay_Basics#testMinusMonths_int_negativeEndOfMonthAdjust NoClassDefFoundError
  org.joda.time.TestMonthDay_Basics#testMinusMonths_int_negativeFromLeap NoClassDefFoundError
  org.joda.time.TestMonthDay_Basics#testMinusMonths_int_same NoClassDefFoundError
  org.joda.time.TestMonthDay_Basics#testMinusMonths_int_wrap NoClassDefFoundError
  org.joda.time.TestMonthDay_Basics#testMinus_RP NoClassDefFoundError Could not ...
  org.joda.time.TestMonthDay_Basics#testPlusDays_int NoClassDefFoundError Could ...
  org.joda.time.TestMonthDay_Basics#testPlusDays_int_fromLeap NoClassDefFoundError
  org.joda.time.TestMonthDay_Basics#testPlusDays_int_negativeFromLeap NoClassDefFoundError
  org.joda.time.TestMonthDay_Basics#testPlusDays_int_toLeap NoClassDefFoundError
  org.joda.time.TestMonthDay_Basics#testPlusDays_int_wrap50 NoClassDefFoundError
  org.joda.time.TestMonthDay_Basics#testPlusDays_int_wrapMonth NoClassDefFoundError
  org.joda.time.TestMonthDay_Basics#testPlusDays_int_wrapMonthIntoNextYear NoClassDefFoundError
  org.joda.time.TestMonthDay_Basics#testPlusDays_int_wrapMonthTwice NoClassDefFoundError
  org.joda.time.TestMonthDay_Basics#testPlusDays_int_wrapMonthTwiceIntoNextYear NoClassDefFoundError
  org.joda.time.TestMonthDay_Basics#testPlusDays_same NoClassDefFoundError Could...
  org.joda.time.TestMonthDay_Basics#testPlusMonths_int NoClassDefFoundError Coul...
  org.joda.time.TestMonthDay_Basics#testPlusMonths_int_adjust NoClassDefFoundError
  org.joda.time.TestMonthDay_Basics#testPlusMonths_int_endOfMonthAdjust NoClassDefFoundError
  org.joda.time.TestMonthDay_Basics#testPlusMonths_int_fromLeap NoClassDefFoundError
  org.joda.time.TestMonthDay_Basics#testPlusMonths_int_negativeEndOfMonthAdjust NoClassDefFoundError
  org.joda.time.TestMonthDay_Basics#testPlusMonths_int_negativeFromLeap NoClassDefFoundError
  org.joda.time.TestMonthDay_Basics#testPlusMonths_int_same NoClassDefFoundError
  org.joda.time.TestMonthDay_Basics#testPlusMonths_int_wrap NoClassDefFoundError
  org.joda.time.TestMonthDay_Basics#testPlus_RP NoClassDefFoundError Could not i...
  org.joda.time.TestMonthDay_Basics#testProperty NoClassDefFoundError Could not ...
  org.joda.time.TestMonthDay_Basics#testSerialization NoClassDefFoundError Could...
  org.joda.time.TestMonthDay_Basics#testSize NoClassDefFoundError Could not init...
  org.joda.time.TestMonthDay_Basics#testToDateTime_RI NoClassDefFoundError Could...
  org.joda.time.TestMonthDay_Basics#testToDateTime_nullRI NoClassDefFoundError C...
  org.joda.time.TestMonthDay_Basics#testToLocalDate NoClassDefFoundError Could n...
  org.joda.time.TestMonthDay_Basics#testToString NoClassDefFoundError Could not ...
  org.joda.time.TestMonthDay_Basics#testToString_DTFormatter NoClassDefFoundError
  org.joda.time.TestMonthDay_Basics#testToString_String NoClassDefFoundError Cou...
  org.joda.time.TestMonthDay_Basics#testToString_String_Locale NoClassDefFoundError
  org.joda.time.TestMonthDay_Basics#testWithChronologyRetainFields_Chrono NoClassDefFoundError
  org.joda.time.TestMonthDay_Basics#testWithChronologyRetainFields_nullChrono NoClassDefFoundError
  org.joda.time.TestMonthDay_Basics#testWithChronologyRetainFields_sameChrono NoClassDefFoundError
  org.joda.time.TestMonthDay_Basics#testWithField NoClassDefFoundError Could not...
  org.joda.time.TestMonthDay_Basics#testWithFieldAdded NoClassDefFoundError Coul...
  org.joda.time.TestMonthDay_Basics#testWithFieldAdded_nullField_nonZero NoClassDefFoundError
  org.joda.time.TestMonthDay_Basics#testWithFieldAdded_nullField_zero NoClassDefFoundError
  org.joda.time.TestMonthDay_Basics#testWithFieldAdded_unknownField NoClassDefFoundError
  org.joda.time.TestMonthDay_Basics#testWithFieldAdded_zero NoClassDefFoundError
  org.joda.time.TestMonthDay_Basics#testWithField_nullField NoClassDefFoundError
  org.joda.time.TestMonthDay_Basics#testWithField_same NoClassDefFoundError Coul...
  org.joda.time.TestMonthDay_Basics#testWithField_unknownField NoClassDefFoundError
  org.joda.time.TestMonthDay_Basics#testWithers NoClassDefFoundError Could not i...
  org.joda.time.TestMonthDay_Constructors#testConstructor NoClassDefFoundError C...
  org.joda.time.TestMonthDay_Constructors#testConstructor_Chronology NoClassDefFoundError
  org.joda.time.TestMonthDay_Constructors#testConstructor_DateTimeZone NoClassDefFoundError
  org.joda.time.TestMonthDay_Constructors#testConstructor_Object NoClassDefFoundError
  org.joda.time.TestMonthDay_Constructors#testConstructor_ObjectString1 NoClassDefFoundError
  org.joda.time.TestMonthDay_Constructors#testConstructor_ObjectString5 NoClassDefFoundError
  org.joda.time.TestMonthDay_Constructors#testConstructor_ObjectStringEx1 NoClassDefFoundError
  org.joda.time.TestMonthDay_Constructors#testConstructor_ObjectStringEx2 NoClassDefFoundError
  org.joda.time.TestMonthDay_Constructors#testConstructor_ObjectStringEx3 NoClassDefFoundError
  org.joda.time.TestMonthDay_Constructors#testConstructor_ObjectStringEx4 NoClassDefFoundError
  org.joda.time.TestMonthDay_Constructors#testConstructor_Object_Chronology NoClassDefFoundError
  org.joda.time.TestMonthDay_Constructors#testConstructor_Object_nullChronology NoClassDefFoundError
  org.joda.time.TestMonthDay_Constructors#testConstructor_int_int NoClassDefFoundError
  org.joda.time.TestMonthDay_Constructors#testConstructor_int_int_Chronology NoClassDefFoundError
  org.joda.time.TestMonthDay_Constructors#testConstructor_int_int_nullChronology NoClassDefFoundError
  org.joda.time.TestMonthDay_Constructors#testConstructor_long1 NoClassDefFoundError
  org.joda.time.TestMonthDay_Constructors#testConstructor_long1_Chronology NoClassDefFoundError
  org.joda.time.TestMonthDay_Constructors#testConstructor_long2 NoClassDefFoundError
  org.joda.time.TestMonthDay_Constructors#testConstructor_long2_Chronology NoClassDefFoundError
  org.joda.time.TestMonthDay_Constructors#testConstructor_long_nullChronology NoClassDefFoundError
  org.joda.time.TestMonthDay_Constructors#testConstructor_nullChronology NoClassDefFoundError
  org.joda.time.TestMonthDay_Constructors#testConstructor_nullDateTimeZone NoClassDefFoundError
  org.joda.time.TestMonthDay_Constructors#testConstructor_nullObject NoClassDefFoundError
  org.joda.time.TestMonthDay_Constructors#testConstructor_nullObject_Chronology NoClassDefFoundError
  org.joda.time.TestMonthDay_Constructors#testConstructor_nullObject_nullChronology NoClassDefFoundError
  org.joda.time.TestMonthDay_Constructors#testFactory_FromCalendarFields NoClassDefFoundError
  org.joda.time.TestMonthDay_Constructors#testFactory_FromDateFields NoClassDefFoundError
  org.joda.time.TestMonthDay_Constructors#testParse_formatter NoClassDefFoundError
  org.joda.time.TestMonthDay_Constructors#testParse_noFormatter NoClassDefFoundError
  org.joda.time.TestMonthDay_Properties#testPropertyAddDayOfMonth NoClassDefFoundError
  org.joda.time.TestMonthDay_Properties#testPropertyAddMonthOfYear NoClassDefFoundError
  org.joda.time.TestMonthDay_Properties#testPropertyAddWrapFieldDayOfMonth NoClassDefFoundError
  org.joda.time.TestMonthDay_Properties#testPropertyAddWrapFieldMonthOfYear NoClassDefFoundError
  org.joda.time.TestMonthDay_Properties#testPropertyCompareToDayOfMonth NoClassDefFoundError
  org.joda.time.TestMonthDay_Properties#testPropertyCompareToMonthOfYear NoClassDefFoundError
  org.joda.time.TestMonthDay_Properties#testPropertyEquals NoClassDefFoundError ...
  org.joda.time.TestMonthDay_Properties#testPropertyEqualsHashCodeLenient NoClassDefFoundError
  org.joda.time.TestMonthDay_Properties#testPropertyEqualsHashCodeStrict NoClassDefFoundError
  org.joda.time.TestMonthDay_Properties#testPropertyGetDayOfMonth NoClassDefFoundError
  org.joda.time.TestMonthDay_Properties#testPropertyGetMaxMinValuesDayOfMonth NoClassDefFoundError
  org.joda.time.TestMonthDay_Properties#testPropertyGetMaxMinValuesMonthOfYear NoClassDefFoundError
  org.joda.time.TestMonthDay_Properties#testPropertyGetMonthOfYear NoClassDefFoundError
  org.joda.time.TestMonthDay_Properties#testPropertyHashCode NoClassDefFoundError
  org.joda.time.TestMonthDay_Properties#testPropertySetDayOfMonth NoClassDefFoundError
  org.joda.time.TestMonthDay_Properties#testPropertySetMonthOfYear NoClassDefFoundError
  org.joda.time.TestMonthDay_Properties#testPropertySetTextDayOfMonth NoClassDefFoundError
  org.joda.time.TestMonthDay_Properties#testPropertySetTextMonthOfYear NoClassDefFoundError
  org.joda.time.TestMonths#testFactory_monthsBetween_RPartial_MonthDay ExceptionInInitializerError
  org.joda.time.TestMutableDateTime_Constructors#testParse_formatter IllegalArgumentException
  org.joda.time.TestStringConvert#testMonthDay NoClassDefFoundError Could not in...
  org.joda.time.TestStringConvert#testMonthDay_leapDay NoClassDefFoundError Coul...
  org.joda.time.TestYearMonth_Constructors#testParse_formatter IllegalArgumentException
  org.joda.time.format.TestDateTimeFormat#testFormatParse_textMonthJanLongLowerCase_UK IllegalArgumentException
  org.joda.time.format.TestDateTimeFormat#testFormatParse_textMonthJanLongUpperCase_UK IllegalArgumentException
  org.joda.time.format.TestDateTimeFormat#testFormatParse_textMonthJanLong_France IllegalArgumentException
  org.joda.time.format.TestDateTimeFormat#testFormatParse_textMonthJanShortLowerCase_UK IllegalArgumentException
  org.joda.time.format.TestDateTimeFormat#testFormatParse_textMonthJanShortUpperCase_UK IllegalArgumentException
  org.joda.time.format.TestDateTimeFormat#testFormatParse_zoneId_colon_parseZ IllegalArgumentException
  org.joda.time.format.TestDateTimeFormat#testFormatParse_zoneId_noColon_parseZ IllegalArgumentException
  org.joda.time.format.TestDateTimeFormat#testFormat_shortBasicParse IllegalArgumentException
  org.joda.time.format.TestDateTimeFormat#testFormat_yearOfEraParse IllegalArgumentException
  org.joda.time.format.TestDateTimeFormat#testParse_pivotYear IllegalArgumentException
  org.joda.time.format.TestDateTimeFormat#testParse_pivotYear_ignored4DigitYear IllegalArgumentException
  org.joda.time.format.TestDateTimeFormat#testParse_textMonthJanLong_UK IllegalArgumentException
  org.joda.time.format.TestDateTimeFormatter#testParseLocalDateTime_monthDay_feb29 IllegalArgumentException
  org.joda.time.format.TestDateTimeFormatter#testParseLocalDateTime_monthDay_withDefaultYear_feb29 IllegalArgumentException
  org.joda.time.format.TestDateTimeFormatter#testParseLocalDate_monthDay_feb29 IllegalArgumentException
  org.joda.time.format.TestDateTimeFormatter#testParseLocalDate_monthDay_withDefaultYear_feb29 IllegalArgumentException
  org.joda.time.format.TestDateTimeFormatter#testParseLocalDate_weekyear_month_week_2010 IllegalArgumentException
  org.joda.time.format.TestDateTimeFormatter#testParseLocalDate_weekyear_month_week_2011 IllegalArgumentException
  org.joda.time.format.TestDateTimeFormatter#testParseLocalDate_weekyear_month_week_2012 IllegalArgumentException
  org.joda.time.format.TestDateTimeFormatter#testParseLocalDate_yearOfCentury IllegalArgumentException
  org.joda.time.format.TestDateTimeFormatter#testParseLocalDate_yearOfEra IllegalArgumentException
  org.joda.time.format.TestDateTimeFormatter#testParseLocalDate_year_month_week_2010 IllegalArgumentException
  org.joda.time.format.TestDateTimeFormatter#testParseLocalDate_year_month_week_2011 IllegalArgumentException
  org.joda.time.format.TestDateTimeFormatter#testParseLocalDate_year_month_week_2012 IllegalArgumentException
  org.joda.time.format.TestDateTimeFormatter#testParseLocalDate_year_month_week_2013 IllegalArgumentException
  org.joda.time.format.TestDateTimeFormatter#testParseLocalDate_year_month_week_2014 IllegalArgumentException
  org.joda.time.format.TestDateTimeFormatter#testParseLocalDate_year_month_week_2015 IllegalArgumentException
  org.joda.time.format.TestDateTimeFormatter#testParseLocalDate_year_month_week_2016 IllegalArgumentException
  org.joda.time.format.TestDateTimeFormatterBuilder#test_localParseWrongOffsetAndZone IllegalArgumentException
  org.joda.time.format.TestDateTimeFormatterBuilder#test_parseWrongOffset IllegalArgumentException
  org.joda.time.format.TestDateTimeFormatterBuilder#test_parseWrongOffsetAndZone IllegalArgumentException

Tests run: 4157, Failures: 87, Errors: 163, Skipped: 0

[INFO] ------------------------------------------------------------------------
[INFO] BUILD FAILURE
[INFO] ------------------------------------------------------------------------
[INFO] Total time: 16.000s
[INFO] Finished at: Thu Aug 06 06:06:45 BST 2015
[INFO] Final Memory: 10M/344M
[INFO] ------------------------------------------------------------------------
[ERROR] Failed to execute goal org.apache.maven.plugins:maven-surefire-plugin:2.18.1:test (default-test) on project joda-time: There are test failures.
[ERROR] 
[ERROR] Please refer to /home/perham/Study/LittleDarwin/Cases/joda-time-2.8.1/target/surefire-reports for the individual test results.
[ERROR] -> [Help 1]
[ERROR] 
[ERROR] To see the full stack trace of the errors, re-run Maven with the -e switch.
[ERROR] Re-run Maven using the -X switch to enable full debug logging.
[ERROR] 
[ERROR] For more information about the errors and possible solutions, please read the following articles:
[ERROR] [Help 1] http://cwiki.apache.org/confluence/display/MAVEN/MojoFailureException
