[INFO] Scanning for projects...
[INFO]                                                                         
[INFO] ------------------------------------------------------------------------
[INFO] Building Joda-Time 2.8.1
[INFO] ------------------------------------------------------------------------
[INFO] 
[INFO] --- maven-resources-plugin:2.7:resources (default-resources) @ joda-time ---
[INFO] Using 'UTF-8' encoding to copy filtered resources.
[INFO] Copying 2 resources to META-INF
[INFO] Copying 10 resources
[INFO] 
[INFO] --- maven-compiler-plugin:3.3:compile (default-compile) @ joda-time ---
[INFO] Changes detected - recompiling the module!
[INFO] Compiling 166 source files to /home/perham/Study/LittleDarwin/Cases/joda-time-2.8.1/target/classes
[INFO] 
[INFO] --- exec-maven-plugin:1.4.0:java (compile-tzdb) @ joda-time ---
Writing zoneinfo files
Writing ZoneInfoMap
[INFO] 
[INFO] --- maven-resources-plugin:2.7:testResources (default-testResources) @ joda-time ---
[INFO] Using 'UTF-8' encoding to copy filtered resources.
[INFO] Copying 34 resources
[INFO] 
[INFO] --- maven-compiler-plugin:3.3:testCompile (default-testCompile) @ joda-time ---
[INFO] Nothing to compile - all classes are up to date
[INFO] 
[INFO] --- maven-surefire-plugin:2.18.1:test (default-test) @ joda-time ---
[INFO] Surefire report directory: /home/perham/Study/LittleDarwin/Cases/joda-time-2.8.1/target/surefire-reports

-------------------------------------------------------
 T E S T S
-------------------------------------------------------
Running org.joda.time.TestAllPackages

TestBuddhistChronology.testCalendar

TestCopticChronology.testCalendar

TestEthiopicChronology.testCalendar

TestIslamicChronology.testCalendar

Testing Gregorian chronology over 1000 iterations
100% complete (i=1000)

Testing Julian chronology over 1000 iterations
100% complete (i=1000)
Writing zoneinfo files
Writing ZoneInfoMap
Tests run: 4157, Failures: 64, Errors: 40, Skipped: 0, Time elapsed: 5.314 sec <<< FAILURE! - in org.joda.time.TestAllPackages
testParse_formatter(org.joda.time.TestInstant_Constructors)  Time elapsed: 0.007 sec  <<< ERROR!
java.lang.IllegalArgumentException: Invalid format: "2010--30 06 13" is malformed at "--30 06 13"
	at org.joda.time.format.DateTimeFormatter.parseDateTime(DateTimeFormatter.java:899)
	at org.joda.time.Instant.parse(Instant.java:98)
	at org.joda.time.TestInstant_Constructors.testParse_formatter(TestInstant_Constructors.java:106)

testParse_formatter(org.joda.time.TestDateTime_Constructors)  Time elapsed: 0.001 sec  <<< ERROR!
java.lang.IllegalArgumentException: Invalid format: "2010--30 06 13" is malformed at "--30 06 13"
	at org.joda.time.format.DateTimeFormatter.parseDateTime(DateTimeFormatter.java:899)
	at org.joda.time.DateTime.parse(DateTime.java:160)
	at org.joda.time.TestDateTime_Constructors.testParse_formatter(TestDateTime_Constructors.java:178)

testToString_String_Locale(org.joda.time.TestDateTime_Basics)  Time elapsed: 0.01 sec  <<< FAILURE!
junit.framework.ComparisonFailure: expected:<Sun [9]/6> but was:<Sun [d]/6>
	at junit.framework.Assert.assertEquals(Assert.java:81)
	at junit.framework.Assert.assertEquals(Assert.java:87)
	at org.joda.time.TestDateTime_Basics.testToString_String_Locale(TestDateTime_Basics.java:518)

testParse_formatter(org.joda.time.TestMutableDateTime_Constructors)  Time elapsed: 0.001 sec  <<< ERROR!
java.lang.IllegalArgumentException: Invalid format: "2010--30 06 13" is malformed at "--30 06 13"
	at org.joda.time.format.DateTimeFormatter.parseDateTime(DateTimeFormatter.java:899)
	at org.joda.time.MutableDateTime.parse(MutableDateTime.java:160)
	at org.joda.time.TestMutableDateTime_Constructors.testParse_formatter(TestMutableDateTime_Constructors.java:163)

testToString_String_String(org.joda.time.TestMutableDateTime_Basics)  Time elapsed: 0.001 sec  <<< FAILURE!
junit.framework.ComparisonFailure: expected:<Sun [9]/6> but was:<Sun [d]/6>
	at junit.framework.Assert.assertEquals(Assert.java:81)
	at junit.framework.Assert.assertEquals(Assert.java:87)
	at org.joda.time.TestMutableDateTime_Basics.testToString_String_String(TestMutableDateTime_Basics.java:422)

testParse_formatter(org.joda.time.TestDateMidnight_Constructors)  Time elapsed: 0 sec  <<< ERROR!
java.lang.IllegalArgumentException: Invalid format: "2010--30 06" is malformed at "--30 06"
	at org.joda.time.format.DateTimeFormatter.parseDateTime(DateTimeFormatter.java:899)
	at org.joda.time.DateMidnight.parse(DateMidnight.java:152)
	at org.joda.time.TestDateMidnight_Constructors.testParse_formatter(TestDateMidnight_Constructors.java:179)

testToString_String_String(org.joda.time.TestDateMidnight_Basics)  Time elapsed: 0.001 sec  <<< FAILURE!
junit.framework.ComparisonFailure: expected:<Sun [9]/6> but was:<Sun [d]/6>
	at junit.framework.Assert.assertEquals(Assert.java:81)
	at junit.framework.Assert.assertEquals(Assert.java:87)
	at org.joda.time.TestDateMidnight_Basics.testToString_String_String(TestDateMidnight_Basics.java:456)

testParse_formatter(org.joda.time.TestLocalDateTime_Constructors)  Time elapsed: 0 sec  <<< ERROR!
java.lang.IllegalArgumentException: Invalid format: "2010--30 06 13" is malformed at "--30 06 13"
	at org.joda.time.format.DateTimeFormatter.parseLocalDateTime(DateTimeFormatter.java:854)
	at org.joda.time.LocalDateTime.parse(LocalDateTime.java:168)
	at org.joda.time.TestLocalDateTime_Constructors.testParse_formatter(TestLocalDateTime_Constructors.java:101)

testToString_String_Locale(org.joda.time.TestLocalDateTime_Basics)  Time elapsed: 0.001 sec  <<< FAILURE!
junit.framework.ComparisonFailure: expected:<Tue [9]/6> but was:<Tue [d]/6>
	at junit.framework.Assert.assertEquals(Assert.java:81)
	at junit.framework.Assert.assertEquals(Assert.java:87)
	at org.joda.time.TestLocalDateTime_Basics.testToString_String_Locale(TestLocalDateTime_Basics.java:1085)

testParse_formatter(org.joda.time.TestLocalDate_Constructors)  Time elapsed: 0 sec  <<< ERROR!
java.lang.IllegalArgumentException: Invalid format: "2010--30 06" is malformed at "--30 06"
	at org.joda.time.format.DateTimeFormatter.parseLocalDateTime(DateTimeFormatter.java:854)
	at org.joda.time.format.DateTimeFormatter.parseLocalDate(DateTimeFormatter.java:798)
	at org.joda.time.LocalDate.parse(LocalDate.java:179)
	at org.joda.time.TestLocalDate_Constructors.testParse_formatter(TestLocalDate_Constructors.java:93)

testToString_String_Locale(org.joda.time.TestLocalDate_Basics)  Time elapsed: 0.001 sec  <<< FAILURE!
junit.framework.ComparisonFailure: expected:<Tue [9]/6> but was:<Tue [d]/6>
	at junit.framework.Assert.assertEquals(Assert.java:81)
	at junit.framework.Assert.assertEquals(Assert.java:87)
	at org.joda.time.TestLocalDate_Basics.testToString_String_Locale(TestLocalDate_Basics.java:1139)

testParse_formatter(org.joda.time.TestLocalTime_Constructors)  Time elapsed: 0.001 sec  <<< ERROR!
java.lang.IllegalArgumentException: Invalid format: "13 30" is malformed at " 30"
	at org.joda.time.format.DateTimeFormatter.parseLocalDateTime(DateTimeFormatter.java:854)
	at org.joda.time.format.DateTimeFormatter.parseLocalTime(DateTimeFormatter.java:816)
	at org.joda.time.LocalTime.parse(LocalTime.java:175)
	at org.joda.time.TestLocalTime_Constructors.testParse_formatter(TestLocalTime_Constructors.java:119)

testToString_String_Locale(org.joda.time.TestLocalTime_Basics)  Time elapsed: 0.001 sec  <<< FAILURE!
junit.framework.ComparisonFailure: expected:<10 [20]> but was:<10 [m]>
	at junit.framework.Assert.assertEquals(Assert.java:81)
	at junit.framework.Assert.assertEquals(Assert.java:87)
	at org.joda.time.TestLocalTime_Basics.testToString_String_Locale(TestLocalTime_Basics.java:799)

testToString_String_Locale(org.joda.time.TestTimeOfDay_Basics)  Time elapsed: 0.001 sec  <<< FAILURE!
junit.framework.ComparisonFailure: expected:<10 [20]> but was:<10 [m]>
	at junit.framework.Assert.assertEquals(Assert.java:81)
	at junit.framework.Assert.assertEquals(Assert.java:87)
	at org.joda.time.TestTimeOfDay_Basics.testToString_String_Locale(TestTimeOfDay_Basics.java:886)

testToString_String_Locale(org.joda.time.TestYearMonthDay_Basics)  Time elapsed: 0.001 sec  <<< FAILURE!
junit.framework.ComparisonFailure: expected:<� [9]/6> but was:<� [d]/6>
	at junit.framework.Assert.assertEquals(Assert.java:81)
	at junit.framework.Assert.assertEquals(Assert.java:87)
	at org.joda.time.TestYearMonthDay_Basics.testToString_String_Locale(TestYearMonthDay_Basics.java:812)

testToString_String_Locale(org.joda.time.TestYearMonth_Basics)  Time elapsed: 0.001 sec  <<< FAILURE!
junit.framework.ComparisonFailure: expected:<� [�]/6> but was:<� [d]/6>
	at junit.framework.Assert.assertEquals(Assert.java:81)
	at junit.framework.Assert.assertEquals(Assert.java:87)
	at org.joda.time.TestYearMonth_Basics.testToString_String_Locale(TestYearMonth_Basics.java:636)

testToString_String_Locale(org.joda.time.TestMonthDay_Basics)  Time elapsed: 0.001 sec  <<< FAILURE!
junit.framework.ComparisonFailure: expected:<� [6]/5> but was:<� [d]/5>
	at junit.framework.Assert.assertEquals(Assert.java:81)
	at junit.framework.Assert.assertEquals(Assert.java:87)
	at org.joda.time.TestMonthDay_Basics.testToString_String_Locale(TestMonthDay_Basics.java:802)

testParse_noFormatter(org.joda.time.TestMonthDay_Constructors)  Time elapsed: 0.001 sec  <<< ERROR!
java.lang.IllegalArgumentException: Invalid format: "--06-30"
	at org.joda.time.format.DateTimeFormatter.parseLocalDateTime(DateTimeFormatter.java:854)
	at org.joda.time.format.DateTimeFormatter.parseLocalDate(DateTimeFormatter.java:798)
	at org.joda.time.MonthDay.parse(MonthDay.java:160)
	at org.joda.time.MonthDay.parse(MonthDay.java:149)
	at org.joda.time.TestMonthDay_Constructors.testParse_noFormatter(TestMonthDay_Constructors.java:82)

testParse_formatter(org.joda.time.TestMonthDay_Constructors)  Time elapsed: 0.001 sec  <<< ERROR!
java.lang.IllegalArgumentException: Invalid format: "2010--30 06" is malformed at "--30 06"
	at org.joda.time.format.DateTimeFormatter.parseLocalDateTime(DateTimeFormatter.java:854)
	at org.joda.time.format.DateTimeFormatter.parseLocalDate(DateTimeFormatter.java:798)
	at org.joda.time.MonthDay.parse(MonthDay.java:160)
	at org.joda.time.TestMonthDay_Constructors.testParse_formatter(TestMonthDay_Constructors.java:90)

testToString_String_Locale(org.joda.time.TestPartial_Basics)  Time elapsed: 0.001 sec  <<< FAILURE!
junit.framework.ComparisonFailure: expected:<10 [20]> but was:<10 [m]>
	at junit.framework.Assert.assertEquals(Assert.java:81)
	at junit.framework.Assert.assertEquals(Assert.java:87)
	at org.joda.time.TestPartial_Basics.testToString_String_Locale(TestPartial_Basics.java:884)

testMonthDay(org.joda.time.TestStringConvert)  Time elapsed: 0.002 sec  <<< ERROR!
java.lang.IllegalArgumentException: Invalid format: "--06-30"
	at org.joda.time.format.DateTimeFormatter.parseLocalDateTime(DateTimeFormatter.java:854)
	at org.joda.time.format.DateTimeFormatter.parseLocalDate(DateTimeFormatter.java:798)
	at org.joda.time.MonthDay.parse(MonthDay.java:160)
	at org.joda.time.MonthDay.parse(MonthDay.java:149)
	at sun.reflect.NativeMethodAccessorImpl.invoke0(Native Method)
	at sun.reflect.NativeMethodAccessorImpl.invoke(NativeMethodAccessorImpl.java:57)
	at sun.reflect.DelegatingMethodAccessorImpl.invoke(DelegatingMethodAccessorImpl.java:43)
	at java.lang.reflect.Method.invoke(Method.java:606)
	at org.joda.convert.MethodsStringConverter.convertFromString(MethodsStringConverter.java:70)
	at org.joda.convert.StringConvert.convertFromString(StringConvert.java:163)
	at org.joda.time.TestStringConvert.testMonthDay(TestStringConvert.java:106)

testMonthDay_leapDay(org.joda.time.TestStringConvert)  Time elapsed: 0 sec  <<< ERROR!
java.lang.IllegalArgumentException: Invalid format: "--02-29"
	at org.joda.time.format.DateTimeFormatter.parseLocalDateTime(DateTimeFormatter.java:854)
	at org.joda.time.format.DateTimeFormatter.parseLocalDate(DateTimeFormatter.java:798)
	at org.joda.time.MonthDay.parse(MonthDay.java:160)
	at org.joda.time.MonthDay.parse(MonthDay.java:149)
	at sun.reflect.NativeMethodAccessorImpl.invoke0(Native Method)
	at sun.reflect.NativeMethodAccessorImpl.invoke(NativeMethodAccessorImpl.java:57)
	at sun.reflect.DelegatingMethodAccessorImpl.invoke(DelegatingMethodAccessorImpl.java:43)
	at java.lang.reflect.Method.invoke(Method.java:606)
	at org.joda.convert.MethodsStringConverter.convertFromString(MethodsStringConverter.java:70)
	at org.joda.convert.StringConvert.convertFromString(StringConvert.java:163)
	at org.joda.time.TestStringConvert.testMonthDay_leapDay(TestStringConvert.java:113)

testParseInto_monthDay_feb29_startOfYear(org.joda.time.format.TestDateTimeFormatter)  Time elapsed: 0.002 sec  <<< FAILURE!
junit.framework.AssertionFailedError: expected:<4> but was:<-2>
	at junit.framework.Assert.fail(Assert.java:47)
	at junit.framework.Assert.failNotEquals(Assert.java:280)
	at junit.framework.Assert.assertEquals(Assert.java:64)
	at junit.framework.Assert.assertEquals(Assert.java:198)
	at junit.framework.Assert.assertEquals(Assert.java:204)
	at org.joda.time.format.TestDateTimeFormatter.testParseInto_monthDay_feb29_startOfYear(TestDateTimeFormatter.java:911)

testParseInto_monthDay_feb29_OfYear(org.joda.time.format.TestDateTimeFormatter)  Time elapsed: 0.001 sec  <<< FAILURE!
junit.framework.AssertionFailedError: expected:<4> but was:<-2>
	at junit.framework.Assert.fail(Assert.java:47)
	at junit.framework.Assert.failNotEquals(Assert.java:280)
	at junit.framework.Assert.assertEquals(Assert.java:64)
	at junit.framework.Assert.assertEquals(Assert.java:198)
	at junit.framework.Assert.assertEquals(Assert.java:204)
	at org.joda.time.format.TestDateTimeFormatter.testParseInto_monthDay_feb29_OfYear(TestDateTimeFormatter.java:918)

testParseInto_monthDay_feb29_newYork(org.joda.time.format.TestDateTimeFormatter)  Time elapsed: 0.001 sec  <<< FAILURE!
junit.framework.AssertionFailedError: expected:<4> but was:<-2>
	at junit.framework.Assert.fail(Assert.java:47)
	at junit.framework.Assert.failNotEquals(Assert.java:280)
	at junit.framework.Assert.assertEquals(Assert.java:64)
	at junit.framework.Assert.assertEquals(Assert.java:198)
	at junit.framework.Assert.assertEquals(Assert.java:204)
	at org.joda.time.format.TestDateTimeFormatter.testParseInto_monthDay_feb29_newYork(TestDateTimeFormatter.java:925)

testParseInto_monthDay_feb29_newYork_startOfYear(org.joda.time.format.TestDateTimeFormatter)  Time elapsed: 0 sec  <<< FAILURE!
junit.framework.AssertionFailedError: expected:<4> but was:<-2>
	at junit.framework.Assert.fail(Assert.java:47)
	at junit.framework.Assert.failNotEquals(Assert.java:280)
	at junit.framework.Assert.assertEquals(Assert.java:64)
	at junit.framework.Assert.assertEquals(Assert.java:198)
	at junit.framework.Assert.assertEquals(Assert.java:204)
	at org.joda.time.format.TestDateTimeFormatter.testParseInto_monthDay_feb29_newYork_startOfYear(TestDateTimeFormatter.java:932)

testParseInto_monthDay_feb29_newYork_endOfYear(org.joda.time.format.TestDateTimeFormatter)  Time elapsed: 0.001 sec  <<< FAILURE!
junit.framework.AssertionFailedError: expected:<4> but was:<-2>
	at junit.framework.Assert.fail(Assert.java:47)
	at junit.framework.Assert.failNotEquals(Assert.java:280)
	at junit.framework.Assert.assertEquals(Assert.java:64)
	at junit.framework.Assert.assertEquals(Assert.java:198)
	at junit.framework.Assert.assertEquals(Assert.java:204)
	at org.joda.time.format.TestDateTimeFormatter.testParseInto_monthDay_feb29_newYork_endOfYear(TestDateTimeFormatter.java:939)

testParseInto_monthDay_feb29_tokyo(org.joda.time.format.TestDateTimeFormatter)  Time elapsed: 0.001 sec  <<< FAILURE!
junit.framework.AssertionFailedError: expected:<4> but was:<-2>
	at junit.framework.Assert.fail(Assert.java:47)
	at junit.framework.Assert.failNotEquals(Assert.java:280)
	at junit.framework.Assert.assertEquals(Assert.java:64)
	at junit.framework.Assert.assertEquals(Assert.java:198)
	at junit.framework.Assert.assertEquals(Assert.java:204)
	at org.joda.time.format.TestDateTimeFormatter.testParseInto_monthDay_feb29_tokyo(TestDateTimeFormatter.java:946)

testParseInto_monthDay_feb29_tokyo_startOfYear(org.joda.time.format.TestDateTimeFormatter)  Time elapsed: 0.001 sec  <<< FAILURE!
junit.framework.AssertionFailedError: expected:<4> but was:<-2>
	at junit.framework.Assert.fail(Assert.java:47)
	at junit.framework.Assert.failNotEquals(Assert.java:280)
	at junit.framework.Assert.assertEquals(Assert.java:64)
	at junit.framework.Assert.assertEquals(Assert.java:198)
	at junit.framework.Assert.assertEquals(Assert.java:204)
	at org.joda.time.format.TestDateTimeFormatter.testParseInto_monthDay_feb29_tokyo_startOfYear(TestDateTimeFormatter.java:953)

testParseInto_monthDay_feb29_tokyo_endOfYear(org.joda.time.format.TestDateTimeFormatter)  Time elapsed: 0.001 sec  <<< FAILURE!
junit.framework.AssertionFailedError: expected:<4> but was:<-2>
	at junit.framework.Assert.fail(Assert.java:47)
	at junit.framework.Assert.failNotEquals(Assert.java:280)
	at junit.framework.Assert.assertEquals(Assert.java:64)
	at junit.framework.Assert.assertEquals(Assert.java:198)
	at junit.framework.Assert.assertEquals(Assert.java:204)
	at org.joda.time.format.TestDateTimeFormatter.testParseInto_monthDay_feb29_tokyo_endOfYear(TestDateTimeFormatter.java:960)

testParseInto_monthDay_withDefaultYear_feb29(org.joda.time.format.TestDateTimeFormatter)  Time elapsed: 0.001 sec  <<< FAILURE!
junit.framework.AssertionFailedError: expected:<4> but was:<-2>
	at junit.framework.Assert.fail(Assert.java:47)
	at junit.framework.Assert.failNotEquals(Assert.java:280)
	at junit.framework.Assert.assertEquals(Assert.java:64)
	at junit.framework.Assert.assertEquals(Assert.java:198)
	at junit.framework.Assert.assertEquals(Assert.java:204)
	at org.joda.time.format.TestDateTimeFormatter.testParseInto_monthDay_withDefaultYear_feb29(TestDateTimeFormatter.java:967)

testParseInto_monthDay_withDefaultYear_feb29_newYork(org.joda.time.format.TestDateTimeFormatter)  Time elapsed: 0 sec  <<< FAILURE!
junit.framework.AssertionFailedError: expected:<4> but was:<-2>
	at junit.framework.Assert.fail(Assert.java:47)
	at junit.framework.Assert.failNotEquals(Assert.java:280)
	at junit.framework.Assert.assertEquals(Assert.java:64)
	at junit.framework.Assert.assertEquals(Assert.java:198)
	at junit.framework.Assert.assertEquals(Assert.java:204)
	at org.joda.time.format.TestDateTimeFormatter.testParseInto_monthDay_withDefaultYear_feb29_newYork(TestDateTimeFormatter.java:974)

testParseInto_monthDay_withDefaultYear_feb29_newYork_endOfYear(org.joda.time.format.TestDateTimeFormatter)  Time elapsed: 0 sec  <<< FAILURE!
junit.framework.AssertionFailedError: expected:<4> but was:<-2>
	at junit.framework.Assert.fail(Assert.java:47)
	at junit.framework.Assert.failNotEquals(Assert.java:280)
	at junit.framework.Assert.assertEquals(Assert.java:64)
	at junit.framework.Assert.assertEquals(Assert.java:198)
	at junit.framework.Assert.assertEquals(Assert.java:204)
	at org.joda.time.format.TestDateTimeFormatter.testParseInto_monthDay_withDefaultYear_feb29_newYork_endOfYear(TestDateTimeFormatter.java:981)

testZoneNameNearTransition(org.joda.time.format.TestDateTimeFormatter)  Time elapsed: 0.001 sec  <<< FAILURE!
junit.framework.ComparisonFailure: expected:<2005-10-[30 01:00:00.0 Eastern Daylight Time]> but was:<2005-10-[dd 01:mm:ss.0 zzzz]>
	at junit.framework.Assert.assertEquals(Assert.java:81)
	at junit.framework.Assert.assertEquals(Assert.java:87)
	at org.joda.time.format.TestDateTimeFormatter.testZoneNameNearTransition(TestDateTimeFormatter.java:1003)

testZoneShortNameNearTransition(org.joda.time.format.TestDateTimeFormatter)  Time elapsed: 0.001 sec  <<< FAILURE!
junit.framework.ComparisonFailure: expected:<2005-10-[30 01:00:00.0 EDT]> but was:<2005-10-[dd 01:mm:ss.0 z]>
	at junit.framework.Assert.assertEquals(Assert.java:81)
	at junit.framework.Assert.assertEquals(Assert.java:87)
	at org.joda.time.format.TestDateTimeFormatter.testZoneShortNameNearTransition(TestDateTimeFormatter.java:1019)

testParseLocalDate_year_month_week_2010(org.joda.time.format.TestDateTimeFormatter)  Time elapsed: 0.001 sec  <<< ERROR!
java.lang.IllegalArgumentException: Invalid format: "2010-01-01" is malformed at "-01"
	at org.joda.time.format.DateTimeFormatter.parseLocalDateTime(DateTimeFormatter.java:854)
	at org.joda.time.format.DateTimeFormatter.parseLocalDate(DateTimeFormatter.java:798)
	at org.joda.time.format.TestDateTimeFormatter.testParseLocalDate_year_month_week_2010(TestDateTimeFormatter.java:454)

testParseLocalDate_year_month_week_2011(org.joda.time.format.TestDateTimeFormatter)  Time elapsed: 0.001 sec  <<< ERROR!
java.lang.IllegalArgumentException: Invalid format: "2011-01-01" is malformed at "-01"
	at org.joda.time.format.DateTimeFormatter.parseLocalDateTime(DateTimeFormatter.java:854)
	at org.joda.time.format.DateTimeFormatter.parseLocalDate(DateTimeFormatter.java:798)
	at org.joda.time.format.TestDateTimeFormatter.testParseLocalDate_year_month_week_2011(TestDateTimeFormatter.java:460)

testParseLocalDate_year_month_week_2012(org.joda.time.format.TestDateTimeFormatter)  Time elapsed: 0 sec  <<< ERROR!
java.lang.IllegalArgumentException: Invalid format: "2012-01-01" is malformed at "-01"
	at org.joda.time.format.DateTimeFormatter.parseLocalDateTime(DateTimeFormatter.java:854)
	at org.joda.time.format.DateTimeFormatter.parseLocalDate(DateTimeFormatter.java:798)
	at org.joda.time.format.TestDateTimeFormatter.testParseLocalDate_year_month_week_2012(TestDateTimeFormatter.java:466)

testParseLocalDate_year_month_week_2013(org.joda.time.format.TestDateTimeFormatter)  Time elapsed: 0.001 sec  <<< ERROR!
java.lang.IllegalArgumentException: Invalid format: "2013-01-01" is malformed at "-01"
	at org.joda.time.format.DateTimeFormatter.parseLocalDateTime(DateTimeFormatter.java:854)
	at org.joda.time.format.DateTimeFormatter.parseLocalDate(DateTimeFormatter.java:798)
	at org.joda.time.format.TestDateTimeFormatter.testParseLocalDate_year_month_week_2013(TestDateTimeFormatter.java:472)

testParseLocalDate_year_month_week_2014(org.joda.time.format.TestDateTimeFormatter)  Time elapsed: 0.001 sec  <<< ERROR!
java.lang.IllegalArgumentException: Invalid format: "2014-01-01" is malformed at "-01"
	at org.joda.time.format.DateTimeFormatter.parseLocalDateTime(DateTimeFormatter.java:854)
	at org.joda.time.format.DateTimeFormatter.parseLocalDate(DateTimeFormatter.java:798)
	at org.joda.time.format.TestDateTimeFormatter.testParseLocalDate_year_month_week_2014(TestDateTimeFormatter.java:478)

testParseLocalDate_year_month_week_2015(org.joda.time.format.TestDateTimeFormatter)  Time elapsed: 0.001 sec  <<< ERROR!
java.lang.IllegalArgumentException: Invalid format: "2015-01-01" is malformed at "-01"
	at org.joda.time.format.DateTimeFormatter.parseLocalDateTime(DateTimeFormatter.java:854)
	at org.joda.time.format.DateTimeFormatter.parseLocalDate(DateTimeFormatter.java:798)
	at org.joda.time.format.TestDateTimeFormatter.testParseLocalDate_year_month_week_2015(TestDateTimeFormatter.java:484)

testParseLocalDate_year_month_week_2016(org.joda.time.format.TestDateTimeFormatter)  Time elapsed: 0 sec  <<< ERROR!
java.lang.IllegalArgumentException: Invalid format: "2016-01-01" is malformed at "-01"
	at org.joda.time.format.DateTimeFormatter.parseLocalDateTime(DateTimeFormatter.java:854)
	at org.joda.time.format.DateTimeFormatter.parseLocalDate(DateTimeFormatter.java:798)
	at org.joda.time.format.TestDateTimeFormatter.testParseLocalDate_year_month_week_2016(TestDateTimeFormatter.java:490)

testParseLocalDateTime_monthDay_feb29(org.joda.time.format.TestDateTimeFormatter)  Time elapsed: 0.001 sec  <<< ERROR!
java.lang.IllegalArgumentException: Invalid format: "2 29 13 40" is malformed at " 29 13 40"
	at org.joda.time.format.DateTimeFormatter.parseLocalDateTime(DateTimeFormatter.java:854)
	at org.joda.time.format.TestDateTimeFormatter.testParseLocalDateTime_monthDay_feb29(TestDateTimeFormatter.java:526)

testParseLocalDate_yearOfCentury(org.joda.time.format.TestDateTimeFormatter)  Time elapsed: 0.001 sec  <<< ERROR!
java.lang.IllegalArgumentException: Invalid format: "50 8 4" is malformed at " 4"
	at org.joda.time.format.DateTimeFormatter.parseLocalDateTime(DateTimeFormatter.java:854)
	at org.joda.time.format.DateTimeFormatter.parseLocalDate(DateTimeFormatter.java:798)
	at org.joda.time.format.TestDateTimeFormatter.testParseLocalDate_yearOfCentury(TestDateTimeFormatter.java:401)

testParseLocalDate_monthDay_feb29(org.joda.time.format.TestDateTimeFormatter)  Time elapsed: 0.001 sec  <<< ERROR!
java.lang.IllegalArgumentException: Invalid format: "2 29" is malformed at " 29"
	at org.joda.time.format.DateTimeFormatter.parseLocalDateTime(DateTimeFormatter.java:854)
	at org.joda.time.format.DateTimeFormatter.parseLocalDate(DateTimeFormatter.java:798)
	at org.joda.time.format.TestDateTimeFormatter.testParseLocalDate_monthDay_feb29(TestDateTimeFormatter.java:411)

testParseLocalDate_monthDay_withDefaultYear_feb29(org.joda.time.format.TestDateTimeFormatter)  Time elapsed: 0 sec  <<< ERROR!
java.lang.IllegalArgumentException: Invalid format: "2 29" is malformed at " 29"
	at org.joda.time.format.DateTimeFormatter.parseLocalDateTime(DateTimeFormatter.java:854)
	at org.joda.time.format.DateTimeFormatter.parseLocalDate(DateTimeFormatter.java:798)
	at org.joda.time.format.TestDateTimeFormatter.testParseLocalDate_monthDay_withDefaultYear_feb29(TestDateTimeFormatter.java:422)

testParseLocalDate_weekyear_month_week_2010(org.joda.time.format.TestDateTimeFormatter)  Time elapsed: 0.001 sec  <<< ERROR!
java.lang.IllegalArgumentException: Invalid format: "2010-01-01" is malformed at "-01"
	at org.joda.time.format.DateTimeFormatter.parseLocalDateTime(DateTimeFormatter.java:854)
	at org.joda.time.format.DateTimeFormatter.parseLocalDate(DateTimeFormatter.java:798)
	at org.joda.time.format.TestDateTimeFormatter.testParseLocalDate_weekyear_month_week_2010(TestDateTimeFormatter.java:428)

testParseLocalDate_weekyear_month_week_2011(org.joda.time.format.TestDateTimeFormatter)  Time elapsed: 0 sec  <<< ERROR!
java.lang.IllegalArgumentException: Invalid format: "2011-01-01" is malformed at "-01"
	at org.joda.time.format.DateTimeFormatter.parseLocalDateTime(DateTimeFormatter.java:854)
	at org.joda.time.format.DateTimeFormatter.parseLocalDate(DateTimeFormatter.java:798)
	at org.joda.time.format.TestDateTimeFormatter.testParseLocalDate_weekyear_month_week_2011(TestDateTimeFormatter.java:434)

testParseLocalDate_weekyear_month_week_2012(org.joda.time.format.TestDateTimeFormatter)  Time elapsed: 0.001 sec  <<< ERROR!
java.lang.IllegalArgumentException: Invalid format: "2012-01-01" is malformed at "-01"
	at org.joda.time.format.DateTimeFormatter.parseLocalDateTime(DateTimeFormatter.java:854)
	at org.joda.time.format.DateTimeFormatter.parseLocalDate(DateTimeFormatter.java:798)
	at org.joda.time.format.TestDateTimeFormatter.testParseLocalDate_weekyear_month_week_2012(TestDateTimeFormatter.java:440)

testParseLocalDateTime_monthDay_withDefaultYear_feb29(org.joda.time.format.TestDateTimeFormatter)  Time elapsed: 0.001 sec  <<< ERROR!
java.lang.IllegalArgumentException: Invalid format: "2 29 13 40" is malformed at " 29 13 40"
	at org.joda.time.format.DateTimeFormatter.parseLocalDateTime(DateTimeFormatter.java:854)
	at org.joda.time.format.TestDateTimeFormatter.testParseLocalDateTime_monthDay_withDefaultYear_feb29(TestDateTimeFormatter.java:537)

testParseInto_monthDay_feb29(org.joda.time.format.TestDateTimeFormatter)  Time elapsed: 0 sec  <<< FAILURE!
junit.framework.AssertionFailedError: expected:<4> but was:<-2>
	at junit.framework.Assert.fail(Assert.java:47)
	at junit.framework.Assert.failNotEquals(Assert.java:280)
	at junit.framework.Assert.assertEquals(Assert.java:64)
	at junit.framework.Assert.assertEquals(Assert.java:198)
	at junit.framework.Assert.assertEquals(Assert.java:204)
	at org.joda.time.format.TestDateTimeFormatter.testParseInto_monthDay_feb29(TestDateTimeFormatter.java:904)

testFormat_samples(org.joda.time.format.TestDateTimeFormat)  Time elapsed: 0.001 sec  <<< FAILURE!
junit.framework.ComparisonFailure: expected:<2004-06-[09 10.20.30]> but was:<2004-06-[dd 10.mm.ss]>
	at junit.framework.Assert.assertEquals(Assert.java:81)
	at junit.framework.Assert.assertEquals(Assert.java:87)
	at org.joda.time.format.TestDateTimeFormat.testFormat_samples(TestDateTimeFormat.java:844)

testFormat_shortBasicParse(org.joda.time.format.TestDateTimeFormat)  Time elapsed: 0.001 sec  <<< ERROR!
java.lang.IllegalArgumentException: Invalid format: "04/03/09" is malformed at "/09"
	at org.joda.time.format.DateTimeFormatter.parseDateTime(DateTimeFormatter.java:899)
	at org.joda.time.format.TestDateTimeFormat.testFormat_shortBasicParse(TestDateTimeFormat.java:861)

testParse_pivotYear(org.joda.time.format.TestDateTimeFormat)  Time elapsed: 0 sec  <<< ERROR!
java.lang.IllegalArgumentException: Invalid format: "25.12.15" is malformed at ".15"
	at org.joda.time.format.DateTimeFormatter.parseDateTime(DateTimeFormatter.java:899)
	at org.joda.time.format.TestDateTimeFormat.testParse_pivotYear(TestDateTimeFormat.java:869)

testParse_pivotYear_ignored4DigitYear(org.joda.time.format.TestDateTimeFormat)  Time elapsed: 0.001 sec  <<< ERROR!
java.lang.IllegalArgumentException: Invalid format: "25.12.15" is malformed at ".15"
	at org.joda.time.format.DateTimeFormatter.parseDateTime(DateTimeFormatter.java:899)
	at org.joda.time.format.TestDateTimeFormat.testParse_pivotYear_ignored4DigitYear(TestDateTimeFormat.java:882)

testFormatParse_textMonthJanShort_UK(org.joda.time.format.TestDateTimeFormat)  Time elapsed: 0 sec  <<< FAILURE!
junit.framework.ComparisonFailure: expected:<23 Jan [yyyy]> but was:<23 Jan [2007]>
	at junit.framework.Assert.assertEquals(Assert.java:81)
	at junit.framework.Assert.assertEquals(Assert.java:87)
	at org.joda.time.format.TestDateTimeFormat.testFormatParse_textMonthJanShort_UK(TestDateTimeFormat.java:898)

testFormatParse_textMonthJanShortLowerCase_UK(org.joda.time.format.TestDateTimeFormat)  Time elapsed: 0 sec  <<< ERROR!
java.lang.IllegalArgumentException: Invalid format: "23 jan 2007" is malformed at " 2007"
	at org.joda.time.format.DateTimeFormatter.parseDateTime(DateTimeFormatter.java:899)
	at org.joda.time.format.TestDateTimeFormat.testFormatParse_textMonthJanShortLowerCase_UK(TestDateTimeFormat.java:906)

testFormatParse_textMonthJanShortUpperCase_UK(org.joda.time.format.TestDateTimeFormat)  Time elapsed: 0.001 sec  <<< ERROR!
java.lang.IllegalArgumentException: Invalid format: "23 JAN 2007" is malformed at " 2007"
	at org.joda.time.format.DateTimeFormatter.parseDateTime(DateTimeFormatter.java:899)
	at org.joda.time.format.TestDateTimeFormat.testFormatParse_textMonthJanShortUpperCase_UK(TestDateTimeFormat.java:913)

testParse_textMonthJanLong_UK(org.joda.time.format.TestDateTimeFormat)  Time elapsed: 0 sec  <<< ERROR!
java.lang.IllegalArgumentException: Invalid format: "23 January 2007" is malformed at " 2007"
	at org.joda.time.format.DateTimeFormatter.parseDateTime(DateTimeFormatter.java:899)
	at org.joda.time.format.TestDateTimeFormat.testParse_textMonthJanLong_UK(TestDateTimeFormat.java:921)

testFormatParse_textMonthJanLongLowerCase_UK(org.joda.time.format.TestDateTimeFormat)  Time elapsed: 0.001 sec  <<< ERROR!
java.lang.IllegalArgumentException: Invalid format: "23 january 2007" is malformed at " 2007"
	at org.joda.time.format.DateTimeFormatter.parseDateTime(DateTimeFormatter.java:899)
	at org.joda.time.format.TestDateTimeFormat.testFormatParse_textMonthJanLongLowerCase_UK(TestDateTimeFormat.java:928)

testFormatParse_textMonthJanLongUpperCase_UK(org.joda.time.format.TestDateTimeFormat)  Time elapsed: 0 sec  <<< ERROR!
java.lang.IllegalArgumentException: Invalid format: "23 JANUARY 2007" is malformed at " 2007"
	at org.joda.time.format.DateTimeFormatter.parseDateTime(DateTimeFormatter.java:899)
	at org.joda.time.format.TestDateTimeFormat.testFormatParse_textMonthJanLongUpperCase_UK(TestDateTimeFormat.java:935)

testFormatParse_textMonthJanShort_France(org.joda.time.format.TestDateTimeFormat)  Time elapsed: 0.001 sec  <<< FAILURE!
junit.framework.ComparisonFailure: expected:<23 janv. [2007]> but was:<23 janv. [yyyy]>
	at junit.framework.Assert.assertEquals(Assert.java:81)
	at junit.framework.Assert.assertEquals(Assert.java:87)
	at org.joda.time.format.TestDateTimeFormat.testFormatParse_textMonthJanShort_France(TestDateTimeFormat.java:944)

testFormatParse_textMonthJanLong_France(org.joda.time.format.TestDateTimeFormat)  Time elapsed: 0.001 sec  <<< ERROR!
java.lang.IllegalArgumentException: Invalid format: "23 janvier 2007" is malformed at " 2007"
	at org.joda.time.format.DateTimeFormatter.parseDateTime(DateTimeFormatter.java:899)
	at org.joda.time.format.TestDateTimeFormat.testFormatParse_textMonthJanLong_France(TestDateTimeFormat.java:953)

testFormatParse_textMonthApr_France(org.joda.time.format.TestDateTimeFormat)  Time elapsed: 0 sec  <<< FAILURE!
junit.framework.ComparisonFailure: expected:<23 févr. [2007]> but was:<23 févr. [yyyy]>
	at junit.framework.Assert.assertEquals(Assert.java:81)
	at junit.framework.Assert.assertEquals(Assert.java:87)
	at org.joda.time.format.TestDateTimeFormat.testFormatParse_textMonthApr_France(TestDateTimeFormat.java:962)

testFormatParse_textMonthApr_Korean(org.joda.time.format.TestDateTimeFormat)  Time elapsed: 0.006 sec  <<< FAILURE!
junit.framework.AssertionFailedError: expected:<2007-03-08T22:00:00.000Z> but was:<2000-03-02T22:00:00.000Z>
	at junit.framework.Assert.fail(Assert.java:47)
	at junit.framework.Assert.failNotEquals(Assert.java:280)
	at junit.framework.Assert.assertEquals(Assert.java:64)
	at junit.framework.Assert.assertEquals(Assert.java:71)
	at org.joda.time.format.TestDateTimeFormat.testFormatParse_textMonthApr_Korean(TestDateTimeFormat.java:993)

testFormatParse_zoneId_noColon(org.joda.time.format.TestDateTimeFormat)  Time elapsed: 0 sec  <<< FAILURE!
junit.framework.ComparisonFailure: expected:<01:[02] +0000> but was:<01:[mm] +0000>
	at junit.framework.Assert.assertEquals(Assert.java:81)
	at junit.framework.Assert.assertEquals(Assert.java:87)
	at org.joda.time.format.TestDateTimeFormat.testFormatParse_zoneId_noColon(TestDateTimeFormat.java:1142)

testFormatParse_zoneId_noColon_parseZ(org.joda.time.format.TestDateTimeFormat)  Time elapsed: 0 sec  <<< ERROR!
java.lang.IllegalArgumentException: Invalid format: "01:02 Z" is malformed at ":02 Z"
	at org.joda.time.format.DateTimeFormatter.parseDateTime(DateTimeFormatter.java:899)
	at org.joda.time.format.TestDateTimeFormat.testFormatParse_zoneId_noColon_parseZ(TestDateTimeFormat.java:1150)

testFormatParse_zoneId_colon(org.joda.time.format.TestDateTimeFormat)  Time elapsed: 0 sec  <<< FAILURE!
junit.framework.ComparisonFailure: expected:<01:[02] +00:00> but was:<01:[mm] +00:00>
	at junit.framework.Assert.assertEquals(Assert.java:81)
	at junit.framework.Assert.assertEquals(Assert.java:87)
	at org.joda.time.format.TestDateTimeFormat.testFormatParse_zoneId_colon(TestDateTimeFormat.java:1158)

testFormatParse_zoneId_colon_parseZ(org.joda.time.format.TestDateTimeFormat)  Time elapsed: 0.001 sec  <<< ERROR!
java.lang.IllegalArgumentException: Invalid format: "01:02 Z" is malformed at ":02 Z"
	at org.joda.time.format.DateTimeFormatter.parseDateTime(DateTimeFormatter.java:899)
	at org.joda.time.format.TestDateTimeFormat.testFormatParse_zoneId_colon_parseZ(TestDateTimeFormat.java:1166)

testForStyle_fullDate(org.joda.time.format.TestDateTimeFormatStyle)  Time elapsed: 0.007 sec  <<< FAILURE!
junit.framework.ComparisonFailure: expected:<Wednesday, [9 June 2004]> but was:<Wednesday, [d June yyyy]>
	at junit.framework.Assert.assertEquals(Assert.java:81)
	at junit.framework.Assert.assertEquals(Assert.java:87)
	at org.joda.time.format.TestDateTimeFormatStyle.testForStyle_fullDate(TestDateTimeFormatStyle.java:269)

testForStyle_fullTime(org.joda.time.format.TestDateTimeFormatStyle)  Time elapsed: 0.001 sec  <<< FAILURE!
junit.framework.ComparisonFailure: expected:<10:[20:30 o'clock BST]> but was:<10:[mm:ss o'clock z]>
	at junit.framework.Assert.assertEquals(Assert.java:81)
	at junit.framework.Assert.assertEquals(Assert.java:87)
	at org.joda.time.format.TestDateTimeFormatStyle.testForStyle_fullTime(TestDateTimeFormatStyle.java:282)

testForStyle_fullDateTime(org.joda.time.format.TestDateTimeFormatStyle)  Time elapsed: 0.002 sec  <<< FAILURE!
junit.framework.ComparisonFailure: expected:<Wednesday, [9 June 2004 10:20:30 o'clock BST]> but was:<Wednesday, [d June yyyy 10:mm:ss o'clock z]>
	at junit.framework.Assert.assertEquals(Assert.java:81)
	at junit.framework.Assert.assertEquals(Assert.java:87)
	at org.joda.time.format.TestDateTimeFormatStyle.testForStyle_fullDateTime(TestDateTimeFormatStyle.java:295)

testForStyle_shortMediumDateTime(org.joda.time.format.TestDateTimeFormatStyle)  Time elapsed: 0 sec  <<< FAILURE!
junit.framework.ComparisonFailure: expected:<09/06/[04 10:20:30]> but was:<09/06/[yy 10:mm:ss]>
	at junit.framework.Assert.assertEquals(Assert.java:81)
	at junit.framework.Assert.assertEquals(Assert.java:87)
	at org.joda.time.format.TestDateTimeFormatStyle.testForStyle_shortMediumDateTime(TestDateTimeFormatStyle.java:307)

testForStyle_shortLongDateTime(org.joda.time.format.TestDateTimeFormatStyle)  Time elapsed: 0.001 sec  <<< FAILURE!
junit.framework.ComparisonFailure: expected:<09/06/[04 10:20:30 BST]> but was:<09/06/[yy 10:mm:ss z]>
	at junit.framework.Assert.assertEquals(Assert.java:81)
	at junit.framework.Assert.assertEquals(Assert.java:87)
	at org.joda.time.format.TestDateTimeFormatStyle.testForStyle_shortLongDateTime(TestDateTimeFormatStyle.java:318)

testForStyle_shortFullDateTime(org.joda.time.format.TestDateTimeFormatStyle)  Time elapsed: 0.001 sec  <<< FAILURE!
junit.framework.ComparisonFailure: expected:<09/06/[04 10:20:30 o'clock BST]> but was:<09/06/[yy 10:mm:ss o'clock z]>
	at junit.framework.Assert.assertEquals(Assert.java:81)
	at junit.framework.Assert.assertEquals(Assert.java:87)
	at org.joda.time.format.TestDateTimeFormatStyle.testForStyle_shortFullDateTime(TestDateTimeFormatStyle.java:329)

testForStyle_mediumShortDateTime(org.joda.time.format.TestDateTimeFormatStyle)  Time elapsed: 0 sec  <<< FAILURE!
junit.framework.ComparisonFailure: expected:<09-Jun-[2004 10:20]> but was:<09-Jun-[yyyy 10:mm]>
	at junit.framework.Assert.assertEquals(Assert.java:81)
	at junit.framework.Assert.assertEquals(Assert.java:87)
	at org.joda.time.format.TestDateTimeFormatStyle.testForStyle_mediumShortDateTime(TestDateTimeFormatStyle.java:341)

testForStyle_mediumLongDateTime(org.joda.time.format.TestDateTimeFormatStyle)  Time elapsed: 0.001 sec  <<< FAILURE!
junit.framework.ComparisonFailure: expected:<09-Jun-[2004 10:20:30 BST]> but was:<09-Jun-[yyyy 10:mm:ss z]>
	at junit.framework.Assert.assertEquals(Assert.java:81)
	at junit.framework.Assert.assertEquals(Assert.java:87)
	at org.joda.time.format.TestDateTimeFormatStyle.testForStyle_mediumLongDateTime(TestDateTimeFormatStyle.java:352)

testForStyle_mediumFullDateTime(org.joda.time.format.TestDateTimeFormatStyle)  Time elapsed: 0.001 sec  <<< FAILURE!
junit.framework.ComparisonFailure: expected:<09-Jun-[2004 10:20:30 o'clock BST]> but was:<09-Jun-[yyyy 10:mm:ss o'clock z]>
	at junit.framework.Assert.assertEquals(Assert.java:81)
	at junit.framework.Assert.assertEquals(Assert.java:87)
	at org.joda.time.format.TestDateTimeFormatStyle.testForStyle_mediumFullDateTime(TestDateTimeFormatStyle.java:363)

testForStyle_shortDate(org.joda.time.format.TestDateTimeFormatStyle)  Time elapsed: 0.002 sec  <<< FAILURE!
junit.framework.ComparisonFailure: expected:<09/06/[04]> but was:<09/06/[yy]>
	at junit.framework.Assert.assertEquals(Assert.java:81)
	at junit.framework.Assert.assertEquals(Assert.java:87)
	at org.joda.time.format.TestDateTimeFormatStyle.testForStyle_shortDate(TestDateTimeFormatStyle.java:133)

testForStyle_shortTime(org.joda.time.format.TestDateTimeFormatStyle)  Time elapsed: 0 sec  <<< FAILURE!
junit.framework.ComparisonFailure: expected:<10:[20]> but was:<10:[mm]>
	at junit.framework.Assert.assertEquals(Assert.java:81)
	at junit.framework.Assert.assertEquals(Assert.java:87)
	at org.joda.time.format.TestDateTimeFormatStyle.testForStyle_shortTime(TestDateTimeFormatStyle.java:150)

testForStyle_shortDateTime(org.joda.time.format.TestDateTimeFormatStyle)  Time elapsed: 0.001 sec  <<< FAILURE!
junit.framework.ComparisonFailure: expected:<09/06/[04 10:20]> but was:<09/06/[yy 10:mm]>
	at junit.framework.Assert.assertEquals(Assert.java:81)
	at junit.framework.Assert.assertEquals(Assert.java:87)
	at org.joda.time.format.TestDateTimeFormatStyle.testForStyle_shortDateTime(TestDateTimeFormatStyle.java:171)

testForStyle_mediumDate(org.joda.time.format.TestDateTimeFormatStyle)  Time elapsed: 0.001 sec  <<< FAILURE!
junit.framework.ComparisonFailure: expected:<09-Jun-[2004]> but was:<09-Jun-[yyyy]>
	at junit.framework.Assert.assertEquals(Assert.java:81)
	at junit.framework.Assert.assertEquals(Assert.java:87)
	at org.joda.time.format.TestDateTimeFormatStyle.testForStyle_mediumDate(TestDateTimeFormatStyle.java:189)

testForStyle_mediumTime(org.joda.time.format.TestDateTimeFormatStyle)  Time elapsed: 0.001 sec  <<< FAILURE!
junit.framework.ComparisonFailure: expected:<10:[20:30]> but was:<10:[mm:ss]>
	at junit.framework.Assert.assertEquals(Assert.java:81)
	at junit.framework.Assert.assertEquals(Assert.java:87)
	at org.joda.time.format.TestDateTimeFormatStyle.testForStyle_mediumTime(TestDateTimeFormatStyle.java:202)

testForStyle_mediumDateTime(org.joda.time.format.TestDateTimeFormatStyle)  Time elapsed: 0.001 sec  <<< FAILURE!
junit.framework.ComparisonFailure: expected:<09-Jun-[2004 10:20:30]> but was:<09-Jun-[yyyy 10:mm:ss]>
	at junit.framework.Assert.assertEquals(Assert.java:81)
	at junit.framework.Assert.assertEquals(Assert.java:87)
	at org.joda.time.format.TestDateTimeFormatStyle.testForStyle_mediumDateTime(TestDateTimeFormatStyle.java:215)

testForStyle_longDate(org.joda.time.format.TestDateTimeFormatStyle)  Time elapsed: 0.002 sec  <<< FAILURE!
junit.framework.ComparisonFailure: expected:<09 June [2004]> but was:<09 June [yyyy]>
	at junit.framework.Assert.assertEquals(Assert.java:81)
	at junit.framework.Assert.assertEquals(Assert.java:87)
	at org.joda.time.format.TestDateTimeFormatStyle.testForStyle_longDate(TestDateTimeFormatStyle.java:229)

testForStyle_longTime(org.joda.time.format.TestDateTimeFormatStyle)  Time elapsed: 0 sec  <<< FAILURE!
junit.framework.ComparisonFailure: expected:<10:[20:30 BST]> but was:<10:[mm:ss z]>
	at junit.framework.Assert.assertEquals(Assert.java:81)
	at junit.framework.Assert.assertEquals(Assert.java:87)
	at org.joda.time.format.TestDateTimeFormatStyle.testForStyle_longTime(TestDateTimeFormatStyle.java:242)

testForStyle_longDateTime(org.joda.time.format.TestDateTimeFormatStyle)  Time elapsed: 0.001 sec  <<< FAILURE!
junit.framework.ComparisonFailure: expected:<09 June [2004 10:20:30 BST]> but was:<09 June [yyyy 10:mm:ss z]>
	at junit.framework.Assert.assertEquals(Assert.java:81)
	at junit.framework.Assert.assertEquals(Assert.java:87)
	at org.joda.time.format.TestDateTimeFormatStyle.testForStyle_longDateTime(TestDateTimeFormatStyle.java:255)

test_printParseZoneTokyo(org.joda.time.format.TestDateTimeFormatterBuilder)  Time elapsed: 0.001 sec  <<< FAILURE!
junit.framework.ComparisonFailure: expected:<2007-03-[04 12:30] Asia/Tokyo> but was:<2007-03-[dd 12:mm] Asia/Tokyo>
	at junit.framework.Assert.assertEquals(Assert.java:81)
	at junit.framework.Assert.assertEquals(Assert.java:87)
	at org.joda.time.format.TestDateTimeFormatterBuilder.test_printParseZoneTokyo(TestDateTimeFormatterBuilder.java:413)

test_printParseZoneParis(org.joda.time.format.TestDateTimeFormatterBuilder)  Time elapsed: 0.001 sec  <<< FAILURE!
junit.framework.ComparisonFailure: expected:<2007-03-[04 12:30] Europe/Paris> but was:<2007-03-[dd 12:mm] Europe/Paris>
	at junit.framework.Assert.assertEquals(Assert.java:81)
	at junit.framework.Assert.assertEquals(Assert.java:87)
	at org.joda.time.format.TestDateTimeFormatterBuilder.test_printParseZoneParis(TestDateTimeFormatterBuilder.java:423)

test_printParseZoneDawsonCreek(org.joda.time.format.TestDateTimeFormatterBuilder)  Time elapsed: 0.001 sec  <<< FAILURE!
junit.framework.ComparisonFailure: expected:<2007-03-[04 12:30] America/Dawson_Cree...> but was:<2007-03-[dd 12:mm] America/Dawson_Cree...>
	at junit.framework.Assert.assertEquals(Assert.java:81)
	at junit.framework.Assert.assertEquals(Assert.java:87)
	at org.joda.time.format.TestDateTimeFormatterBuilder.test_printParseZoneDawsonCreek(TestDateTimeFormatterBuilder.java:434)

test_printParseZoneBahiaBanderas(org.joda.time.format.TestDateTimeFormatterBuilder)  Time elapsed: 0.002 sec  <<< FAILURE!
junit.framework.ComparisonFailure: expected:<2007-03-[04 12:30] America/Bahia_Bande...> but was:<2007-03-[dd 12:mm] America/Bahia_Bande...>
	at junit.framework.Assert.assertEquals(Assert.java:81)
	at junit.framework.Assert.assertEquals(Assert.java:87)
	at org.joda.time.format.TestDateTimeFormatterBuilder.test_printParseZoneBahiaBanderas(TestDateTimeFormatterBuilder.java:444)

test_printParseOffset(org.joda.time.format.TestDateTimeFormatterBuilder)  Time elapsed: 0.001 sec  <<< FAILURE!
junit.framework.ComparisonFailure: expected:<2007-03-[04 12:30] +09:00> but was:<2007-03-[dd 12:mm] +09:00>
	at junit.framework.Assert.assertEquals(Assert.java:81)
	at junit.framework.Assert.assertEquals(Assert.java:87)
	at org.joda.time.format.TestDateTimeFormatterBuilder.test_printParseOffset(TestDateTimeFormatterBuilder.java:454)

test_printParseOffsetAndZone(org.joda.time.format.TestDateTimeFormatterBuilder)  Time elapsed: 0.001 sec  <<< FAILURE!
junit.framework.ComparisonFailure: expected:<2007-03-[04 12:30] +09:00 Asia/Tokyo> but was:<2007-03-[dd 12:mm] +09:00 Asia/Tokyo>
	at junit.framework.Assert.assertEquals(Assert.java:81)
	at junit.framework.Assert.assertEquals(Assert.java:87)
	at org.joda.time.format.TestDateTimeFormatterBuilder.test_printParseOffsetAndZone(TestDateTimeFormatterBuilder.java:466)

test_parseWrongOffset(org.joda.time.format.TestDateTimeFormatterBuilder)  Time elapsed: 0 sec  <<< ERROR!
java.lang.IllegalArgumentException: Invalid format: "2007-03-04 12:30 +07:00" is malformed at "-04 12:30 +07:00"
	at org.joda.time.format.DateTimeFormatter.parseDateTime(DateTimeFormatter.java:899)
	at org.joda.time.format.TestDateTimeFormatterBuilder.test_parseWrongOffset(TestDateTimeFormatterBuilder.java:479)

test_parseWrongOffsetAndZone(org.joda.time.format.TestDateTimeFormatterBuilder)  Time elapsed: 0.001 sec  <<< ERROR!
java.lang.IllegalArgumentException: Invalid format: "2007-03-04 12:30 +07:00 Asia/Tokyo" is malformed at "-04 12:30 +07:00 Asia/Tokyo"
	at org.joda.time.format.DateTimeFormatter.parseDateTime(DateTimeFormatter.java:899)
	at org.joda.time.format.TestDateTimeFormatterBuilder.test_parseWrongOffsetAndZone(TestDateTimeFormatterBuilder.java:493)

test_localPrintParseZoneTokyo(org.joda.time.format.TestDateTimeFormatterBuilder)  Time elapsed: 0.001 sec  <<< FAILURE!
junit.framework.ComparisonFailure: expected:<2007-03-[04 12:30] Asia/Tokyo> but was:<2007-03-[dd 12:mm] Asia/Tokyo>
	at junit.framework.Assert.assertEquals(Assert.java:81)
	at junit.framework.Assert.assertEquals(Assert.java:87)
	at org.joda.time.format.TestDateTimeFormatterBuilder.test_localPrintParseZoneTokyo(TestDateTimeFormatterBuilder.java:507)

test_localPrintParseOffset(org.joda.time.format.TestDateTimeFormatterBuilder)  Time elapsed: 0.001 sec  <<< FAILURE!
junit.framework.ComparisonFailure: expected:<2007-03-[04 12:30] +09:00> but was:<2007-03-[dd 12:mm] +09:00>
	at junit.framework.Assert.assertEquals(Assert.java:81)
	at junit.framework.Assert.assertEquals(Assert.java:87)
	at org.joda.time.format.TestDateTimeFormatterBuilder.test_localPrintParseOffset(TestDateTimeFormatterBuilder.java:519)

test_localPrintParseOffsetAndZone(org.joda.time.format.TestDateTimeFormatterBuilder)  Time elapsed: 0 sec  <<< FAILURE!
junit.framework.ComparisonFailure: expected:<2007-03-[04 12:30] +09:00 Asia/Tokyo> but was:<2007-03-[dd 12:mm] +09:00 Asia/Tokyo>
	at junit.framework.Assert.assertEquals(Assert.java:81)
	at junit.framework.Assert.assertEquals(Assert.java:87)
	at org.joda.time.format.TestDateTimeFormatterBuilder.test_localPrintParseOffsetAndZone(TestDateTimeFormatterBuilder.java:533)

test_localParseWrongOffsetAndZone(org.joda.time.format.TestDateTimeFormatterBuilder)  Time elapsed: 0.001 sec  <<< ERROR!
java.lang.IllegalArgumentException: Invalid format: "2007-03-04 12:30 +07:00 Asia/Tokyo" is malformed at "-04 12:30 +07:00 Asia/Tokyo"
	at org.joda.time.format.DateTimeFormatter.parseLocalDateTime(DateTimeFormatter.java:854)
	at org.joda.time.format.TestDateTimeFormatterBuilder.test_localParseWrongOffsetAndZone(TestDateTimeFormatterBuilder.java:547)

test_printParseShortName(org.joda.time.format.TestDateTimeFormatterBuilder)  Time elapsed: 0.001 sec  <<< FAILURE!
junit.framework.ComparisonFailure: expected:<2011-01-[04 12:30] GMT> but was:<2011-01-[dd 12:mm] GMT>
	at junit.framework.Assert.assertEquals(Assert.java:81)
	at junit.framework.Assert.assertEquals(Assert.java:87)
	at org.joda.time.format.TestDateTimeFormatterBuilder.test_printParseShortName(TestDateTimeFormatterBuilder.java:563)

test_printParseShortNameWithLookup(org.joda.time.format.TestDateTimeFormatterBuilder)  Time elapsed: 0 sec  <<< FAILURE!
junit.framework.ComparisonFailure: expected:<2011-01-[04 12:30] GMT> but was:<2011-01-[dd 12:mm] GMT>
	at junit.framework.Assert.assertEquals(Assert.java:81)
	at junit.framework.Assert.assertEquals(Assert.java:87)
	at org.joda.time.format.TestDateTimeFormatterBuilder.test_printParseShortNameWithLookup(TestDateTimeFormatterBuilder.java:584)

test_printParseShortNameWithAutoLookup(org.joda.time.format.TestDateTimeFormatterBuilder)  Time elapsed: 0.001 sec  <<< FAILURE!
junit.framework.ComparisonFailure: expected:<2011-01-[04 12:30] EST> but was:<2011-01-[dd 12:mm] EST>
	at junit.framework.Assert.assertEquals(Assert.java:81)
	at junit.framework.Assert.assertEquals(Assert.java:87)
	at org.joda.time.format.TestDateTimeFormatterBuilder.test_printParseShortNameWithAutoLookup(TestDateTimeFormatterBuilder.java:605)

test_printParseLongName(org.joda.time.format.TestDateTimeFormatterBuilder)  Time elapsed: 0 sec  <<< FAILURE!
junit.framework.ComparisonFailure: expected:<2011-01-[04 12:30] Greenwich Mean Time> but was:<2011-01-[dd 12:mm] Greenwich Mean Time>
	at junit.framework.Assert.assertEquals(Assert.java:81)
	at junit.framework.Assert.assertEquals(Assert.java:87)
	at org.joda.time.format.TestDateTimeFormatterBuilder.test_printParseLongName(TestDateTimeFormatterBuilder.java:637)

test_printParseLongNameWithLookup(org.joda.time.format.TestDateTimeFormatterBuilder)  Time elapsed: 0 sec  <<< FAILURE!
junit.framework.ComparisonFailure: expected:<2011-01-[04 12:30] Greenwich Mean Time> but was:<2011-01-[dd 12:mm] Greenwich Mean Time>
	at junit.framework.Assert.assertEquals(Assert.java:81)
	at junit.framework.Assert.assertEquals(Assert.java:87)
	at org.joda.time.format.TestDateTimeFormatterBuilder.test_printParseLongNameWithLookup(TestDateTimeFormatterBuilder.java:658)


Results :

Failed tests: 
  org.joda.time.TestDateMidnight_Basics#testToString_String_String ComparisonFailure
  org.joda.time.TestDateTime_Basics#testToString_String_Locale ComparisonFailure
  org.joda.time.TestLocalDateTime_Basics#testToString_String_Locale ComparisonFailure
  org.joda.time.TestLocalDate_Basics#testToString_String_Locale ComparisonFailure
  org.joda.time.TestLocalTime_Basics#testToString_String_Locale ComparisonFailure
  org.joda.time.TestMonthDay_Basics#testToString_String_Locale ComparisonFailure
  org.joda.time.TestMutableDateTime_Basics#testToString_String_String ComparisonFailure
  org.joda.time.TestPartial_Basics#testToString_String_Locale ComparisonFailure ...
  org.joda.time.TestTimeOfDay_Basics#testToString_String_Locale ComparisonFailure
  org.joda.time.TestYearMonthDay_Basics#testToString_String_Locale ComparisonFailure
  org.joda.time.TestYearMonth_Basics#testToString_String_Locale ComparisonFailure
  org.joda.time.format.TestDateTimeFormat#testFormatParse_textMonthApr_France ComparisonFailure
  org.joda.time.format.TestDateTimeFormat#testFormatParse_textMonthApr_Korean AssertionFailedError
  org.joda.time.format.TestDateTimeFormat#testFormatParse_textMonthJanShort_France ComparisonFailure
  org.joda.time.format.TestDateTimeFormat#testFormatParse_textMonthJanShort_UK ComparisonFailure
  org.joda.time.format.TestDateTimeFormat#testFormatParse_zoneId_colon ComparisonFailure
  org.joda.time.format.TestDateTimeFormat#testFormatParse_zoneId_noColon ComparisonFailure
  org.joda.time.format.TestDateTimeFormat#testFormat_samples ComparisonFailure e...
  org.joda.time.format.TestDateTimeFormatStyle#testForStyle_fullDate ComparisonFailure
  org.joda.time.format.TestDateTimeFormatStyle#testForStyle_fullDateTime ComparisonFailure
  org.joda.time.format.TestDateTimeFormatStyle#testForStyle_fullTime ComparisonFailure
  org.joda.time.format.TestDateTimeFormatStyle#testForStyle_longDate ComparisonFailure
  org.joda.time.format.TestDateTimeFormatStyle#testForStyle_longDateTime ComparisonFailure
  org.joda.time.format.TestDateTimeFormatStyle#testForStyle_longTime ComparisonFailure
  org.joda.time.format.TestDateTimeFormatStyle#testForStyle_mediumDate ComparisonFailure
  org.joda.time.format.TestDateTimeFormatStyle#testForStyle_mediumDateTime ComparisonFailure
  org.joda.time.format.TestDateTimeFormatStyle#testForStyle_mediumFullDateTime ComparisonFailure
  org.joda.time.format.TestDateTimeFormatStyle#testForStyle_mediumLongDateTime ComparisonFailure
  org.joda.time.format.TestDateTimeFormatStyle#testForStyle_mediumShortDateTime ComparisonFailure
  org.joda.time.format.TestDateTimeFormatStyle#testForStyle_mediumTime ComparisonFailure
  org.joda.time.format.TestDateTimeFormatStyle#testForStyle_shortDate ComparisonFailure
  org.joda.time.format.TestDateTimeFormatStyle#testForStyle_shortDateTime ComparisonFailure
  org.joda.time.format.TestDateTimeFormatStyle#testForStyle_shortFullDateTime ComparisonFailure
  org.joda.time.format.TestDateTimeFormatStyle#testForStyle_shortLongDateTime ComparisonFailure
  org.joda.time.format.TestDateTimeFormatStyle#testForStyle_shortMediumDateTime ComparisonFailure
  org.joda.time.format.TestDateTimeFormatStyle#testForStyle_shortTime ComparisonFailure
  org.joda.time.format.TestDateTimeFormatter#testParseInto_monthDay_feb29 AssertionFailedError
  org.joda.time.format.TestDateTimeFormatter#testParseInto_monthDay_feb29_OfYear AssertionFailedError
  org.joda.time.format.TestDateTimeFormatter#testParseInto_monthDay_feb29_newYork AssertionFailedError
  org.joda.time.format.TestDateTimeFormatter#testParseInto_monthDay_feb29_newYork_endOfYear AssertionFailedError
  org.joda.time.format.TestDateTimeFormatter#testParseInto_monthDay_feb29_newYork_startOfYear AssertionFailedError
  org.joda.time.format.TestDateTimeFormatter#testParseInto_monthDay_feb29_startOfYear AssertionFailedError
  org.joda.time.format.TestDateTimeFormatter#testParseInto_monthDay_feb29_tokyo AssertionFailedError
  org.joda.time.format.TestDateTimeFormatter#testParseInto_monthDay_feb29_tokyo_endOfYear AssertionFailedError
  org.joda.time.format.TestDateTimeFormatter#testParseInto_monthDay_feb29_tokyo_startOfYear AssertionFailedError
  org.joda.time.format.TestDateTimeFormatter#testParseInto_monthDay_withDefaultYear_feb29 AssertionFailedError
  org.joda.time.format.TestDateTimeFormatter#testParseInto_monthDay_withDefaultYear_feb29_newYork AssertionFailedError
  org.joda.time.format.TestDateTimeFormatter#testParseInto_monthDay_withDefaultYear_feb29_newYork_endOfYear AssertionFailedError
  org.joda.time.format.TestDateTimeFormatter#testZoneNameNearTransition ComparisonFailure
  org.joda.time.format.TestDateTimeFormatter#testZoneShortNameNearTransition ComparisonFailure
  org.joda.time.format.TestDateTimeFormatterBuilder#test_localPrintParseOffset ComparisonFailure
  org.joda.time.format.TestDateTimeFormatterBuilder#test_localPrintParseOffsetAndZone ComparisonFailure
  org.joda.time.format.TestDateTimeFormatterBuilder#test_localPrintParseZoneTokyo ComparisonFailure
  org.joda.time.format.TestDateTimeFormatterBuilder#test_printParseLongName ComparisonFailure
  org.joda.time.format.TestDateTimeFormatterBuilder#test_printParseLongNameWithLookup ComparisonFailure
  org.joda.time.format.TestDateTimeFormatterBuilder#test_printParseOffset ComparisonFailure
  org.joda.time.format.TestDateTimeFormatterBuilder#test_printParseOffsetAndZone ComparisonFailure
  org.joda.time.format.TestDateTimeFormatterBuilder#test_printParseShortName ComparisonFailure
  org.joda.time.format.TestDateTimeFormatterBuilder#test_printParseShortNameWithAutoLookup ComparisonFailure
  org.joda.time.format.TestDateTimeFormatterBuilder#test_printParseShortNameWithLookup ComparisonFailure
  org.joda.time.format.TestDateTimeFormatterBuilder#test_printParseZoneBahiaBanderas ComparisonFailure
  org.joda.time.format.TestDateTimeFormatterBuilder#test_printParseZoneDawsonCreek ComparisonFailure
  org.joda.time.format.TestDateTimeFormatterBuilder#test_printParseZoneParis ComparisonFailure
  org.joda.time.format.TestDateTimeFormatterBuilder#test_printParseZoneTokyo ComparisonFailure
Tests in error: 
  org.joda.time.TestDateMidnight_Constructors#testParse_formatter IllegalArgumentException
  org.joda.time.TestDateTime_Constructors#testParse_formatter IllegalArgumentException
  org.joda.time.TestInstant_Constructors#testParse_formatter IllegalArgumentException
  org.joda.time.TestLocalDateTime_Constructors#testParse_formatter IllegalArgumentException
  org.joda.time.TestLocalDate_Constructors#testParse_formatter IllegalArgumentException
  org.joda.time.TestLocalTime_Constructors#testParse_formatter IllegalArgumentException
  org.joda.time.TestMonthDay_Constructors#testParse_formatter IllegalArgumentException
  org.joda.time.TestMonthDay_Constructors#testParse_noFormatter IllegalArgumentException
  org.joda.time.TestMutableDateTime_Constructors#testParse_formatter IllegalArgumentException
  org.joda.time.TestStringConvert#testMonthDay IllegalArgumentException Invalid ...
  org.joda.time.TestStringConvert#testMonthDay_leapDay IllegalArgumentException ...
  org.joda.time.format.TestDateTimeFormat#testFormatParse_textMonthJanLongLowerCase_UK IllegalArgumentException
  org.joda.time.format.TestDateTimeFormat#testFormatParse_textMonthJanLongUpperCase_UK IllegalArgumentException
  org.joda.time.format.TestDateTimeFormat#testFormatParse_textMonthJanLong_France IllegalArgumentException
  org.joda.time.format.TestDateTimeFormat#testFormatParse_textMonthJanShortLowerCase_UK IllegalArgumentException
  org.joda.time.format.TestDateTimeFormat#testFormatParse_textMonthJanShortUpperCase_UK IllegalArgumentException
  org.joda.time.format.TestDateTimeFormat#testFormatParse_zoneId_colon_parseZ IllegalArgumentException
  org.joda.time.format.TestDateTimeFormat#testFormatParse_zoneId_noColon_parseZ IllegalArgumentException
  org.joda.time.format.TestDateTimeFormat#testFormat_shortBasicParse IllegalArgumentException
  org.joda.time.format.TestDateTimeFormat#testParse_pivotYear IllegalArgumentException
  org.joda.time.format.TestDateTimeFormat#testParse_pivotYear_ignored4DigitYear IllegalArgumentException
  org.joda.time.format.TestDateTimeFormat#testParse_textMonthJanLong_UK IllegalArgumentException
  org.joda.time.format.TestDateTimeFormatter#testParseLocalDateTime_monthDay_feb29 IllegalArgumentException
  org.joda.time.format.TestDateTimeFormatter#testParseLocalDateTime_monthDay_withDefaultYear_feb29 IllegalArgumentException
  org.joda.time.format.TestDateTimeFormatter#testParseLocalDate_monthDay_feb29 IllegalArgumentException
  org.joda.time.format.TestDateTimeFormatter#testParseLocalDate_monthDay_withDefaultYear_feb29 IllegalArgumentException
  org.joda.time.format.TestDateTimeFormatter#testParseLocalDate_weekyear_month_week_2010 IllegalArgumentException
  org.joda.time.format.TestDateTimeFormatter#testParseLocalDate_weekyear_month_week_2011 IllegalArgumentException
  org.joda.time.format.TestDateTimeFormatter#testParseLocalDate_weekyear_month_week_2012 IllegalArgumentException
  org.joda.time.format.TestDateTimeFormatter#testParseLocalDate_yearOfCentury IllegalArgumentException
  org.joda.time.format.TestDateTimeFormatter#testParseLocalDate_year_month_week_2010 IllegalArgumentException
  org.joda.time.format.TestDateTimeFormatter#testParseLocalDate_year_month_week_2011 IllegalArgumentException
  org.joda.time.format.TestDateTimeFormatter#testParseLocalDate_year_month_week_2012 IllegalArgumentException
  org.joda.time.format.TestDateTimeFormatter#testParseLocalDate_year_month_week_2013 IllegalArgumentException
  org.joda.time.format.TestDateTimeFormatter#testParseLocalDate_year_month_week_2014 IllegalArgumentException
  org.joda.time.format.TestDateTimeFormatter#testParseLocalDate_year_month_week_2015 IllegalArgumentException
  org.joda.time.format.TestDateTimeFormatter#testParseLocalDate_year_month_week_2016 IllegalArgumentException
  org.joda.time.format.TestDateTimeFormatterBuilder#test_localParseWrongOffsetAndZone IllegalArgumentException
  org.joda.time.format.TestDateTimeFormatterBuilder#test_parseWrongOffset IllegalArgumentException
  org.joda.time.format.TestDateTimeFormatterBuilder#test_parseWrongOffsetAndZone IllegalArgumentException

Tests run: 4157, Failures: 64, Errors: 40, Skipped: 0

[INFO] ------------------------------------------------------------------------
[INFO] BUILD FAILURE
[INFO] ------------------------------------------------------------------------
[INFO] Total time: 15.797s
[INFO] Finished at: Thu Aug 06 06:03:34 BST 2015
[INFO] Final Memory: 9M/209M
[INFO] ------------------------------------------------------------------------
[ERROR] Failed to execute goal org.apache.maven.plugins:maven-surefire-plugin:2.18.1:test (default-test) on project joda-time: There are test failures.
[ERROR] 
[ERROR] Please refer to /home/perham/Study/LittleDarwin/Cases/joda-time-2.8.1/target/surefire-reports for the individual test results.
[ERROR] -> [Help 1]
[ERROR] 
[ERROR] To see the full stack trace of the errors, re-run Maven with the -e switch.
[ERROR] Re-run Maven using the -X switch to enable full debug logging.
[ERROR] 
[ERROR] For more information about the errors and possible solutions, please read the following articles:
[ERROR] [Help 1] http://cwiki.apache.org/confluence/display/MAVEN/MojoFailureException
