[INFO] Scanning for projects...
[INFO]                                                                         
[INFO] ------------------------------------------------------------------------
[INFO] Building Joda-Time 2.8.1
[INFO] ------------------------------------------------------------------------
[INFO] 
[INFO] --- maven-resources-plugin:2.7:resources (default-resources) @ joda-time ---
[INFO] Using 'UTF-8' encoding to copy filtered resources.
[INFO] Copying 2 resources to META-INF
[INFO] Copying 10 resources
[INFO] 
[INFO] --- maven-compiler-plugin:3.3:compile (default-compile) @ joda-time ---
[INFO] Changes detected - recompiling the module!
[INFO] Compiling 166 source files to /home/perham/Study/LittleDarwin/Cases/joda-time-2.8.1/target/classes
[INFO] 
[INFO] --- exec-maven-plugin:1.4.0:java (compile-tzdb) @ joda-time ---
Writing zoneinfo files
Writing ZoneInfoMap
[INFO] 
[INFO] --- maven-resources-plugin:2.7:testResources (default-testResources) @ joda-time ---
[INFO] Using 'UTF-8' encoding to copy filtered resources.
[INFO] Copying 34 resources
[INFO] 
[INFO] --- maven-compiler-plugin:3.3:testCompile (default-testCompile) @ joda-time ---
[INFO] Nothing to compile - all classes are up to date
[INFO] 
[INFO] --- maven-surefire-plugin:2.18.1:test (default-test) @ joda-time ---
[INFO] Surefire report directory: /home/perham/Study/LittleDarwin/Cases/joda-time-2.8.1/target/surefire-reports

-------------------------------------------------------
 T E S T S
-------------------------------------------------------
Running org.joda.time.TestAllPackages

TestBuddhistChronology.testCalendar

TestCopticChronology.testCalendar

TestEthiopicChronology.testCalendar

TestIslamicChronology.testCalendar

Testing Gregorian chronology over 1000 iterations
100% complete (i=1000)

Testing Julian chronology over 1000 iterations
100% complete (i=1000)
Writing zoneinfo files
Writing ZoneInfoMap
Tests run: 4157, Failures: 0, Errors: 20, Skipped: 0, Time elapsed: 5.294 sec <<< FAILURE! - in org.joda.time.TestAllPackages
testForStyle_fullDateTime(org.joda.time.format.TestDateTimeFormatStyle)  Time elapsed: 0.007 sec  <<< ERROR!
java.lang.IllegalArgumentException: Invalid style specification: FF
	at org.joda.time.format.DateTimeFormat.createFormatterForStyle(DateTimeFormat.java:160)
	at org.joda.time.format.DateTimeFormat.forStyle(DateTimeFormat.java:31)
	at org.joda.time.format.TestDateTimeFormatStyle.testForStyle_fullDateTime(TestDateTimeFormatStyle.java:291)

testForStyle_shortMediumDateTime(org.joda.time.format.TestDateTimeFormatStyle)  Time elapsed: 0 sec  <<< ERROR!
java.lang.IllegalArgumentException: Invalid style specification: SM
	at org.joda.time.format.DateTimeFormat.createFormatterForStyle(DateTimeFormat.java:160)
	at org.joda.time.format.DateTimeFormat.forStyle(DateTimeFormat.java:31)
	at org.joda.time.format.TestDateTimeFormatStyle.testForStyle_shortMediumDateTime(TestDateTimeFormatStyle.java:304)

testForStyle_shortLongDateTime(org.joda.time.format.TestDateTimeFormatStyle)  Time elapsed: 0.002 sec  <<< ERROR!
java.lang.IllegalArgumentException: Invalid style specification: SL
	at org.joda.time.format.DateTimeFormat.createFormatterForStyle(DateTimeFormat.java:160)
	at org.joda.time.format.DateTimeFormat.forStyle(DateTimeFormat.java:31)
	at org.joda.time.format.TestDateTimeFormatStyle.testForStyle_shortLongDateTime(TestDateTimeFormatStyle.java:315)

testForStyle_shortFullDateTime(org.joda.time.format.TestDateTimeFormatStyle)  Time elapsed: 0.001 sec  <<< ERROR!
java.lang.IllegalArgumentException: Invalid style specification: SF
	at org.joda.time.format.DateTimeFormat.createFormatterForStyle(DateTimeFormat.java:160)
	at org.joda.time.format.DateTimeFormat.forStyle(DateTimeFormat.java:31)
	at org.joda.time.format.TestDateTimeFormatStyle.testForStyle_shortFullDateTime(TestDateTimeFormatStyle.java:326)

testForStyle_mediumShortDateTime(org.joda.time.format.TestDateTimeFormatStyle)  Time elapsed: 0.001 sec  <<< ERROR!
java.lang.IllegalArgumentException: Invalid style specification: MS
	at org.joda.time.format.DateTimeFormat.createFormatterForStyle(DateTimeFormat.java:160)
	at org.joda.time.format.DateTimeFormat.forStyle(DateTimeFormat.java:31)
	at org.joda.time.format.TestDateTimeFormatStyle.testForStyle_mediumShortDateTime(TestDateTimeFormatStyle.java:338)

testForStyle_mediumLongDateTime(org.joda.time.format.TestDateTimeFormatStyle)  Time elapsed: 0.001 sec  <<< ERROR!
java.lang.IllegalArgumentException: Invalid style specification: ML
	at org.joda.time.format.DateTimeFormat.createFormatterForStyle(DateTimeFormat.java:160)
	at org.joda.time.format.DateTimeFormat.forStyle(DateTimeFormat.java:31)
	at org.joda.time.format.TestDateTimeFormatStyle.testForStyle_mediumLongDateTime(TestDateTimeFormatStyle.java:349)

testForStyle_mediumFullDateTime(org.joda.time.format.TestDateTimeFormatStyle)  Time elapsed: 0.001 sec  <<< ERROR!
java.lang.IllegalArgumentException: Invalid style specification: MF
	at org.joda.time.format.DateTimeFormat.createFormatterForStyle(DateTimeFormat.java:160)
	at org.joda.time.format.DateTimeFormat.forStyle(DateTimeFormat.java:31)
	at org.joda.time.format.TestDateTimeFormatStyle.testForStyle_mediumFullDateTime(TestDateTimeFormatStyle.java:360)

test_patternForStyle(org.joda.time.format.TestDateTimeFormatStyle)  Time elapsed: 0.001 sec  <<< ERROR!
java.lang.IllegalArgumentException: Invalid style specification: MF
	at org.joda.time.format.DateTimeFormat.createFormatterForStyle(DateTimeFormat.java:160)
	at org.joda.time.format.DateTimeFormat.patternForStyle(DateTimeFormat.java:32)
	at org.joda.time.format.TestDateTimeFormatStyle.test_patternForStyle(TestDateTimeFormatStyle.java:371)

testForStyle_stringLengths(org.joda.time.format.TestDateTimeFormatStyle)  Time elapsed: 0.001 sec  <<< ERROR!
java.lang.StringIndexOutOfBoundsException: String index out of range: 0
	at java.lang.String.charAt(String.java:658)
	at org.joda.time.format.DateTimeFormat.createFormatterForStyle(DateTimeFormat.java:161)
	at org.joda.time.format.DateTimeFormat.forStyle(DateTimeFormat.java:31)
	at org.joda.time.format.TestDateTimeFormatStyle.testForStyle_stringLengths(TestDateTimeFormatStyle.java:98)

testForStyle_shortDate(org.joda.time.format.TestDateTimeFormatStyle)  Time elapsed: 0.001 sec  <<< ERROR!
java.lang.IllegalArgumentException: Invalid style specification: S-
	at org.joda.time.format.DateTimeFormat.createFormatterForStyle(DateTimeFormat.java:160)
	at org.joda.time.format.DateTimeFormat.forStyle(DateTimeFormat.java:31)
	at org.joda.time.format.TestDateTimeFormatStyle.testForStyle_shortDate(TestDateTimeFormatStyle.java:129)

testForStyle_shortTime(org.joda.time.format.TestDateTimeFormatStyle)  Time elapsed: 0.001 sec  <<< ERROR!
java.lang.IllegalArgumentException: Invalid style specification: -S
	at org.joda.time.format.DateTimeFormat.createFormatterForStyle(DateTimeFormat.java:160)
	at org.joda.time.format.DateTimeFormat.forStyle(DateTimeFormat.java:31)
	at org.joda.time.format.TestDateTimeFormatStyle.testForStyle_shortTime(TestDateTimeFormatStyle.java:146)

testForStyle_shortDateTime(org.joda.time.format.TestDateTimeFormatStyle)  Time elapsed: 0.001 sec  <<< ERROR!
java.lang.IllegalArgumentException: Invalid style specification: SS
	at org.joda.time.format.DateTimeFormat.createFormatterForStyle(DateTimeFormat.java:160)
	at org.joda.time.format.DateTimeFormat.forStyle(DateTimeFormat.java:31)
	at org.joda.time.format.TestDateTimeFormatStyle.testForStyle_shortDateTime(TestDateTimeFormatStyle.java:167)

testForStyle_mediumDate(org.joda.time.format.TestDateTimeFormatStyle)  Time elapsed: 0.001 sec  <<< ERROR!
java.lang.IllegalArgumentException: Invalid style specification: M-
	at org.joda.time.format.DateTimeFormat.createFormatterForStyle(DateTimeFormat.java:160)
	at org.joda.time.format.DateTimeFormat.forStyle(DateTimeFormat.java:31)
	at org.joda.time.format.TestDateTimeFormatStyle.testForStyle_mediumDate(TestDateTimeFormatStyle.java:185)

testForStyle_mediumTime(org.joda.time.format.TestDateTimeFormatStyle)  Time elapsed: 0.001 sec  <<< ERROR!
java.lang.IllegalArgumentException: Invalid style specification: -M
	at org.joda.time.format.DateTimeFormat.createFormatterForStyle(DateTimeFormat.java:160)
	at org.joda.time.format.DateTimeFormat.forStyle(DateTimeFormat.java:31)
	at org.joda.time.format.TestDateTimeFormatStyle.testForStyle_mediumTime(TestDateTimeFormatStyle.java:198)

testForStyle_mediumDateTime(org.joda.time.format.TestDateTimeFormatStyle)  Time elapsed: 0 sec  <<< ERROR!
java.lang.IllegalArgumentException: Invalid style specification: MM
	at org.joda.time.format.DateTimeFormat.createFormatterForStyle(DateTimeFormat.java:160)
	at org.joda.time.format.DateTimeFormat.forStyle(DateTimeFormat.java:31)
	at org.joda.time.format.TestDateTimeFormatStyle.testForStyle_mediumDateTime(TestDateTimeFormatStyle.java:211)

testForStyle_longDate(org.joda.time.format.TestDateTimeFormatStyle)  Time elapsed: 0.001 sec  <<< ERROR!
java.lang.IllegalArgumentException: Invalid style specification: L-
	at org.joda.time.format.DateTimeFormat.createFormatterForStyle(DateTimeFormat.java:160)
	at org.joda.time.format.DateTimeFormat.forStyle(DateTimeFormat.java:31)
	at org.joda.time.format.TestDateTimeFormatStyle.testForStyle_longDate(TestDateTimeFormatStyle.java:225)

testForStyle_longTime(org.joda.time.format.TestDateTimeFormatStyle)  Time elapsed: 0 sec  <<< ERROR!
java.lang.IllegalArgumentException: Invalid style specification: -L
	at org.joda.time.format.DateTimeFormat.createFormatterForStyle(DateTimeFormat.java:160)
	at org.joda.time.format.DateTimeFormat.forStyle(DateTimeFormat.java:31)
	at org.joda.time.format.TestDateTimeFormatStyle.testForStyle_longTime(TestDateTimeFormatStyle.java:238)

testForStyle_longDateTime(org.joda.time.format.TestDateTimeFormatStyle)  Time elapsed: 0.001 sec  <<< ERROR!
java.lang.IllegalArgumentException: Invalid style specification: LL
	at org.joda.time.format.DateTimeFormat.createFormatterForStyle(DateTimeFormat.java:160)
	at org.joda.time.format.DateTimeFormat.forStyle(DateTimeFormat.java:31)
	at org.joda.time.format.TestDateTimeFormatStyle.testForStyle_longDateTime(TestDateTimeFormatStyle.java:251)

testForStyle_fullDate(org.joda.time.format.TestDateTimeFormatStyle)  Time elapsed: 0 sec  <<< ERROR!
java.lang.IllegalArgumentException: Invalid style specification: F-
	at org.joda.time.format.DateTimeFormat.createFormatterForStyle(DateTimeFormat.java:160)
	at org.joda.time.format.DateTimeFormat.forStyle(DateTimeFormat.java:31)
	at org.joda.time.format.TestDateTimeFormatStyle.testForStyle_fullDate(TestDateTimeFormatStyle.java:265)

testForStyle_fullTime(org.joda.time.format.TestDateTimeFormatStyle)  Time elapsed: 0.001 sec  <<< ERROR!
java.lang.IllegalArgumentException: Invalid style specification: -F
	at org.joda.time.format.DateTimeFormat.createFormatterForStyle(DateTimeFormat.java:160)
	at org.joda.time.format.DateTimeFormat.forStyle(DateTimeFormat.java:31)
	at org.joda.time.format.TestDateTimeFormatStyle.testForStyle_fullTime(TestDateTimeFormatStyle.java:278)


Results :

Tests in error: 
  org.joda.time.format.TestDateTimeFormatStyle#testForStyle_fullDate IllegalArgumentException
  org.joda.time.format.TestDateTimeFormatStyle#testForStyle_fullDateTime IllegalArgumentException
  org.joda.time.format.TestDateTimeFormatStyle#testForStyle_fullTime IllegalArgumentException
  org.joda.time.format.TestDateTimeFormatStyle#testForStyle_longDate IllegalArgumentException
  org.joda.time.format.TestDateTimeFormatStyle#testForStyle_longDateTime IllegalArgumentException
  org.joda.time.format.TestDateTimeFormatStyle#testForStyle_longTime IllegalArgumentException
  org.joda.time.format.TestDateTimeFormatStyle#testForStyle_mediumDate IllegalArgumentException
  org.joda.time.format.TestDateTimeFormatStyle#testForStyle_mediumDateTime IllegalArgumentException
  org.joda.time.format.TestDateTimeFormatStyle#testForStyle_mediumFullDateTime IllegalArgumentException
  org.joda.time.format.TestDateTimeFormatStyle#testForStyle_mediumLongDateTime IllegalArgumentException
  org.joda.time.format.TestDateTimeFormatStyle#testForStyle_mediumShortDateTime IllegalArgumentException
  org.joda.time.format.TestDateTimeFormatStyle#testForStyle_mediumTime IllegalArgumentException
  org.joda.time.format.TestDateTimeFormatStyle#testForStyle_shortDate IllegalArgumentException
  org.joda.time.format.TestDateTimeFormatStyle#testForStyle_shortDateTime IllegalArgumentException
  org.joda.time.format.TestDateTimeFormatStyle#testForStyle_shortFullDateTime IllegalArgumentException
  org.joda.time.format.TestDateTimeFormatStyle#testForStyle_shortLongDateTime IllegalArgumentException
  org.joda.time.format.TestDateTimeFormatStyle#testForStyle_shortMediumDateTime IllegalArgumentException
  org.joda.time.format.TestDateTimeFormatStyle#testForStyle_shortTime IllegalArgumentException
  org.joda.time.format.TestDateTimeFormatStyle#testForStyle_stringLengths StringIndexOutOfBoundsException
  org.joda.time.format.TestDateTimeFormatStyle#test_patternForStyle IllegalArgumentException

Tests run: 4157, Failures: 0, Errors: 20, Skipped: 0

[INFO] ------------------------------------------------------------------------
[INFO] BUILD FAILURE
[INFO] ------------------------------------------------------------------------
[INFO] Total time: 15.436s
[INFO] Finished at: Thu Aug 06 06:00:58 BST 2015
[INFO] Final Memory: 9M/209M
[INFO] ------------------------------------------------------------------------
[ERROR] Failed to execute goal org.apache.maven.plugins:maven-surefire-plugin:2.18.1:test (default-test) on project joda-time: There are test failures.
[ERROR] 
[ERROR] Please refer to /home/perham/Study/LittleDarwin/Cases/joda-time-2.8.1/target/surefire-reports for the individual test results.
[ERROR] -> [Help 1]
[ERROR] 
[ERROR] To see the full stack trace of the errors, re-run Maven with the -e switch.
[ERROR] Re-run Maven using the -X switch to enable full debug logging.
[ERROR] 
[ERROR] For more information about the errors and possible solutions, please read the following articles:
[ERROR] [Help 1] http://cwiki.apache.org/confluence/display/MAVEN/MojoFailureException
