[INFO] Scanning for projects...
[INFO]                                                                         
[INFO] ------------------------------------------------------------------------
[INFO] Building Joda-Time 2.8.1
[INFO] ------------------------------------------------------------------------
[INFO] 
[INFO] --- maven-resources-plugin:2.7:resources (default-resources) @ joda-time ---
[INFO] Using 'UTF-8' encoding to copy filtered resources.
[INFO] Copying 2 resources to META-INF
[INFO] Copying 10 resources
[INFO] 
[INFO] --- maven-compiler-plugin:3.3:compile (default-compile) @ joda-time ---
[INFO] Changes detected - recompiling the module!
[INFO] Compiling 166 source files to /home/perham/Study/LittleDarwin/Cases/joda-time-2.8.1/target/classes
[INFO] 
[INFO] --- exec-maven-plugin:1.4.0:java (compile-tzdb) @ joda-time ---
Writing zoneinfo files
Writing ZoneInfoMap
[INFO] 
[INFO] --- maven-resources-plugin:2.7:testResources (default-testResources) @ joda-time ---
[INFO] Using 'UTF-8' encoding to copy filtered resources.
[INFO] Copying 34 resources
[INFO] 
[INFO] --- maven-compiler-plugin:3.3:testCompile (default-testCompile) @ joda-time ---
[INFO] Nothing to compile - all classes are up to date
[INFO] 
[INFO] --- maven-surefire-plugin:2.18.1:test (default-test) @ joda-time ---
[INFO] Surefire report directory: /home/perham/Study/LittleDarwin/Cases/joda-time-2.8.1/target/surefire-reports

-------------------------------------------------------
 T E S T S
-------------------------------------------------------
Running org.joda.time.TestAllPackages

TestBuddhistChronology.testCalendar

TestCopticChronology.testCalendar

TestEthiopicChronology.testCalendar

TestIslamicChronology.testCalendar

Testing Gregorian chronology over 1000 iterations
100% complete (i=1000)

Testing Julian chronology over 1000 iterations
100% complete (i=1000)
Writing zoneinfo files
Writing ZoneInfoMap
Tests run: 4157, Failures: 0, Errors: 295, Skipped: 0, Time elapsed: 5.295 sec <<< FAILURE! - in org.joda.time.TestAllPackages
testParse_formatter(org.joda.time.TestInstant_Constructors)  Time elapsed: 0.005 sec  <<< ERROR!
java.lang.StringIndexOutOfBoundsException: String index out of range: 14
	at java.lang.String.charAt(String.java:658)
	at org.joda.time.format.DateTimeFormat.parseToken(DateTimeFormat.java:130)
	at org.joda.time.format.DateTimeFormat.parsePatternTo(DateTimeFormat.java:54)
	at org.joda.time.format.DateTimeFormat.createFormatterForPattern(DateTimeFormat.java:155)
	at org.joda.time.format.DateTimeFormat.forPattern(DateTimeFormat.java:30)
	at org.joda.time.TestInstant_Constructors.testParse_formatter(TestInstant_Constructors.java:105)

testParse_formatter(org.joda.time.TestDateTime_Constructors)  Time elapsed: 0.001 sec  <<< ERROR!
java.lang.StringIndexOutOfBoundsException: String index out of range: 14
	at java.lang.String.charAt(String.java:658)
	at org.joda.time.format.DateTimeFormat.parseToken(DateTimeFormat.java:130)
	at org.joda.time.format.DateTimeFormat.parsePatternTo(DateTimeFormat.java:54)
	at org.joda.time.format.DateTimeFormat.createFormatterForPattern(DateTimeFormat.java:155)
	at org.joda.time.format.DateTimeFormat.forPattern(DateTimeFormat.java:30)
	at org.joda.time.TestDateTime_Constructors.testParse_formatter(TestDateTime_Constructors.java:177)

testToString_String(org.joda.time.TestDateTime_Basics)  Time elapsed: 0.001 sec  <<< ERROR!
java.lang.StringIndexOutOfBoundsException: String index out of range: 7
	at java.lang.String.charAt(String.java:658)
	at org.joda.time.format.DateTimeFormat.parseToken(DateTimeFormat.java:130)
	at org.joda.time.format.DateTimeFormat.parsePatternTo(DateTimeFormat.java:54)
	at org.joda.time.format.DateTimeFormat.createFormatterForPattern(DateTimeFormat.java:155)
	at org.joda.time.format.DateTimeFormat.forPattern(DateTimeFormat.java:30)
	at org.joda.time.base.AbstractDateTime.toString(AbstractDateTime.java:328)
	at org.joda.time.TestDateTime_Basics.testToString_String(TestDateTime_Basics.java:512)

testToString_String_Locale(org.joda.time.TestDateTime_Basics)  Time elapsed: 0.002 sec  <<< ERROR!
java.lang.StringIndexOutOfBoundsException: String index out of range: 7
	at java.lang.String.charAt(String.java:658)
	at org.joda.time.format.DateTimeFormat.parseToken(DateTimeFormat.java:130)
	at org.joda.time.format.DateTimeFormat.parsePatternTo(DateTimeFormat.java:54)
	at org.joda.time.format.DateTimeFormat.createFormatterForPattern(DateTimeFormat.java:155)
	at org.joda.time.format.DateTimeFormat.forPattern(DateTimeFormat.java:30)
	at org.joda.time.base.AbstractDateTime.toString(AbstractDateTime.java:343)
	at org.joda.time.TestDateTime_Basics.testToString_String_Locale(TestDateTime_Basics.java:518)

testToString_DTFormatter(org.joda.time.TestDateTime_Basics)  Time elapsed: 0 sec  <<< ERROR!
java.lang.StringIndexOutOfBoundsException: String index out of range: 7
	at java.lang.String.charAt(String.java:658)
	at org.joda.time.format.DateTimeFormat.parseToken(DateTimeFormat.java:130)
	at org.joda.time.format.DateTimeFormat.parsePatternTo(DateTimeFormat.java:54)
	at org.joda.time.format.DateTimeFormat.createFormatterForPattern(DateTimeFormat.java:155)
	at org.joda.time.format.DateTimeFormat.forPattern(DateTimeFormat.java:30)
	at org.joda.time.TestDateTime_Basics.testToString_DTFormatter(TestDateTime_Basics.java:528)

testPropertyWithMaximumValueMillisOfDayDSTGap(org.joda.time.TestDateTime_Properties)  Time elapsed: 0.001 sec  <<< ERROR!
java.lang.StringIndexOutOfBoundsException: String index out of range: 25
	at java.lang.String.charAt(String.java:658)
	at org.joda.time.format.DateTimeFormat.parseToken(DateTimeFormat.java:130)
	at org.joda.time.format.DateTimeFormat.parsePatternTo(DateTimeFormat.java:54)
	at org.joda.time.format.DateTimeFormat.createFormatterForPattern(DateTimeFormat.java:155)
	at org.joda.time.format.DateTimeFormat.forPattern(DateTimeFormat.java:30)
	at org.joda.time.IllegalInstantException.createMessage(IllegalInstantException.java:67)
	at org.joda.time.IllegalInstantException.<init>(IllegalInstantException.java:63)
	at org.joda.time.chrono.ZonedChronology$ZonedDateTimeField.set(ZonedChronology.java:485)
	at org.joda.time.DateTime$Property.setCopy(DateTime.java:2220)
	at org.joda.time.DateTime$Property.withMaximumValue(DateTime.java:2281)
	at org.joda.time.TestDateTime_Properties.testPropertyWithMaximumValueMillisOfDayDSTGap(TestDateTime_Properties.java:650)

testPropertyWithMinimumValueMillisOfDayDSTGap(org.joda.time.TestDateTime_Properties)  Time elapsed: 0.002 sec  <<< ERROR!
java.lang.StringIndexOutOfBoundsException: String index out of range: 25
	at java.lang.String.charAt(String.java:658)
	at org.joda.time.format.DateTimeFormat.parseToken(DateTimeFormat.java:130)
	at org.joda.time.format.DateTimeFormat.parsePatternTo(DateTimeFormat.java:54)
	at org.joda.time.format.DateTimeFormat.createFormatterForPattern(DateTimeFormat.java:155)
	at org.joda.time.format.DateTimeFormat.forPattern(DateTimeFormat.java:30)
	at org.joda.time.IllegalInstantException.createMessage(IllegalInstantException.java:67)
	at org.joda.time.IllegalInstantException.<init>(IllegalInstantException.java:63)
	at org.joda.time.chrono.ZonedChronology$ZonedDateTimeField.set(ZonedChronology.java:485)
	at org.joda.time.DateTime$Property.setCopy(DateTime.java:2220)
	at org.joda.time.DateTime$Property.withMinimumValue(DateTime.java:2310)
	at org.joda.time.TestDateTime_Properties.testPropertyWithMinimumValueMillisOfDayDSTGap(TestDateTime_Properties.java:664)

testParse_formatter(org.joda.time.TestMutableDateTime_Constructors)  Time elapsed: 0.001 sec  <<< ERROR!
java.lang.StringIndexOutOfBoundsException: String index out of range: 14
	at java.lang.String.charAt(String.java:658)
	at org.joda.time.format.DateTimeFormat.parseToken(DateTimeFormat.java:130)
	at org.joda.time.format.DateTimeFormat.parsePatternTo(DateTimeFormat.java:54)
	at org.joda.time.format.DateTimeFormat.createFormatterForPattern(DateTimeFormat.java:155)
	at org.joda.time.format.DateTimeFormat.forPattern(DateTimeFormat.java:30)
	at org.joda.time.TestMutableDateTime_Constructors.testParse_formatter(TestMutableDateTime_Constructors.java:162)

testToString_String(org.joda.time.TestMutableDateTime_Basics)  Time elapsed: 0 sec  <<< ERROR!
java.lang.StringIndexOutOfBoundsException: String index out of range: 7
	at java.lang.String.charAt(String.java:658)
	at org.joda.time.format.DateTimeFormat.parseToken(DateTimeFormat.java:130)
	at org.joda.time.format.DateTimeFormat.parsePatternTo(DateTimeFormat.java:54)
	at org.joda.time.format.DateTimeFormat.createFormatterForPattern(DateTimeFormat.java:155)
	at org.joda.time.format.DateTimeFormat.forPattern(DateTimeFormat.java:30)
	at org.joda.time.base.AbstractDateTime.toString(AbstractDateTime.java:328)
	at org.joda.time.TestMutableDateTime_Basics.testToString_String(TestMutableDateTime_Basics.java:416)

testToString_DTFormatter(org.joda.time.TestMutableDateTime_Basics)  Time elapsed: 0.001 sec  <<< ERROR!
java.lang.StringIndexOutOfBoundsException: String index out of range: 7
	at java.lang.String.charAt(String.java:658)
	at org.joda.time.format.DateTimeFormat.parseToken(DateTimeFormat.java:130)
	at org.joda.time.format.DateTimeFormat.parsePatternTo(DateTimeFormat.java:54)
	at org.joda.time.format.DateTimeFormat.createFormatterForPattern(DateTimeFormat.java:155)
	at org.joda.time.format.DateTimeFormat.forPattern(DateTimeFormat.java:30)
	at org.joda.time.TestMutableDateTime_Basics.testToString_DTFormatter(TestMutableDateTime_Basics.java:431)

testToString_String_String(org.joda.time.TestMutableDateTime_Basics)  Time elapsed: 0 sec  <<< ERROR!
java.lang.StringIndexOutOfBoundsException: String index out of range: 7
	at java.lang.String.charAt(String.java:658)
	at org.joda.time.format.DateTimeFormat.parseToken(DateTimeFormat.java:130)
	at org.joda.time.format.DateTimeFormat.parsePatternTo(DateTimeFormat.java:54)
	at org.joda.time.format.DateTimeFormat.createFormatterForPattern(DateTimeFormat.java:155)
	at org.joda.time.format.DateTimeFormat.forPattern(DateTimeFormat.java:30)
	at org.joda.time.base.AbstractDateTime.toString(AbstractDateTime.java:343)
	at org.joda.time.TestMutableDateTime_Basics.testToString_String_String(TestMutableDateTime_Basics.java:422)

testParse_formatter(org.joda.time.TestDateMidnight_Constructors)  Time elapsed: 0.001 sec  <<< ERROR!
java.lang.StringIndexOutOfBoundsException: String index out of range: 11
	at java.lang.String.charAt(String.java:658)
	at org.joda.time.format.DateTimeFormat.parseToken(DateTimeFormat.java:130)
	at org.joda.time.format.DateTimeFormat.parsePatternTo(DateTimeFormat.java:54)
	at org.joda.time.format.DateTimeFormat.createFormatterForPattern(DateTimeFormat.java:155)
	at org.joda.time.format.DateTimeFormat.forPattern(DateTimeFormat.java:30)
	at org.joda.time.TestDateMidnight_Constructors.testParse_formatter(TestDateMidnight_Constructors.java:179)

testToString_String(org.joda.time.TestDateMidnight_Basics)  Time elapsed: 0.001 sec  <<< ERROR!
java.lang.StringIndexOutOfBoundsException: String index out of range: 7
	at java.lang.String.charAt(String.java:658)
	at org.joda.time.format.DateTimeFormat.parseToken(DateTimeFormat.java:130)
	at org.joda.time.format.DateTimeFormat.parsePatternTo(DateTimeFormat.java:54)
	at org.joda.time.format.DateTimeFormat.createFormatterForPattern(DateTimeFormat.java:155)
	at org.joda.time.format.DateTimeFormat.forPattern(DateTimeFormat.java:30)
	at org.joda.time.base.AbstractDateTime.toString(AbstractDateTime.java:328)
	at org.joda.time.TestDateMidnight_Basics.testToString_String(TestDateMidnight_Basics.java:450)

testToString_DTFormatter(org.joda.time.TestDateMidnight_Basics)  Time elapsed: 0.001 sec  <<< ERROR!
java.lang.StringIndexOutOfBoundsException: String index out of range: 7
	at java.lang.String.charAt(String.java:658)
	at org.joda.time.format.DateTimeFormat.parseToken(DateTimeFormat.java:130)
	at org.joda.time.format.DateTimeFormat.parsePatternTo(DateTimeFormat.java:54)
	at org.joda.time.format.DateTimeFormat.createFormatterForPattern(DateTimeFormat.java:155)
	at org.joda.time.format.DateTimeFormat.forPattern(DateTimeFormat.java:30)
	at org.joda.time.TestDateMidnight_Basics.testToString_DTFormatter(TestDateMidnight_Basics.java:465)

testToString_String_String(org.joda.time.TestDateMidnight_Basics)  Time elapsed: 0 sec  <<< ERROR!
java.lang.StringIndexOutOfBoundsException: String index out of range: 7
	at java.lang.String.charAt(String.java:658)
	at org.joda.time.format.DateTimeFormat.parseToken(DateTimeFormat.java:130)
	at org.joda.time.format.DateTimeFormat.parsePatternTo(DateTimeFormat.java:54)
	at org.joda.time.format.DateTimeFormat.createFormatterForPattern(DateTimeFormat.java:155)
	at org.joda.time.format.DateTimeFormat.forPattern(DateTimeFormat.java:30)
	at org.joda.time.base.AbstractDateTime.toString(AbstractDateTime.java:343)
	at org.joda.time.TestDateMidnight_Basics.testToString_String_String(TestDateMidnight_Basics.java:456)

testParse_formatter(org.joda.time.TestLocalDateTime_Constructors)  Time elapsed: 0.001 sec  <<< ERROR!
java.lang.StringIndexOutOfBoundsException: String index out of range: 14
	at java.lang.String.charAt(String.java:658)
	at org.joda.time.format.DateTimeFormat.parseToken(DateTimeFormat.java:130)
	at org.joda.time.format.DateTimeFormat.parsePatternTo(DateTimeFormat.java:54)
	at org.joda.time.format.DateTimeFormat.createFormatterForPattern(DateTimeFormat.java:155)
	at org.joda.time.format.DateTimeFormat.forPattern(DateTimeFormat.java:30)
	at org.joda.time.TestLocalDateTime_Constructors.testParse_formatter(TestLocalDateTime_Constructors.java:100)

testToString_String(org.joda.time.TestLocalDateTime_Basics)  Time elapsed: 0.001 sec  <<< ERROR!
java.lang.StringIndexOutOfBoundsException: String index out of range: 7
	at java.lang.String.charAt(String.java:658)
	at org.joda.time.format.DateTimeFormat.parseToken(DateTimeFormat.java:130)
	at org.joda.time.format.DateTimeFormat.parsePatternTo(DateTimeFormat.java:54)
	at org.joda.time.format.DateTimeFormat.createFormatterForPattern(DateTimeFormat.java:155)
	at org.joda.time.format.DateTimeFormat.forPattern(DateTimeFormat.java:30)
	at org.joda.time.LocalDateTime.toString(LocalDateTime.java:2100)
	at org.joda.time.TestLocalDateTime_Basics.testToString_String(TestLocalDateTime_Basics.java:1078)

testToString_String_Locale(org.joda.time.TestLocalDateTime_Basics)  Time elapsed: 0 sec  <<< ERROR!
java.lang.StringIndexOutOfBoundsException: String index out of range: 7
	at java.lang.String.charAt(String.java:658)
	at org.joda.time.format.DateTimeFormat.parseToken(DateTimeFormat.java:130)
	at org.joda.time.format.DateTimeFormat.parsePatternTo(DateTimeFormat.java:54)
	at org.joda.time.format.DateTimeFormat.createFormatterForPattern(DateTimeFormat.java:155)
	at org.joda.time.format.DateTimeFormat.forPattern(DateTimeFormat.java:30)
	at org.joda.time.LocalDateTime.toString(LocalDateTime.java:2114)
	at org.joda.time.TestLocalDateTime_Basics.testToString_String_Locale(TestLocalDateTime_Basics.java:1085)

testToString_DTFormatter(org.joda.time.TestLocalDateTime_Basics)  Time elapsed: 0.001 sec  <<< ERROR!
java.lang.StringIndexOutOfBoundsException: String index out of range: 7
	at java.lang.String.charAt(String.java:658)
	at org.joda.time.format.DateTimeFormat.parseToken(DateTimeFormat.java:130)
	at org.joda.time.format.DateTimeFormat.parsePatternTo(DateTimeFormat.java:54)
	at org.joda.time.format.DateTimeFormat.createFormatterForPattern(DateTimeFormat.java:155)
	at org.joda.time.format.DateTimeFormat.forPattern(DateTimeFormat.java:30)
	at org.joda.time.TestLocalDateTime_Basics.testToString_DTFormatter(TestLocalDateTime_Basics.java:1095)

testToDateTime_Zone_dstGap(org.joda.time.TestLocalDateTime_Basics)  Time elapsed: 0.001 sec  <<< ERROR!
java.lang.StringIndexOutOfBoundsException: String index out of range: 25
	at java.lang.String.charAt(String.java:658)
	at org.joda.time.format.DateTimeFormat.parseToken(DateTimeFormat.java:130)
	at org.joda.time.format.DateTimeFormat.parsePatternTo(DateTimeFormat.java:54)
	at org.joda.time.format.DateTimeFormat.createFormatterForPattern(DateTimeFormat.java:155)
	at org.joda.time.format.DateTimeFormat.forPattern(DateTimeFormat.java:30)
	at org.joda.time.IllegalInstantException.createMessage(IllegalInstantException.java:67)
	at org.joda.time.IllegalInstantException.<init>(IllegalInstantException.java:63)
	at org.joda.time.chrono.ZonedChronology.localToUTC(ZonedChronology.java:143)
	at org.joda.time.chrono.ZonedChronology.getDateTimeMillis(ZonedChronology.java:118)
	at org.joda.time.chrono.AssembledChronology.getDateTimeMillis(AssembledChronology.java:133)
	at org.joda.time.base.BaseDateTime.<init>(BaseDateTime.java:258)
	at org.joda.time.DateTime.<init>(DateTime.java:532)
	at org.joda.time.LocalDateTime.toDateTime(LocalDateTime.java:750)
	at org.joda.time.TestLocalDateTime_Basics.testToDateTime_Zone_dstGap(TestLocalDateTime_Basics.java:797)

testParse_formatter(org.joda.time.TestLocalDate_Constructors)  Time elapsed: 0 sec  <<< ERROR!
java.lang.StringIndexOutOfBoundsException: String index out of range: 11
	at java.lang.String.charAt(String.java:658)
	at org.joda.time.format.DateTimeFormat.parseToken(DateTimeFormat.java:130)
	at org.joda.time.format.DateTimeFormat.parsePatternTo(DateTimeFormat.java:54)
	at org.joda.time.format.DateTimeFormat.createFormatterForPattern(DateTimeFormat.java:155)
	at org.joda.time.format.DateTimeFormat.forPattern(DateTimeFormat.java:30)
	at org.joda.time.TestLocalDate_Constructors.testParse_formatter(TestLocalDate_Constructors.java:92)

testToString_String(org.joda.time.TestLocalDate_Basics)  Time elapsed: 0 sec  <<< ERROR!
java.lang.StringIndexOutOfBoundsException: String index out of range: 7
	at java.lang.String.charAt(String.java:658)
	at org.joda.time.format.DateTimeFormat.parseToken(DateTimeFormat.java:130)
	at org.joda.time.format.DateTimeFormat.parsePatternTo(DateTimeFormat.java:54)
	at org.joda.time.format.DateTimeFormat.createFormatterForPattern(DateTimeFormat.java:155)
	at org.joda.time.format.DateTimeFormat.forPattern(DateTimeFormat.java:30)
	at org.joda.time.LocalDate.toString(LocalDate.java:1845)
	at org.joda.time.TestLocalDate_Basics.testToString_String(TestLocalDate_Basics.java:1132)

testToString_String_Locale(org.joda.time.TestLocalDate_Basics)  Time elapsed: 0 sec  <<< ERROR!
java.lang.StringIndexOutOfBoundsException: String index out of range: 7
	at java.lang.String.charAt(String.java:658)
	at org.joda.time.format.DateTimeFormat.parseToken(DateTimeFormat.java:130)
	at org.joda.time.format.DateTimeFormat.parsePatternTo(DateTimeFormat.java:54)
	at org.joda.time.format.DateTimeFormat.createFormatterForPattern(DateTimeFormat.java:155)
	at org.joda.time.format.DateTimeFormat.forPattern(DateTimeFormat.java:30)
	at org.joda.time.LocalDate.toString(LocalDate.java:1859)
	at org.joda.time.TestLocalDate_Basics.testToString_String_Locale(TestLocalDate_Basics.java:1139)

testToString_DTFormatter(org.joda.time.TestLocalDate_Basics)  Time elapsed: 0.001 sec  <<< ERROR!
java.lang.StringIndexOutOfBoundsException: String index out of range: 7
	at java.lang.String.charAt(String.java:658)
	at org.joda.time.format.DateTimeFormat.parseToken(DateTimeFormat.java:130)
	at org.joda.time.format.DateTimeFormat.parsePatternTo(DateTimeFormat.java:54)
	at org.joda.time.format.DateTimeFormat.createFormatterForPattern(DateTimeFormat.java:155)
	at org.joda.time.format.DateTimeFormat.forPattern(DateTimeFormat.java:30)
	at org.joda.time.TestLocalDate_Basics.testToString_DTFormatter(TestLocalDate_Basics.java:1149)

testToDateTime_LocalTime_Zone_dstGap(org.joda.time.TestLocalDate_Basics)  Time elapsed: 0.001 sec  <<< ERROR!
java.lang.StringIndexOutOfBoundsException: String index out of range: 25
	at java.lang.String.charAt(String.java:658)
	at org.joda.time.format.DateTimeFormat.parseToken(DateTimeFormat.java:130)
	at org.joda.time.format.DateTimeFormat.parsePatternTo(DateTimeFormat.java:54)
	at org.joda.time.format.DateTimeFormat.createFormatterForPattern(DateTimeFormat.java:155)
	at org.joda.time.format.DateTimeFormat.forPattern(DateTimeFormat.java:30)
	at org.joda.time.IllegalInstantException.createMessage(IllegalInstantException.java:67)
	at org.joda.time.IllegalInstantException.<init>(IllegalInstantException.java:63)
	at org.joda.time.chrono.ZonedChronology.localToUTC(ZonedChronology.java:143)
	at org.joda.time.chrono.ZonedChronology.getDateTimeMillis(ZonedChronology.java:118)
	at org.joda.time.chrono.AssembledChronology.getDateTimeMillis(AssembledChronology.java:133)
	at org.joda.time.base.BaseDateTime.<init>(BaseDateTime.java:258)
	at org.joda.time.DateTime.<init>(DateTime.java:532)
	at org.joda.time.LocalDate.toDateTime(LocalDate.java:958)
	at org.joda.time.TestLocalDate_Basics.testToDateTime_LocalTime_Zone_dstGap(TestLocalDate_Basics.java:870)

testParse_formatter(org.joda.time.TestLocalTime_Constructors)  Time elapsed: 0.001 sec  <<< ERROR!
java.lang.StringIndexOutOfBoundsException: String index out of range: 5
	at java.lang.String.charAt(String.java:658)
	at org.joda.time.format.DateTimeFormat.parseToken(DateTimeFormat.java:130)
	at org.joda.time.format.DateTimeFormat.parsePatternTo(DateTimeFormat.java:54)
	at org.joda.time.format.DateTimeFormat.createFormatterForPattern(DateTimeFormat.java:155)
	at org.joda.time.format.DateTimeFormat.forPattern(DateTimeFormat.java:30)
	at org.joda.time.TestLocalTime_Constructors.testParse_formatter(TestLocalTime_Constructors.java:118)

testToString_String(org.joda.time.TestLocalTime_Basics)  Time elapsed: 0.001 sec  <<< ERROR!
java.lang.StringIndexOutOfBoundsException: String index out of range: 7
	at java.lang.String.charAt(String.java:658)
	at org.joda.time.format.DateTimeFormat.parseToken(DateTimeFormat.java:130)
	at org.joda.time.format.DateTimeFormat.parsePatternTo(DateTimeFormat.java:54)
	at org.joda.time.format.DateTimeFormat.createFormatterForPattern(DateTimeFormat.java:155)
	at org.joda.time.format.DateTimeFormat.forPattern(DateTimeFormat.java:30)
	at org.joda.time.LocalTime.toString(LocalTime.java:1312)
	at org.joda.time.TestLocalTime_Basics.testToString_String(TestLocalTime_Basics.java:792)

testToString_String_Locale(org.joda.time.TestLocalTime_Basics)  Time elapsed: 0 sec  <<< ERROR!
java.lang.StringIndexOutOfBoundsException: String index out of range: 3
	at java.lang.String.charAt(String.java:658)
	at org.joda.time.format.DateTimeFormat.parseToken(DateTimeFormat.java:130)
	at org.joda.time.format.DateTimeFormat.parsePatternTo(DateTimeFormat.java:54)
	at org.joda.time.format.DateTimeFormat.createFormatterForPattern(DateTimeFormat.java:155)
	at org.joda.time.format.DateTimeFormat.forPattern(DateTimeFormat.java:30)
	at org.joda.time.LocalTime.toString(LocalTime.java:1326)
	at org.joda.time.TestLocalTime_Basics.testToString_String_Locale(TestLocalTime_Basics.java:799)

testToString_DTFormatter(org.joda.time.TestLocalTime_Basics)  Time elapsed: 0.001 sec  <<< ERROR!
java.lang.StringIndexOutOfBoundsException: String index out of range: 7
	at java.lang.String.charAt(String.java:658)
	at org.joda.time.format.DateTimeFormat.parseToken(DateTimeFormat.java:130)
	at org.joda.time.format.DateTimeFormat.parsePatternTo(DateTimeFormat.java:54)
	at org.joda.time.format.DateTimeFormat.createFormatterForPattern(DateTimeFormat.java:155)
	at org.joda.time.format.DateTimeFormat.forPattern(DateTimeFormat.java:30)
	at org.joda.time.TestLocalTime_Basics.testToString_DTFormatter(TestLocalTime_Basics.java:808)

testFactory_monthsBetween_RPartial_MonthDay(org.joda.time.TestMonths)  Time elapsed: 0.001 sec  <<< ERROR!
java.lang.ExceptionInInitializerError
	at org.joda.time.TestMonths.testFactory_monthsBetween_RPartial_MonthDay(TestMonths.java:132)
Caused by: java.lang.StringIndexOutOfBoundsException: String index out of range: 7
	at java.lang.String.charAt(String.java:658)
	at org.joda.time.format.DateTimeFormat.parseToken(DateTimeFormat.java:130)
	at org.joda.time.format.DateTimeFormat.parsePatternTo(DateTimeFormat.java:54)
	at org.joda.time.format.DateTimeFormat.createFormatterForPattern(DateTimeFormat.java:155)
	at org.joda.time.format.DateTimeFormat.forPattern(DateTimeFormat.java:30)
	at org.joda.time.MonthDay.<clinit>(MonthDay.java:84)
	... 27 more

testFactory_daysBetween_RPartial_MonthDay(org.joda.time.TestDays)  Time elapsed: 0 sec  <<< ERROR!
java.lang.NoClassDefFoundError: Could not initialize class org.joda.time.MonthDay
	at org.joda.time.TestDays.testFactory_daysBetween_RPartial_MonthDay(TestDays.java:125)

testToString_String(org.joda.time.TestTimeOfDay_Basics)  Time elapsed: 0 sec  <<< ERROR!
java.lang.StringIndexOutOfBoundsException: String index out of range: 7
	at java.lang.String.charAt(String.java:658)
	at org.joda.time.format.DateTimeFormat.parseToken(DateTimeFormat.java:130)
	at org.joda.time.format.DateTimeFormat.parsePatternTo(DateTimeFormat.java:54)
	at org.joda.time.format.DateTimeFormat.createFormatterForPattern(DateTimeFormat.java:155)
	at org.joda.time.format.DateTimeFormat.forPattern(DateTimeFormat.java:30)
	at org.joda.time.base.BasePartial.toString(BasePartial.java:295)
	at org.joda.time.TestTimeOfDay_Basics.testToString_String(TestTimeOfDay_Basics.java:879)

testToString_String_Locale(org.joda.time.TestTimeOfDay_Basics)  Time elapsed: 0 sec  <<< ERROR!
java.lang.StringIndexOutOfBoundsException: String index out of range: 3
	at java.lang.String.charAt(String.java:658)
	at org.joda.time.format.DateTimeFormat.parseToken(DateTimeFormat.java:130)
	at org.joda.time.format.DateTimeFormat.parsePatternTo(DateTimeFormat.java:54)
	at org.joda.time.format.DateTimeFormat.createFormatterForPattern(DateTimeFormat.java:155)
	at org.joda.time.format.DateTimeFormat.forPattern(DateTimeFormat.java:30)
	at org.joda.time.base.BasePartial.toString(BasePartial.java:309)
	at org.joda.time.TestTimeOfDay_Basics.testToString_String_Locale(TestTimeOfDay_Basics.java:886)

testToString_DTFormatter(org.joda.time.TestTimeOfDay_Basics)  Time elapsed: 0 sec  <<< ERROR!
java.lang.StringIndexOutOfBoundsException: String index out of range: 7
	at java.lang.String.charAt(String.java:658)
	at org.joda.time.format.DateTimeFormat.parseToken(DateTimeFormat.java:130)
	at org.joda.time.format.DateTimeFormat.parsePatternTo(DateTimeFormat.java:54)
	at org.joda.time.format.DateTimeFormat.createFormatterForPattern(DateTimeFormat.java:155)
	at org.joda.time.format.DateTimeFormat.forPattern(DateTimeFormat.java:30)
	at org.joda.time.TestTimeOfDay_Basics.testToString_DTFormatter(TestTimeOfDay_Basics.java:895)

testToString_String(org.joda.time.TestYearMonthDay_Basics)  Time elapsed: 0 sec  <<< ERROR!
java.lang.StringIndexOutOfBoundsException: String index out of range: 7
	at java.lang.String.charAt(String.java:658)
	at org.joda.time.format.DateTimeFormat.parseToken(DateTimeFormat.java:130)
	at org.joda.time.format.DateTimeFormat.parsePatternTo(DateTimeFormat.java:54)
	at org.joda.time.format.DateTimeFormat.createFormatterForPattern(DateTimeFormat.java:155)
	at org.joda.time.format.DateTimeFormat.forPattern(DateTimeFormat.java:30)
	at org.joda.time.base.BasePartial.toString(BasePartial.java:295)
	at org.joda.time.TestYearMonthDay_Basics.testToString_String(TestYearMonthDay_Basics.java:805)

testToString_String_Locale(org.joda.time.TestYearMonthDay_Basics)  Time elapsed: 0.001 sec  <<< ERROR!
java.lang.StringIndexOutOfBoundsException: String index out of range: 7
	at java.lang.String.charAt(String.java:658)
	at org.joda.time.format.DateTimeFormat.parseToken(DateTimeFormat.java:130)
	at org.joda.time.format.DateTimeFormat.parsePatternTo(DateTimeFormat.java:54)
	at org.joda.time.format.DateTimeFormat.createFormatterForPattern(DateTimeFormat.java:155)
	at org.joda.time.format.DateTimeFormat.forPattern(DateTimeFormat.java:30)
	at org.joda.time.base.BasePartial.toString(BasePartial.java:309)
	at org.joda.time.TestYearMonthDay_Basics.testToString_String_Locale(TestYearMonthDay_Basics.java:812)

testToString_DTFormatter(org.joda.time.TestYearMonthDay_Basics)  Time elapsed: 0.001 sec  <<< ERROR!
java.lang.StringIndexOutOfBoundsException: String index out of range: 7
	at java.lang.String.charAt(String.java:658)
	at org.joda.time.format.DateTimeFormat.parseToken(DateTimeFormat.java:130)
	at org.joda.time.format.DateTimeFormat.parsePatternTo(DateTimeFormat.java:54)
	at org.joda.time.format.DateTimeFormat.createFormatterForPattern(DateTimeFormat.java:155)
	at org.joda.time.format.DateTimeFormat.forPattern(DateTimeFormat.java:30)
	at org.joda.time.TestYearMonthDay_Basics.testToString_DTFormatter(TestYearMonthDay_Basics.java:822)

testToString_String(org.joda.time.TestYearMonth_Basics)  Time elapsed: 0 sec  <<< ERROR!
java.lang.StringIndexOutOfBoundsException: String index out of range: 7
	at java.lang.String.charAt(String.java:658)
	at org.joda.time.format.DateTimeFormat.parseToken(DateTimeFormat.java:130)
	at org.joda.time.format.DateTimeFormat.parsePatternTo(DateTimeFormat.java:54)
	at org.joda.time.format.DateTimeFormat.createFormatterForPattern(DateTimeFormat.java:155)
	at org.joda.time.format.DateTimeFormat.forPattern(DateTimeFormat.java:30)
	at org.joda.time.YearMonth.toString(YearMonth.java:810)
	at org.joda.time.TestYearMonth_Basics.testToString_String(TestYearMonth_Basics.java:629)

testToString_String_Locale(org.joda.time.TestYearMonth_Basics)  Time elapsed: 0.001 sec  <<< ERROR!
java.lang.StringIndexOutOfBoundsException: String index out of range: 7
	at java.lang.String.charAt(String.java:658)
	at org.joda.time.format.DateTimeFormat.parseToken(DateTimeFormat.java:130)
	at org.joda.time.format.DateTimeFormat.parsePatternTo(DateTimeFormat.java:54)
	at org.joda.time.format.DateTimeFormat.createFormatterForPattern(DateTimeFormat.java:155)
	at org.joda.time.format.DateTimeFormat.forPattern(DateTimeFormat.java:30)
	at org.joda.time.YearMonth.toString(YearMonth.java:824)
	at org.joda.time.TestYearMonth_Basics.testToString_String_Locale(TestYearMonth_Basics.java:636)

testToString_DTFormatter(org.joda.time.TestYearMonth_Basics)  Time elapsed: 0 sec  <<< ERROR!
java.lang.StringIndexOutOfBoundsException: String index out of range: 7
	at java.lang.String.charAt(String.java:658)
	at org.joda.time.format.DateTimeFormat.parseToken(DateTimeFormat.java:130)
	at org.joda.time.format.DateTimeFormat.parsePatternTo(DateTimeFormat.java:54)
	at org.joda.time.format.DateTimeFormat.createFormatterForPattern(DateTimeFormat.java:155)
	at org.joda.time.format.DateTimeFormat.forPattern(DateTimeFormat.java:30)
	at org.joda.time.TestYearMonth_Basics.testToString_DTFormatter(TestYearMonth_Basics.java:646)

testParse_formatter(org.joda.time.TestYearMonth_Constructors)  Time elapsed: 0 sec  <<< ERROR!
java.lang.StringIndexOutOfBoundsException: String index out of range: 8
	at java.lang.String.charAt(String.java:658)
	at org.joda.time.format.DateTimeFormat.parseToken(DateTimeFormat.java:130)
	at org.joda.time.format.DateTimeFormat.parsePatternTo(DateTimeFormat.java:54)
	at org.joda.time.format.DateTimeFormat.createFormatterForPattern(DateTimeFormat.java:155)
	at org.joda.time.format.DateTimeFormat.forPattern(DateTimeFormat.java:30)
	at org.joda.time.TestYearMonth_Constructors.testParse_formatter(TestYearMonth_Constructors.java:89)

testToString(org.joda.time.TestMonthDay_Basics)  Time elapsed: 0 sec  <<< ERROR!
java.lang.NoClassDefFoundError: Could not initialize class org.joda.time.MonthDay
	at org.joda.time.TestMonthDay_Basics.testToString(TestMonthDay_Basics.java:788)

testToLocalDate(org.joda.time.TestMonthDay_Basics)  Time elapsed: 0.001 sec  <<< ERROR!
java.lang.NoClassDefFoundError: Could not initialize class org.joda.time.MonthDay
	at org.joda.time.TestMonthDay_Basics.testToLocalDate(TestMonthDay_Basics.java:700)

testPlus_RP(org.joda.time.TestMonthDay_Basics)  Time elapsed: 0 sec  <<< ERROR!
java.lang.NoClassDefFoundError: Could not initialize class org.joda.time.MonthDay
	at org.joda.time.TestMonthDay_Basics.testPlus_RP(TestMonthDay_Basics.java:435)

testWithers(org.joda.time.TestMonthDay_Basics)  Time elapsed: 0.001 sec  <<< ERROR!
java.lang.NoClassDefFoundError: Could not initialize class org.joda.time.MonthDay
	at org.joda.time.TestMonthDay_Basics.testWithers(TestMonthDay_Basics.java:737)

testToString_String(org.joda.time.TestMonthDay_Basics)  Time elapsed: 0 sec  <<< ERROR!
java.lang.NoClassDefFoundError: Could not initialize class org.joda.time.MonthDay
	at org.joda.time.TestMonthDay_Basics.testToString_String(TestMonthDay_Basics.java:794)

testToString_String_Locale(org.joda.time.TestMonthDay_Basics)  Time elapsed: 0.001 sec  <<< ERROR!
java.lang.NoClassDefFoundError: Could not initialize class org.joda.time.MonthDay
	at org.joda.time.TestMonthDay_Basics.testToString_String_Locale(TestMonthDay_Basics.java:801)

testToString_DTFormatter(org.joda.time.TestMonthDay_Basics)  Time elapsed: 0 sec  <<< ERROR!
java.lang.NoClassDefFoundError: Could not initialize class org.joda.time.MonthDay
	at org.joda.time.TestMonthDay_Basics.testToString_DTFormatter(TestMonthDay_Basics.java:811)

testEqualsHashCode(org.joda.time.TestMonthDay_Basics)  Time elapsed: 0 sec  <<< ERROR!
java.lang.NoClassDefFoundError: Could not initialize class org.joda.time.MonthDay
	at org.joda.time.TestMonthDay_Basics.testEqualsHashCode(TestMonthDay_Basics.java:178)

testCompareTo(org.joda.time.TestMonthDay_Basics)  Time elapsed: 0.001 sec  <<< ERROR!
java.lang.NoClassDefFoundError: Could not initialize class org.joda.time.MonthDay
	at org.joda.time.TestMonthDay_Basics.testCompareTo(TestMonthDay_Basics.java:224)

testSerialization(org.joda.time.TestMonthDay_Basics)  Time elapsed: 0 sec  <<< ERROR!
java.lang.NoClassDefFoundError: Could not initialize class org.joda.time.MonthDay
	at org.joda.time.TestMonthDay_Basics.testSerialization(TestMonthDay_Basics.java:767)

testPlusMonths_int(org.joda.time.TestMonthDay_Basics)  Time elapsed: 0.001 sec  <<< ERROR!
java.lang.NoClassDefFoundError: Could not initialize class org.joda.time.MonthDay
	at org.joda.time.TestMonthDay_Basics.testPlusMonths_int(TestMonthDay_Basics.java:445)

testPlusDays_int(org.joda.time.TestMonthDay_Basics)  Time elapsed: 0 sec  <<< ERROR!
java.lang.NoClassDefFoundError: Could not initialize class org.joda.time.MonthDay
	at org.joda.time.TestMonthDay_Basics.testPlusDays_int(TestMonthDay_Basics.java:501)

testMinus_RP(org.joda.time.TestMonthDay_Basics)  Time elapsed: 0.001 sec  <<< ERROR!
java.lang.NoClassDefFoundError: Could not initialize class org.joda.time.MonthDay
	at org.joda.time.TestMonthDay_Basics.testMinus_RP(TestMonthDay_Basics.java:571)

testMinusMonths_int(org.joda.time.TestMonthDay_Basics)  Time elapsed: 0 sec  <<< ERROR!
java.lang.NoClassDefFoundError: Could not initialize class org.joda.time.MonthDay
	at org.joda.time.TestMonthDay_Basics.testMinusMonths_int(TestMonthDay_Basics.java:581)

testMinusDays_int(org.joda.time.TestMonthDay_Basics)  Time elapsed: 0.001 sec  <<< ERROR!
java.lang.NoClassDefFoundError: Could not initialize class org.joda.time.MonthDay
	at org.joda.time.TestMonthDay_Basics.testMinusDays_int(TestMonthDay_Basics.java:637)

testProperty(org.joda.time.TestMonthDay_Basics)  Time elapsed: 0 sec  <<< ERROR!
java.lang.NoClassDefFoundError: Could not initialize class org.joda.time.MonthDay
	at org.joda.time.TestMonthDay_Basics.testProperty(TestMonthDay_Basics.java:752)

testToDateTime_RI(org.joda.time.TestMonthDay_Basics)  Time elapsed: 0.001 sec  <<< ERROR!
java.lang.NoClassDefFoundError: Could not initialize class org.joda.time.MonthDay
	at org.joda.time.TestMonthDay_Basics.testToDateTime_RI(TestMonthDay_Basics.java:711)

testToDateTime_nullRI(org.joda.time.TestMonthDay_Basics)  Time elapsed: 0 sec  <<< ERROR!
java.lang.NoClassDefFoundError: Could not initialize class org.joda.time.MonthDay
	at org.joda.time.TestMonthDay_Basics.testToDateTime_nullRI(TestMonthDay_Basics.java:723)

testIsSupported(org.joda.time.TestMonthDay_Basics)  Time elapsed: 0 sec  <<< ERROR!
java.lang.NoClassDefFoundError: Could not initialize class org.joda.time.MonthDay
	at org.joda.time.TestMonthDay_Basics.testIsSupported(TestMonthDay_Basics.java:170)

testGet(org.joda.time.TestMonthDay_Basics)  Time elapsed: 0.001 sec  <<< ERROR!
java.lang.NoClassDefFoundError: Could not initialize class org.joda.time.MonthDay
	at org.joda.time.TestMonthDay_Basics.testGet(TestMonthDay_Basics.java:87)

testSize(org.joda.time.TestMonthDay_Basics)  Time elapsed: 0 sec  <<< ERROR!
java.lang.NoClassDefFoundError: Could not initialize class org.joda.time.MonthDay
	at org.joda.time.TestMonthDay_Basics.testSize(TestMonthDay_Basics.java:101)

testGetFieldTypes(org.joda.time.TestMonthDay_Basics)  Time elapsed: 0.001 sec  <<< ERROR!
java.lang.NoClassDefFoundError: Could not initialize class org.joda.time.MonthDay
	at org.joda.time.TestMonthDay_Basics.testGetFieldTypes(TestMonthDay_Basics.java:119)

testGetFields(org.joda.time.TestMonthDay_Basics)  Time elapsed: 0 sec  <<< ERROR!
java.lang.NoClassDefFoundError: Could not initialize class org.joda.time.MonthDay
	at org.joda.time.TestMonthDay_Basics.testGetFields(TestMonthDay_Basics.java:140)

testGetValues(org.joda.time.TestMonthDay_Basics)  Time elapsed: 0.001 sec  <<< ERROR!
java.lang.NoClassDefFoundError: Could not initialize class org.joda.time.MonthDay
	at org.joda.time.TestMonthDay_Basics.testGetValues(TestMonthDay_Basics.java:161)

testWithFieldAdded_nullField_zero(org.joda.time.TestMonthDay_Basics)  Time elapsed: 0 sec  <<< ERROR!
java.lang.NoClassDefFoundError: Could not initialize class org.joda.time.MonthDay
	at org.joda.time.TestMonthDay_Basics.testWithFieldAdded_nullField_zero(TestMonthDay_Basics.java:404)

testWithFieldAdded_nullField_nonZero(org.joda.time.TestMonthDay_Basics)  Time elapsed: 0 sec  <<< ERROR!
java.lang.NoClassDefFoundError: Could not initialize class org.joda.time.MonthDay
	at org.joda.time.TestMonthDay_Basics.testWithFieldAdded_nullField_nonZero(TestMonthDay_Basics.java:412)

testWithFieldAdded_zero(org.joda.time.TestMonthDay_Basics)  Time elapsed: 0 sec  <<< ERROR!
java.lang.NoClassDefFoundError: Could not initialize class org.joda.time.MonthDay
	at org.joda.time.TestMonthDay_Basics.testWithFieldAdded_zero(TestMonthDay_Basics.java:420)

testWithFieldAdded_unknownField(org.joda.time.TestMonthDay_Basics)  Time elapsed: 0 sec  <<< ERROR!
java.lang.NoClassDefFoundError: Could not initialize class org.joda.time.MonthDay
	at org.joda.time.TestMonthDay_Basics.testWithFieldAdded_unknownField(TestMonthDay_Basics.java:426)

testIsEqual_MD(org.joda.time.TestMonthDay_Basics)  Time elapsed: 0.001 sec  <<< ERROR!
java.lang.NoClassDefFoundError: Could not initialize class org.joda.time.MonthDay
	at org.joda.time.TestMonthDay_Basics.testIsEqual_MD(TestMonthDay_Basics.java:267)

testWithField(org.joda.time.TestMonthDay_Basics)  Time elapsed: 0 sec  <<< ERROR!
java.lang.NoClassDefFoundError: Could not initialize class org.joda.time.MonthDay
	at org.joda.time.TestMonthDay_Basics.testWithField(TestMonthDay_Basics.java:364)

testWithField_nullField(org.joda.time.TestMonthDay_Basics)  Time elapsed: 0.001 sec  <<< ERROR!
java.lang.NoClassDefFoundError: Could not initialize class org.joda.time.MonthDay
	at org.joda.time.TestMonthDay_Basics.testWithField_nullField(TestMonthDay_Basics.java:372)

testWithField_unknownField(org.joda.time.TestMonthDay_Basics)  Time elapsed: 0 sec  <<< ERROR!
java.lang.NoClassDefFoundError: Could not initialize class org.joda.time.MonthDay
	at org.joda.time.TestMonthDay_Basics.testWithField_unknownField(TestMonthDay_Basics.java:380)

testWithField_same(org.joda.time.TestMonthDay_Basics)  Time elapsed: 0.001 sec  <<< ERROR!
java.lang.NoClassDefFoundError: Could not initialize class org.joda.time.MonthDay
	at org.joda.time.TestMonthDay_Basics.testWithField_same(TestMonthDay_Basics.java:388)

testWithFieldAdded(org.joda.time.TestMonthDay_Basics)  Time elapsed: 0 sec  <<< ERROR!
java.lang.NoClassDefFoundError: Could not initialize class org.joda.time.MonthDay
	at org.joda.time.TestMonthDay_Basics.testWithFieldAdded(TestMonthDay_Basics.java:396)

testIsBefore_MD(org.joda.time.TestMonthDay_Basics)  Time elapsed: 0.001 sec  <<< ERROR!
java.lang.NoClassDefFoundError: Could not initialize class org.joda.time.MonthDay
	at org.joda.time.TestMonthDay_Basics.testIsBefore_MD(TestMonthDay_Basics.java:291)

testIsAfter_MD(org.joda.time.TestMonthDay_Basics)  Time elapsed: 0 sec  <<< ERROR!
java.lang.NoClassDefFoundError: Could not initialize class org.joda.time.MonthDay
	at org.joda.time.TestMonthDay_Basics.testIsAfter_MD(TestMonthDay_Basics.java:315)

testPlusMonths_int_fromLeap(org.joda.time.TestMonthDay_Basics)  Time elapsed: 0 sec  <<< ERROR!
java.lang.NoClassDefFoundError: Could not initialize class org.joda.time.MonthDay
	at org.joda.time.TestMonthDay_Basics.testPlusMonths_int_fromLeap(TestMonthDay_Basics.java:452)

testPlusMonths_int_negativeFromLeap(org.joda.time.TestMonthDay_Basics)  Time elapsed: 0.001 sec  <<< ERROR!
java.lang.NoClassDefFoundError: Could not initialize class org.joda.time.MonthDay
	at org.joda.time.TestMonthDay_Basics.testPlusMonths_int_negativeFromLeap(TestMonthDay_Basics.java:459)

testPlusMonths_int_endOfMonthAdjust(org.joda.time.TestMonthDay_Basics)  Time elapsed: 0 sec  <<< ERROR!
java.lang.NoClassDefFoundError: Could not initialize class org.joda.time.MonthDay
	at org.joda.time.TestMonthDay_Basics.testPlusMonths_int_endOfMonthAdjust(TestMonthDay_Basics.java:466)

testPlusMonths_int_negativeEndOfMonthAdjust(org.joda.time.TestMonthDay_Basics)  Time elapsed: 0.001 sec  <<< ERROR!
java.lang.NoClassDefFoundError: Could not initialize class org.joda.time.MonthDay
	at org.joda.time.TestMonthDay_Basics.testPlusMonths_int_negativeEndOfMonthAdjust(TestMonthDay_Basics.java:473)

testPlusMonths_int_same(org.joda.time.TestMonthDay_Basics)  Time elapsed: 0 sec  <<< ERROR!
java.lang.NoClassDefFoundError: Could not initialize class org.joda.time.MonthDay
	at org.joda.time.TestMonthDay_Basics.testPlusMonths_int_same(TestMonthDay_Basics.java:480)

testPlusMonths_int_wrap(org.joda.time.TestMonthDay_Basics)  Time elapsed: 0.001 sec  <<< ERROR!
java.lang.NoClassDefFoundError: Could not initialize class org.joda.time.MonthDay
	at org.joda.time.TestMonthDay_Basics.testPlusMonths_int_wrap(TestMonthDay_Basics.java:486)

testPlusMonths_int_adjust(org.joda.time.TestMonthDay_Basics)  Time elapsed: 0 sec  <<< ERROR!
java.lang.NoClassDefFoundError: Could not initialize class org.joda.time.MonthDay
	at org.joda.time.TestMonthDay_Basics.testPlusMonths_int_adjust(TestMonthDay_Basics.java:493)

testPlusDays_int_wrapMonth(org.joda.time.TestMonthDay_Basics)  Time elapsed: 0.001 sec  <<< ERROR!
java.lang.NoClassDefFoundError: Could not initialize class org.joda.time.MonthDay
	at org.joda.time.TestMonthDay_Basics.testPlusDays_int_wrapMonth(TestMonthDay_Basics.java:508)

testPlusDays_int_wrapMonthTwice(org.joda.time.TestMonthDay_Basics)  Time elapsed: 0 sec  <<< ERROR!
java.lang.NoClassDefFoundError: Could not initialize class org.joda.time.MonthDay
	at org.joda.time.TestMonthDay_Basics.testPlusDays_int_wrapMonthTwice(TestMonthDay_Basics.java:515)

testPlusDays_int_wrapMonthIntoNextYear(org.joda.time.TestMonthDay_Basics)  Time elapsed: 0.001 sec  <<< ERROR!
java.lang.NoClassDefFoundError: Could not initialize class org.joda.time.MonthDay
	at org.joda.time.TestMonthDay_Basics.testPlusDays_int_wrapMonthIntoNextYear(TestMonthDay_Basics.java:522)

testPlusDays_int_wrapMonthTwiceIntoNextYear(org.joda.time.TestMonthDay_Basics)  Time elapsed: 0 sec  <<< ERROR!
java.lang.NoClassDefFoundError: Could not initialize class org.joda.time.MonthDay
	at org.joda.time.TestMonthDay_Basics.testPlusDays_int_wrapMonthTwiceIntoNextYear(TestMonthDay_Basics.java:529)

testPlusDays_int_wrap50(org.joda.time.TestMonthDay_Basics)  Time elapsed: 0.001 sec  <<< ERROR!
java.lang.NoClassDefFoundError: Could not initialize class org.joda.time.MonthDay
	at org.joda.time.TestMonthDay_Basics.testPlusDays_int_wrap50(TestMonthDay_Basics.java:536)

testPlusDays_int_toLeap(org.joda.time.TestMonthDay_Basics)  Time elapsed: 0 sec  <<< ERROR!
java.lang.NoClassDefFoundError: Could not initialize class org.joda.time.MonthDay
	at org.joda.time.TestMonthDay_Basics.testPlusDays_int_toLeap(TestMonthDay_Basics.java:543)

testPlusDays_int_fromLeap(org.joda.time.TestMonthDay_Basics)  Time elapsed: 0.001 sec  <<< ERROR!
java.lang.NoClassDefFoundError: Could not initialize class org.joda.time.MonthDay
	at org.joda.time.TestMonthDay_Basics.testPlusDays_int_fromLeap(TestMonthDay_Basics.java:550)

testPlusDays_int_negativeFromLeap(org.joda.time.TestMonthDay_Basics)  Time elapsed: 0 sec  <<< ERROR!
java.lang.NoClassDefFoundError: Could not initialize class org.joda.time.MonthDay
	at org.joda.time.TestMonthDay_Basics.testPlusDays_int_negativeFromLeap(TestMonthDay_Basics.java:557)

testPlusDays_same(org.joda.time.TestMonthDay_Basics)  Time elapsed: 0.001 sec  <<< ERROR!
java.lang.NoClassDefFoundError: Could not initialize class org.joda.time.MonthDay
	at org.joda.time.TestMonthDay_Basics.testPlusDays_same(TestMonthDay_Basics.java:564)

testMinusMonths_int_fromLeap(org.joda.time.TestMonthDay_Basics)  Time elapsed: 0 sec  <<< ERROR!
java.lang.NoClassDefFoundError: Could not initialize class org.joda.time.MonthDay
	at org.joda.time.TestMonthDay_Basics.testMinusMonths_int_fromLeap(TestMonthDay_Basics.java:588)

testMinusMonths_int_negativeFromLeap(org.joda.time.TestMonthDay_Basics)  Time elapsed: 0 sec  <<< ERROR!
java.lang.NoClassDefFoundError: Could not initialize class org.joda.time.MonthDay
	at org.joda.time.TestMonthDay_Basics.testMinusMonths_int_negativeFromLeap(TestMonthDay_Basics.java:595)

testMinusMonths_int_endOfMonthAdjust(org.joda.time.TestMonthDay_Basics)  Time elapsed: 0.001 sec  <<< ERROR!
java.lang.NoClassDefFoundError: Could not initialize class org.joda.time.MonthDay
	at org.joda.time.TestMonthDay_Basics.testMinusMonths_int_endOfMonthAdjust(TestMonthDay_Basics.java:602)

testMinusMonths_int_same(org.joda.time.TestMonthDay_Basics)  Time elapsed: 0 sec  <<< ERROR!
java.lang.NoClassDefFoundError: Could not initialize class org.joda.time.MonthDay
	at org.joda.time.TestMonthDay_Basics.testMinusMonths_int_same(TestMonthDay_Basics.java:616)

testMinusMonths_int_negativeEndOfMonthAdjust(org.joda.time.TestMonthDay_Basics)  Time elapsed: 0.001 sec  <<< ERROR!
java.lang.NoClassDefFoundError: Could not initialize class org.joda.time.MonthDay
	at org.joda.time.TestMonthDay_Basics.testMinusMonths_int_negativeEndOfMonthAdjust(TestMonthDay_Basics.java:609)

testMinusMonths_int_wrap(org.joda.time.TestMonthDay_Basics)  Time elapsed: 0 sec  <<< ERROR!
java.lang.NoClassDefFoundError: Could not initialize class org.joda.time.MonthDay
	at org.joda.time.TestMonthDay_Basics.testMinusMonths_int_wrap(TestMonthDay_Basics.java:622)

testMinusMonths_int_adjust(org.joda.time.TestMonthDay_Basics)  Time elapsed: 0.001 sec  <<< ERROR!
java.lang.NoClassDefFoundError: Could not initialize class org.joda.time.MonthDay
	at org.joda.time.TestMonthDay_Basics.testMinusMonths_int_adjust(TestMonthDay_Basics.java:629)

testMinusDays_int_wrapMonth(org.joda.time.TestMonthDay_Basics)  Time elapsed: 0 sec  <<< ERROR!
java.lang.NoClassDefFoundError: Could not initialize class org.joda.time.MonthDay
	at org.joda.time.TestMonthDay_Basics.testMinusDays_int_wrapMonth(TestMonthDay_Basics.java:644)

testMinusDays_int_wrapMonthTwice(org.joda.time.TestMonthDay_Basics)  Time elapsed: 0.001 sec  <<< ERROR!
java.lang.NoClassDefFoundError: Could not initialize class org.joda.time.MonthDay
	at org.joda.time.TestMonthDay_Basics.testMinusDays_int_wrapMonthTwice(TestMonthDay_Basics.java:651)

testMinusDays_int_wrapMonthIntoLastYear(org.joda.time.TestMonthDay_Basics)  Time elapsed: 0 sec  <<< ERROR!
java.lang.NoClassDefFoundError: Could not initialize class org.joda.time.MonthDay
	at org.joda.time.TestMonthDay_Basics.testMinusDays_int_wrapMonthIntoLastYear(TestMonthDay_Basics.java:658)

testMinusDays_int_wrapMonthTwiceIntoLastYear(org.joda.time.TestMonthDay_Basics)  Time elapsed: 0.001 sec  <<< ERROR!
java.lang.NoClassDefFoundError: Could not initialize class org.joda.time.MonthDay
	at org.joda.time.TestMonthDay_Basics.testMinusDays_int_wrapMonthTwiceIntoLastYear(TestMonthDay_Basics.java:665)

testMinusDays_int_toLeap(org.joda.time.TestMonthDay_Basics)  Time elapsed: 0 sec  <<< ERROR!
java.lang.NoClassDefFoundError: Could not initialize class org.joda.time.MonthDay
	at org.joda.time.TestMonthDay_Basics.testMinusDays_int_toLeap(TestMonthDay_Basics.java:672)

testMinusDays_int_fromLeap(org.joda.time.TestMonthDay_Basics)  Time elapsed: 0 sec  <<< ERROR!
java.lang.NoClassDefFoundError: Could not initialize class org.joda.time.MonthDay
	at org.joda.time.TestMonthDay_Basics.testMinusDays_int_fromLeap(TestMonthDay_Basics.java:679)

testMinusDays_int_negativeFromLeap(org.joda.time.TestMonthDay_Basics)  Time elapsed: 0.001 sec  <<< ERROR!
java.lang.NoClassDefFoundError: Could not initialize class org.joda.time.MonthDay
	at org.joda.time.TestMonthDay_Basics.testMinusDays_int_negativeFromLeap(TestMonthDay_Basics.java:686)

testMinusDays_same(org.joda.time.TestMonthDay_Basics)  Time elapsed: 0 sec  <<< ERROR!
java.lang.NoClassDefFoundError: Could not initialize class org.joda.time.MonthDay
	at org.joda.time.TestMonthDay_Basics.testMinusDays_same(TestMonthDay_Basics.java:693)

testGetFieldType(org.joda.time.TestMonthDay_Basics)  Time elapsed: 0.001 sec  <<< ERROR!
java.lang.NoClassDefFoundError: Could not initialize class org.joda.time.MonthDay
	at org.joda.time.TestMonthDay_Basics.testGetFieldType(TestMonthDay_Basics.java:106)

testGetField(org.joda.time.TestMonthDay_Basics)  Time elapsed: 0 sec  <<< ERROR!
java.lang.NoClassDefFoundError: Could not initialize class org.joda.time.MonthDay
	at org.joda.time.TestMonthDay_Basics.testGetField(TestMonthDay_Basics.java:128)

testGetValue(org.joda.time.TestMonthDay_Basics)  Time elapsed: 0.001 sec  <<< ERROR!
java.lang.NoClassDefFoundError: Could not initialize class org.joda.time.MonthDay
	at org.joda.time.TestMonthDay_Basics.testGetValue(TestMonthDay_Basics.java:149)

testWithChronologyRetainFields_Chrono(org.joda.time.TestMonthDay_Basics)  Time elapsed: 0 sec  <<< ERROR!
java.lang.NoClassDefFoundError: Could not initialize class org.joda.time.MonthDay
	at org.joda.time.TestMonthDay_Basics.testWithChronologyRetainFields_Chrono(TestMonthDay_Basics.java:339)

testWithChronologyRetainFields_sameChrono(org.joda.time.TestMonthDay_Basics)  Time elapsed: 0.001 sec  <<< ERROR!
java.lang.NoClassDefFoundError: Could not initialize class org.joda.time.MonthDay
	at org.joda.time.TestMonthDay_Basics.testWithChronologyRetainFields_sameChrono(TestMonthDay_Basics.java:348)

testWithChronologyRetainFields_nullChrono(org.joda.time.TestMonthDay_Basics)  Time elapsed: 0 sec  <<< ERROR!
java.lang.NoClassDefFoundError: Could not initialize class org.joda.time.MonthDay
	at org.joda.time.TestMonthDay_Basics.testWithChronologyRetainFields_nullChrono(TestMonthDay_Basics.java:354)

testConstructor(org.joda.time.TestMonthDay_Constructors)  Time elapsed: 0.001 sec  <<< ERROR!
java.lang.NoClassDefFoundError: Could not initialize class org.joda.time.MonthDay
	at org.joda.time.TestMonthDay_Constructors.testConstructor(TestMonthDay_Constructors.java:122)

testConstructor_long1_Chronology(org.joda.time.TestMonthDay_Constructors)  Time elapsed: 0 sec  <<< ERROR!
java.lang.NoClassDefFoundError: Could not initialize class org.joda.time.MonthDay
	at org.joda.time.TestMonthDay_Constructors.testConstructor_long1_Chronology(TestMonthDay_Constructors.java:210)

testConstructor_long2_Chronology(org.joda.time.TestMonthDay_Constructors)  Time elapsed: 0.001 sec  <<< ERROR!
java.lang.NoClassDefFoundError: Could not initialize class org.joda.time.MonthDay
	at org.joda.time.TestMonthDay_Constructors.testConstructor_long2_Chronology(TestMonthDay_Constructors.java:220)

testConstructor_long_nullChronology(org.joda.time.TestMonthDay_Constructors)  Time elapsed: 0 sec  <<< ERROR!
java.lang.NoClassDefFoundError: Could not initialize class org.joda.time.MonthDay
	at org.joda.time.TestMonthDay_Constructors.testConstructor_long_nullChronology(TestMonthDay_Constructors.java:230)

testConstructor_ObjectString5(org.joda.time.TestMonthDay_Constructors)  Time elapsed: 0.001 sec  <<< ERROR!
java.lang.NoClassDefFoundError: Could not initialize class org.joda.time.MonthDay
	at org.joda.time.TestMonthDay_Constructors.testConstructor_ObjectString5(TestMonthDay_Constructors.java:260)

testConstructor_ObjectStringEx1(org.joda.time.TestMonthDay_Constructors)  Time elapsed: 0 sec  <<< ERROR!
java.lang.NoClassDefFoundError: Could not initialize class org.joda.time.MonthDay
	at org.joda.time.TestMonthDay_Constructors.testConstructor_ObjectStringEx1(TestMonthDay_Constructors.java:268)

testConstructor_ObjectStringEx2(org.joda.time.TestMonthDay_Constructors)  Time elapsed: 0.001 sec  <<< ERROR!
java.lang.NoClassDefFoundError: Could not initialize class org.joda.time.MonthDay
	at org.joda.time.TestMonthDay_Constructors.testConstructor_ObjectStringEx2(TestMonthDay_Constructors.java:277)

testConstructor_DateTimeZone(org.joda.time.TestMonthDay_Constructors)  Time elapsed: 0 sec  <<< ERROR!
java.lang.NoClassDefFoundError: Could not initialize class org.joda.time.MonthDay
	at org.joda.time.TestMonthDay_Constructors.testConstructor_DateTimeZone(TestMonthDay_Constructors.java:137)

testConstructor_nullDateTimeZone(org.joda.time.TestMonthDay_Constructors)  Time elapsed: 0.001 sec  <<< ERROR!
java.lang.NoClassDefFoundError: Could not initialize class org.joda.time.MonthDay
	at org.joda.time.TestMonthDay_Constructors.testConstructor_nullDateTimeZone(TestMonthDay_Constructors.java:158)

testConstructor_Chronology(org.joda.time.TestMonthDay_Constructors)  Time elapsed: 0 sec  <<< ERROR!
java.lang.NoClassDefFoundError: Could not initialize class org.joda.time.MonthDay
	at org.joda.time.TestMonthDay_Constructors.testConstructor_Chronology(TestMonthDay_Constructors.java:168)

testConstructor_nullChronology(org.joda.time.TestMonthDay_Constructors)  Time elapsed: 0.001 sec  <<< ERROR!
java.lang.NoClassDefFoundError: Could not initialize class org.joda.time.MonthDay
	at org.joda.time.TestMonthDay_Constructors.testConstructor_nullChronology(TestMonthDay_Constructors.java:179)

testConstructor_ObjectString1(org.joda.time.TestMonthDay_Constructors)  Time elapsed: 0 sec  <<< ERROR!
java.lang.NoClassDefFoundError: Could not initialize class org.joda.time.MonthDay
	at org.joda.time.TestMonthDay_Constructors.testConstructor_ObjectString1(TestMonthDay_Constructors.java:253)

testParse_noFormatter(org.joda.time.TestMonthDay_Constructors)  Time elapsed: 0.001 sec  <<< ERROR!
java.lang.NoClassDefFoundError: Could not initialize class org.joda.time.MonthDay
	at org.joda.time.TestMonthDay_Constructors.testParse_noFormatter(TestMonthDay_Constructors.java:82)

testParse_formatter(org.joda.time.TestMonthDay_Constructors)  Time elapsed: 0 sec  <<< ERROR!
java.lang.StringIndexOutOfBoundsException: String index out of range: 11
	at java.lang.String.charAt(String.java:658)
	at org.joda.time.format.DateTimeFormat.parseToken(DateTimeFormat.java:130)
	at org.joda.time.format.DateTimeFormat.parsePatternTo(DateTimeFormat.java:54)
	at org.joda.time.format.DateTimeFormat.createFormatterForPattern(DateTimeFormat.java:155)
	at org.joda.time.format.DateTimeFormat.forPattern(DateTimeFormat.java:30)
	at org.joda.time.TestMonthDay_Constructors.testParse_formatter(TestMonthDay_Constructors.java:89)

testConstructor_long1(org.joda.time.TestMonthDay_Constructors)  Time elapsed: 0.001 sec  <<< ERROR!
java.lang.NoClassDefFoundError: Could not initialize class org.joda.time.MonthDay
	at org.joda.time.TestMonthDay_Constructors.testConstructor_long1(TestMonthDay_Constructors.java:190)

testConstructor_long2(org.joda.time.TestMonthDay_Constructors)  Time elapsed: 0 sec  <<< ERROR!
java.lang.NoClassDefFoundError: Could not initialize class org.joda.time.MonthDay
	at org.joda.time.TestMonthDay_Constructors.testConstructor_long2(TestMonthDay_Constructors.java:200)

testConstructor_Object(org.joda.time.TestMonthDay_Constructors)  Time elapsed: 0.001 sec  <<< ERROR!
java.lang.NoClassDefFoundError: Could not initialize class org.joda.time.MonthDay
	at org.joda.time.TestMonthDay_Constructors.testConstructor_Object(TestMonthDay_Constructors.java:239)

testConstructor_nullObject(org.joda.time.TestMonthDay_Constructors)  Time elapsed: 0 sec  <<< ERROR!
java.lang.NoClassDefFoundError: Could not initialize class org.joda.time.MonthDay
	at org.joda.time.TestMonthDay_Constructors.testConstructor_nullObject(TestMonthDay_Constructors.java:246)

testConstructor_Object_Chronology(org.joda.time.TestMonthDay_Constructors)  Time elapsed: 0 sec  <<< ERROR!
java.lang.NoClassDefFoundError: Could not initialize class org.joda.time.MonthDay
	at org.joda.time.TestMonthDay_Constructors.testConstructor_Object_Chronology(TestMonthDay_Constructors.java:308)

testConstructor_nullObject_Chronology(org.joda.time.TestMonthDay_Constructors)  Time elapsed: 0.001 sec  <<< ERROR!
java.lang.NoClassDefFoundError: Could not initialize class org.joda.time.MonthDay
	at org.joda.time.TestMonthDay_Constructors.testConstructor_nullObject_Chronology(TestMonthDay_Constructors.java:318)

testConstructor_Object_nullChronology(org.joda.time.TestMonthDay_Constructors)  Time elapsed: 0 sec  <<< ERROR!
java.lang.NoClassDefFoundError: Could not initialize class org.joda.time.MonthDay
	at org.joda.time.TestMonthDay_Constructors.testConstructor_Object_nullChronology(TestMonthDay_Constructors.java:329)

testConstructor_nullObject_nullChronology(org.joda.time.TestMonthDay_Constructors)  Time elapsed: 0.001 sec  <<< ERROR!
java.lang.NoClassDefFoundError: Could not initialize class org.joda.time.MonthDay
	at org.joda.time.TestMonthDay_Constructors.testConstructor_nullObject_nullChronology(TestMonthDay_Constructors.java:339)

testConstructor_ObjectStringEx3(org.joda.time.TestMonthDay_Constructors)  Time elapsed: 0 sec  <<< ERROR!
java.lang.NoClassDefFoundError: Could not initialize class org.joda.time.MonthDay
	at org.joda.time.TestMonthDay_Constructors.testConstructor_ObjectStringEx3(TestMonthDay_Constructors.java:286)

testConstructor_ObjectStringEx4(org.joda.time.TestMonthDay_Constructors)  Time elapsed: 0.001 sec  <<< ERROR!
java.lang.NoClassDefFoundError: Could not initialize class org.joda.time.MonthDay
	at org.joda.time.TestMonthDay_Constructors.testConstructor_ObjectStringEx4(TestMonthDay_Constructors.java:295)

testConstructor_int_int(org.joda.time.TestMonthDay_Constructors)  Time elapsed: 0 sec  <<< ERROR!
java.lang.NoClassDefFoundError: Could not initialize class org.joda.time.MonthDay
	at org.joda.time.TestMonthDay_Constructors.testConstructor_int_int(TestMonthDay_Constructors.java:350)

testConstructor_int_int_Chronology(org.joda.time.TestMonthDay_Constructors)  Time elapsed: 0 sec  <<< ERROR!
java.lang.NoClassDefFoundError: Could not initialize class org.joda.time.MonthDay
	at org.joda.time.TestMonthDay_Constructors.testConstructor_int_int_Chronology(TestMonthDay_Constructors.java:376)

testConstructor_int_int_nullChronology(org.joda.time.TestMonthDay_Constructors)  Time elapsed: 0 sec  <<< ERROR!
java.lang.NoClassDefFoundError: Could not initialize class org.joda.time.MonthDay
	at org.joda.time.TestMonthDay_Constructors.testConstructor_int_int_nullChronology(TestMonthDay_Constructors.java:402)

testFactory_FromCalendarFields(org.joda.time.TestMonthDay_Constructors)  Time elapsed: 0 sec  <<< ERROR!
java.lang.NoClassDefFoundError: Could not initialize class org.joda.time.MonthDay
	at org.joda.time.TestMonthDay_Constructors.testFactory_FromCalendarFields(TestMonthDay_Constructors.java:97)

testFactory_FromDateFields(org.joda.time.TestMonthDay_Constructors)  Time elapsed: 0.001 sec  <<< ERROR!
java.lang.NoClassDefFoundError: Could not initialize class org.joda.time.MonthDay
	at org.joda.time.TestMonthDay_Constructors.testFactory_FromDateFields(TestMonthDay_Constructors.java:109)

testPropertyGetMaxMinValuesDayOfMonth(org.joda.time.TestMonthDay_Properties)  Time elapsed: 0 sec  <<< ERROR!
java.lang.NoClassDefFoundError: Could not initialize class org.joda.time.MonthDay
	at org.joda.time.TestMonthDay_Properties.testPropertyGetMaxMinValuesDayOfMonth(TestMonthDay_Properties.java:199)

testPropertyAddDayOfMonth(org.joda.time.TestMonthDay_Properties)  Time elapsed: 0.001 sec  <<< ERROR!
java.lang.NoClassDefFoundError: Could not initialize class org.joda.time.MonthDay
	at org.joda.time.TestMonthDay_Properties.testPropertyAddDayOfMonth(TestMonthDay_Properties.java:207)

testPropertyAddWrapFieldDayOfMonth(org.joda.time.TestMonthDay_Properties)  Time elapsed: 0 sec  <<< ERROR!
java.lang.NoClassDefFoundError: Could not initialize class org.joda.time.MonthDay
	at org.joda.time.TestMonthDay_Properties.testPropertyAddWrapFieldDayOfMonth(TestMonthDay_Properties.java:223)

testPropertySetDayOfMonth(org.joda.time.TestMonthDay_Properties)  Time elapsed: 0 sec  <<< ERROR!
java.lang.NoClassDefFoundError: Could not initialize class org.joda.time.MonthDay
	at org.joda.time.TestMonthDay_Properties.testPropertySetDayOfMonth(TestMonthDay_Properties.java:236)

testPropertySetTextDayOfMonth(org.joda.time.TestMonthDay_Properties)  Time elapsed: 0 sec  <<< ERROR!
java.lang.NoClassDefFoundError: Could not initialize class org.joda.time.MonthDay
	at org.joda.time.TestMonthDay_Properties.testPropertySetTextDayOfMonth(TestMonthDay_Properties.java:252)

testPropertyAddMonthOfYear(org.joda.time.TestMonthDay_Properties)  Time elapsed: 0 sec  <<< ERROR!
java.lang.NoClassDefFoundError: Could not initialize class org.joda.time.MonthDay
	at org.joda.time.TestMonthDay_Properties.testPropertyAddMonthOfYear(TestMonthDay_Properties.java:108)

testPropertyAddWrapFieldMonthOfYear(org.joda.time.TestMonthDay_Properties)  Time elapsed: 0.001 sec  <<< ERROR!
java.lang.NoClassDefFoundError: Could not initialize class org.joda.time.MonthDay
	at org.joda.time.TestMonthDay_Properties.testPropertyAddWrapFieldMonthOfYear(TestMonthDay_Properties.java:124)

testPropertySetMonthOfYear(org.joda.time.TestMonthDay_Properties)  Time elapsed: 0 sec  <<< ERROR!
java.lang.NoClassDefFoundError: Could not initialize class org.joda.time.MonthDay
	at org.joda.time.TestMonthDay_Properties.testPropertySetMonthOfYear(TestMonthDay_Properties.java:140)

testPropertySetTextMonthOfYear(org.joda.time.TestMonthDay_Properties)  Time elapsed: 0.001 sec  <<< ERROR!
java.lang.NoClassDefFoundError: Could not initialize class org.joda.time.MonthDay
	at org.joda.time.TestMonthDay_Properties.testPropertySetTextMonthOfYear(TestMonthDay_Properties.java:147)

testPropertyCompareToMonthOfYear(org.joda.time.TestMonthDay_Properties)  Time elapsed: 0 sec  <<< ERROR!
java.lang.NoClassDefFoundError: Could not initialize class org.joda.time.MonthDay
	at org.joda.time.TestMonthDay_Properties.testPropertyCompareToMonthOfYear(TestMonthDay_Properties.java:154)

testPropertyGetDayOfMonth(org.joda.time.TestMonthDay_Properties)  Time elapsed: 0 sec  <<< ERROR!
java.lang.NoClassDefFoundError: Could not initialize class org.joda.time.MonthDay
	at org.joda.time.TestMonthDay_Properties.testPropertyGetDayOfMonth(TestMonthDay_Properties.java:177)

testPropertyEqualsHashCodeLenient(org.joda.time.TestMonthDay_Properties)  Time elapsed: 0.001 sec  <<< ERROR!
java.lang.NoClassDefFoundError: Could not initialize class org.joda.time.MonthDay
	at org.joda.time.TestMonthDay_Properties.testPropertyEqualsHashCodeLenient(TestMonthDay_Properties.java:320)

testPropertyEqualsHashCodeStrict(org.joda.time.TestMonthDay_Properties)  Time elapsed: 0 sec  <<< ERROR!
java.lang.NoClassDefFoundError: Could not initialize class org.joda.time.MonthDay
	at org.joda.time.TestMonthDay_Properties.testPropertyEqualsHashCodeStrict(TestMonthDay_Properties.java:332)

testPropertyCompareToDayOfMonth(org.joda.time.TestMonthDay_Properties)  Time elapsed: 0.001 sec  <<< ERROR!
java.lang.NoClassDefFoundError: Could not initialize class org.joda.time.MonthDay
	at org.joda.time.TestMonthDay_Properties.testPropertyCompareToDayOfMonth(TestMonthDay_Properties.java:267)

testPropertyEquals(org.joda.time.TestMonthDay_Properties)  Time elapsed: 0 sec  <<< ERROR!
java.lang.NoClassDefFoundError: Could not initialize class org.joda.time.MonthDay
	at org.joda.time.TestMonthDay_Properties.testPropertyEquals(TestMonthDay_Properties.java:290)

testPropertyHashCode(org.joda.time.TestMonthDay_Properties)  Time elapsed: 0 sec  <<< ERROR!
java.lang.NoClassDefFoundError: Could not initialize class org.joda.time.MonthDay
	at org.joda.time.TestMonthDay_Properties.testPropertyHashCode(TestMonthDay_Properties.java:311)

testPropertyGetMonthOfYear(org.joda.time.TestMonthDay_Properties)  Time elapsed: 0.001 sec  <<< ERROR!
java.lang.NoClassDefFoundError: Could not initialize class org.joda.time.MonthDay
	at org.joda.time.TestMonthDay_Properties.testPropertyGetMonthOfYear(TestMonthDay_Properties.java:81)

testPropertyGetMaxMinValuesMonthOfYear(org.joda.time.TestMonthDay_Properties)  Time elapsed: 0 sec  <<< ERROR!
java.lang.NoClassDefFoundError: Could not initialize class org.joda.time.MonthDay
	at org.joda.time.TestMonthDay_Properties.testPropertyGetMaxMinValuesMonthOfYear(TestMonthDay_Properties.java:100)

testToString_String(org.joda.time.TestPartial_Basics)  Time elapsed: 0.001 sec  <<< ERROR!
java.lang.StringIndexOutOfBoundsException: String index out of range: 7
	at java.lang.String.charAt(String.java:658)
	at org.joda.time.format.DateTimeFormat.parseToken(DateTimeFormat.java:130)
	at org.joda.time.format.DateTimeFormat.parsePatternTo(DateTimeFormat.java:54)
	at org.joda.time.format.DateTimeFormat.createFormatterForPattern(DateTimeFormat.java:155)
	at org.joda.time.format.DateTimeFormat.forPattern(DateTimeFormat.java:30)
	at org.joda.time.Partial.toString(Partial.java:820)
	at org.joda.time.TestPartial_Basics.testToString_String(TestPartial_Basics.java:877)

testToString_String_Locale(org.joda.time.TestPartial_Basics)  Time elapsed: 0 sec  <<< ERROR!
java.lang.StringIndexOutOfBoundsException: String index out of range: 3
	at java.lang.String.charAt(String.java:658)
	at org.joda.time.format.DateTimeFormat.parseToken(DateTimeFormat.java:130)
	at org.joda.time.format.DateTimeFormat.parsePatternTo(DateTimeFormat.java:54)
	at org.joda.time.format.DateTimeFormat.createFormatterForPattern(DateTimeFormat.java:155)
	at org.joda.time.format.DateTimeFormat.forPattern(DateTimeFormat.java:30)
	at org.joda.time.Partial.toString(Partial.java:835)
	at org.joda.time.TestPartial_Basics.testToString_String_Locale(TestPartial_Basics.java:884)

testToString_DTFormatter(org.joda.time.TestPartial_Basics)  Time elapsed: 0 sec  <<< ERROR!
java.lang.StringIndexOutOfBoundsException: String index out of range: 7
	at java.lang.String.charAt(String.java:658)
	at org.joda.time.format.DateTimeFormat.parseToken(DateTimeFormat.java:130)
	at org.joda.time.format.DateTimeFormat.parsePatternTo(DateTimeFormat.java:54)
	at org.joda.time.format.DateTimeFormat.createFormatterForPattern(DateTimeFormat.java:155)
	at org.joda.time.format.DateTimeFormat.forPattern(DateTimeFormat.java:30)
	at org.joda.time.TestPartial_Basics.testToString_DTFormatter(TestPartial_Basics.java:893)

testIsLocalDateTimeGap_Berlin(org.joda.time.TestDateTimeZone)  Time elapsed: 0 sec  <<< ERROR!
java.lang.StringIndexOutOfBoundsException: String index out of range: 25
	at java.lang.String.charAt(String.java:658)
	at org.joda.time.format.DateTimeFormat.parseToken(DateTimeFormat.java:130)
	at org.joda.time.format.DateTimeFormat.parsePatternTo(DateTimeFormat.java:54)
	at org.joda.time.format.DateTimeFormat.createFormatterForPattern(DateTimeFormat.java:155)
	at org.joda.time.format.DateTimeFormat.forPattern(DateTimeFormat.java:30)
	at org.joda.time.IllegalInstantException.createMessage(IllegalInstantException.java:67)
	at org.joda.time.IllegalInstantException.<init>(IllegalInstantException.java:63)
	at org.joda.time.chrono.ZonedChronology.localToUTC(ZonedChronology.java:143)
	at org.joda.time.chrono.ZonedChronology.getDateTimeMillis(ZonedChronology.java:118)
	at org.joda.time.chrono.AssembledChronology.getDateTimeMillis(AssembledChronology.java:133)
	at org.joda.time.base.BaseDateTime.<init>(BaseDateTime.java:258)
	at org.joda.time.DateTime.<init>(DateTime.java:532)
	at org.joda.time.LocalDateTime.toDateTime(LocalDateTime.java:750)
	at org.joda.time.DateTimeZone.isLocalDateTimeGap(DateTimeZone.java:1148)
	at org.joda.time.TestDateTimeZone.testIsLocalDateTimeGap_Berlin(TestDateTimeZone.java:934)

testIsLocalDateTimeGap_NewYork(org.joda.time.TestDateTimeZone)  Time elapsed: 0.002 sec  <<< ERROR!
java.lang.StringIndexOutOfBoundsException: String index out of range: 25
	at java.lang.String.charAt(String.java:658)
	at org.joda.time.format.DateTimeFormat.parseToken(DateTimeFormat.java:130)
	at org.joda.time.format.DateTimeFormat.parsePatternTo(DateTimeFormat.java:54)
	at org.joda.time.format.DateTimeFormat.createFormatterForPattern(DateTimeFormat.java:155)
	at org.joda.time.format.DateTimeFormat.forPattern(DateTimeFormat.java:30)
	at org.joda.time.IllegalInstantException.createMessage(IllegalInstantException.java:67)
	at org.joda.time.IllegalInstantException.<init>(IllegalInstantException.java:63)
	at org.joda.time.chrono.ZonedChronology.localToUTC(ZonedChronology.java:143)
	at org.joda.time.chrono.ZonedChronology.getDateTimeMillis(ZonedChronology.java:118)
	at org.joda.time.chrono.AssembledChronology.getDateTimeMillis(AssembledChronology.java:133)
	at org.joda.time.base.BaseDateTime.<init>(BaseDateTime.java:258)
	at org.joda.time.DateTime.<init>(DateTime.java:532)
	at org.joda.time.LocalDateTime.toDateTime(LocalDateTime.java:750)
	at org.joda.time.DateTimeZone.isLocalDateTimeGap(DateTimeZone.java:1148)
	at org.joda.time.TestDateTimeZone.testIsLocalDateTimeGap_NewYork(TestDateTimeZone.java:951)

test_DateTime_setHourZero_Gaza(org.joda.time.TestDateTimeZoneCutover)  Time elapsed: 0.001 sec  <<< ERROR!
java.lang.StringIndexOutOfBoundsException: String index out of range: 25
	at java.lang.String.charAt(String.java:658)
	at org.joda.time.format.DateTimeFormat.parseToken(DateTimeFormat.java:130)
	at org.joda.time.format.DateTimeFormat.parsePatternTo(DateTimeFormat.java:54)
	at org.joda.time.format.DateTimeFormat.createFormatterForPattern(DateTimeFormat.java:155)
	at org.joda.time.format.DateTimeFormat.forPattern(DateTimeFormat.java:30)
	at org.joda.time.IllegalInstantException.createMessage(IllegalInstantException.java:67)
	at org.joda.time.IllegalInstantException.<init>(IllegalInstantException.java:63)
	at org.joda.time.chrono.ZonedChronology$ZonedDateTimeField.set(ZonedChronology.java:485)
	at org.joda.time.DateTime$Property.setCopy(DateTime.java:2220)
	at org.joda.time.TestDateTimeZoneCutover.test_DateTime_setHourZero_Gaza(TestDateTimeZoneCutover.java:109)

test_DateTime_withHourZero_Gaza(org.joda.time.TestDateTimeZoneCutover)  Time elapsed: 0.001 sec  <<< ERROR!
java.lang.StringIndexOutOfBoundsException: String index out of range: 25
	at java.lang.String.charAt(String.java:658)
	at org.joda.time.format.DateTimeFormat.parseToken(DateTimeFormat.java:130)
	at org.joda.time.format.DateTimeFormat.parsePatternTo(DateTimeFormat.java:54)
	at org.joda.time.format.DateTimeFormat.createFormatterForPattern(DateTimeFormat.java:155)
	at org.joda.time.format.DateTimeFormat.forPattern(DateTimeFormat.java:30)
	at org.joda.time.IllegalInstantException.createMessage(IllegalInstantException.java:67)
	at org.joda.time.IllegalInstantException.<init>(IllegalInstantException.java:63)
	at org.joda.time.chrono.ZonedChronology$ZonedDateTimeField.set(ZonedChronology.java:485)
	at org.joda.time.DateTime.withHourOfDay(DateTime.java:1815)
	at org.joda.time.TestDateTimeZoneCutover.test_DateTime_withHourZero_Gaza(TestDateTimeZoneCutover.java:120)

test_LocalDate_toDateMidnight_Gaza(org.joda.time.TestDateTimeZoneCutover)  Time elapsed: 0 sec  <<< ERROR!
java.lang.StringIndexOutOfBoundsException: String index out of range: 25
	at java.lang.String.charAt(String.java:658)
	at org.joda.time.format.DateTimeFormat.parseToken(DateTimeFormat.java:130)
	at org.joda.time.format.DateTimeFormat.parsePatternTo(DateTimeFormat.java:54)
	at org.joda.time.format.DateTimeFormat.createFormatterForPattern(DateTimeFormat.java:155)
	at org.joda.time.format.DateTimeFormat.forPattern(DateTimeFormat.java:30)
	at org.joda.time.IllegalInstantException.createMessage(IllegalInstantException.java:67)
	at org.joda.time.IllegalInstantException.<init>(IllegalInstantException.java:63)
	at org.joda.time.chrono.ZonedChronology.localToUTC(ZonedChronology.java:143)
	at org.joda.time.chrono.ZonedChronology.getDateTimeMillis(ZonedChronology.java:118)
	at org.joda.time.chrono.AssembledChronology.getDateTimeMillis(AssembledChronology.java:133)
	at org.joda.time.base.BaseDateTime.<init>(BaseDateTime.java:258)
	at org.joda.time.DateMidnight.<init>(DateMidnight.java:350)
	at org.joda.time.LocalDate.toDateMidnight(LocalDate.java:867)
	at org.joda.time.TestDateTimeZoneCutover.test_LocalDate_toDateMidnight_Gaza(TestDateTimeZoneCutover.java:225)

test_DateTime_new_Gaza(org.joda.time.TestDateTimeZoneCutover)  Time elapsed: 0.001 sec  <<< ERROR!
java.lang.StringIndexOutOfBoundsException: String index out of range: 25
	at java.lang.String.charAt(String.java:658)
	at org.joda.time.format.DateTimeFormat.parseToken(DateTimeFormat.java:130)
	at org.joda.time.format.DateTimeFormat.parsePatternTo(DateTimeFormat.java:54)
	at org.joda.time.format.DateTimeFormat.createFormatterForPattern(DateTimeFormat.java:155)
	at org.joda.time.format.DateTimeFormat.forPattern(DateTimeFormat.java:30)
	at org.joda.time.IllegalInstantException.createMessage(IllegalInstantException.java:67)
	at org.joda.time.IllegalInstantException.<init>(IllegalInstantException.java:63)
	at org.joda.time.chrono.ZonedChronology.localToUTC(ZonedChronology.java:143)
	at org.joda.time.chrono.ZonedChronology.getDateTimeMillis(ZonedChronology.java:118)
	at org.joda.time.chrono.AssembledChronology.getDateTimeMillis(AssembledChronology.java:133)
	at org.joda.time.base.BaseDateTime.<init>(BaseDateTime.java:258)
	at org.joda.time.base.BaseDateTime.<init>(BaseDateTime.java:227)
	at org.joda.time.DateTime.<init>(DateTime.java:503)
	at org.joda.time.TestDateTimeZoneCutover.test_DateTime_new_Gaza(TestDateTimeZoneCutover.java:234)

test_DateTime_setHourZero_Turk(org.joda.time.TestDateTimeZoneCutover)  Time elapsed: 0 sec  <<< ERROR!
java.lang.StringIndexOutOfBoundsException: String index out of range: 25
	at java.lang.String.charAt(String.java:658)
	at org.joda.time.format.DateTimeFormat.parseToken(DateTimeFormat.java:130)
	at org.joda.time.format.DateTimeFormat.parsePatternTo(DateTimeFormat.java:54)
	at org.joda.time.format.DateTimeFormat.createFormatterForPattern(DateTimeFormat.java:155)
	at org.joda.time.format.DateTimeFormat.forPattern(DateTimeFormat.java:30)
	at org.joda.time.IllegalInstantException.createMessage(IllegalInstantException.java:67)
	at org.joda.time.IllegalInstantException.<init>(IllegalInstantException.java:63)
	at org.joda.time.chrono.ZonedChronology$ZonedDateTimeField.set(ZonedChronology.java:485)
	at org.joda.time.DateTime$Property.setCopy(DateTime.java:2220)
	at org.joda.time.TestDateTimeZoneCutover.test_DateTime_setHourZero_Turk(TestDateTimeZoneCutover.java:326)

test_DateTime_withHourZero_Turk(org.joda.time.TestDateTimeZoneCutover)  Time elapsed: 0.001 sec  <<< ERROR!
java.lang.StringIndexOutOfBoundsException: String index out of range: 25
	at java.lang.String.charAt(String.java:658)
	at org.joda.time.format.DateTimeFormat.parseToken(DateTimeFormat.java:130)
	at org.joda.time.format.DateTimeFormat.parsePatternTo(DateTimeFormat.java:54)
	at org.joda.time.format.DateTimeFormat.createFormatterForPattern(DateTimeFormat.java:155)
	at org.joda.time.format.DateTimeFormat.forPattern(DateTimeFormat.java:30)
	at org.joda.time.IllegalInstantException.createMessage(IllegalInstantException.java:67)
	at org.joda.time.IllegalInstantException.<init>(IllegalInstantException.java:63)
	at org.joda.time.chrono.ZonedChronology$ZonedDateTimeField.set(ZonedChronology.java:485)
	at org.joda.time.DateTime.withHourOfDay(DateTime.java:1815)
	at org.joda.time.TestDateTimeZoneCutover.test_DateTime_withHourZero_Turk(TestDateTimeZoneCutover.java:337)

test_LocalDate_toDateMidnight_Turk(org.joda.time.TestDateTimeZoneCutover)  Time elapsed: 0 sec  <<< ERROR!
java.lang.StringIndexOutOfBoundsException: String index out of range: 25
	at java.lang.String.charAt(String.java:658)
	at org.joda.time.format.DateTimeFormat.parseToken(DateTimeFormat.java:130)
	at org.joda.time.format.DateTimeFormat.parsePatternTo(DateTimeFormat.java:54)
	at org.joda.time.format.DateTimeFormat.createFormatterForPattern(DateTimeFormat.java:155)
	at org.joda.time.format.DateTimeFormat.forPattern(DateTimeFormat.java:30)
	at org.joda.time.IllegalInstantException.createMessage(IllegalInstantException.java:67)
	at org.joda.time.IllegalInstantException.<init>(IllegalInstantException.java:63)
	at org.joda.time.chrono.ZonedChronology.localToUTC(ZonedChronology.java:143)
	at org.joda.time.chrono.ZonedChronology.getDateTimeMillis(ZonedChronology.java:118)
	at org.joda.time.chrono.AssembledChronology.getDateTimeMillis(AssembledChronology.java:133)
	at org.joda.time.base.BaseDateTime.<init>(BaseDateTime.java:258)
	at org.joda.time.DateMidnight.<init>(DateMidnight.java:350)
	at org.joda.time.LocalDate.toDateMidnight(LocalDate.java:867)
	at org.joda.time.TestDateTimeZoneCutover.test_LocalDate_toDateMidnight_Turk(TestDateTimeZoneCutover.java:442)

test_DateTime_new_Turk(org.joda.time.TestDateTimeZoneCutover)  Time elapsed: 0 sec  <<< ERROR!
java.lang.StringIndexOutOfBoundsException: String index out of range: 25
	at java.lang.String.charAt(String.java:658)
	at org.joda.time.format.DateTimeFormat.parseToken(DateTimeFormat.java:130)
	at org.joda.time.format.DateTimeFormat.parsePatternTo(DateTimeFormat.java:54)
	at org.joda.time.format.DateTimeFormat.createFormatterForPattern(DateTimeFormat.java:155)
	at org.joda.time.format.DateTimeFormat.forPattern(DateTimeFormat.java:30)
	at org.joda.time.IllegalInstantException.createMessage(IllegalInstantException.java:67)
	at org.joda.time.IllegalInstantException.<init>(IllegalInstantException.java:63)
	at org.joda.time.chrono.ZonedChronology.localToUTC(ZonedChronology.java:143)
	at org.joda.time.chrono.ZonedChronology.getDateTimeMillis(ZonedChronology.java:118)
	at org.joda.time.chrono.AssembledChronology.getDateTimeMillis(AssembledChronology.java:133)
	at org.joda.time.base.BaseDateTime.<init>(BaseDateTime.java:258)
	at org.joda.time.base.BaseDateTime.<init>(BaseDateTime.java:227)
	at org.joda.time.DateTime.<init>(DateTime.java:503)
	at org.joda.time.TestDateTimeZoneCutover.test_DateTime_new_Turk(TestDateTimeZoneCutover.java:451)

test_DateTime_setHourForward_NewYork_Spring(org.joda.time.TestDateTimeZoneCutover)  Time elapsed: 0.001 sec  <<< ERROR!
java.lang.StringIndexOutOfBoundsException: String index out of range: 25
	at java.lang.String.charAt(String.java:658)
	at org.joda.time.format.DateTimeFormat.parseToken(DateTimeFormat.java:130)
	at org.joda.time.format.DateTimeFormat.parsePatternTo(DateTimeFormat.java:54)
	at org.joda.time.format.DateTimeFormat.createFormatterForPattern(DateTimeFormat.java:155)
	at org.joda.time.format.DateTimeFormat.forPattern(DateTimeFormat.java:30)
	at org.joda.time.IllegalInstantException.createMessage(IllegalInstantException.java:67)
	at org.joda.time.IllegalInstantException.<init>(IllegalInstantException.java:63)
	at org.joda.time.chrono.ZonedChronology$ZonedDateTimeField.set(ZonedChronology.java:485)
	at org.joda.time.DateTime$Property.setCopy(DateTime.java:2220)
	at org.joda.time.TestDateTimeZoneCutover.test_DateTime_setHourForward_NewYork_Spring(TestDateTimeZoneCutover.java:526)

test_DateTime_setHourBack_NewYork_Spring(org.joda.time.TestDateTimeZoneCutover)  Time elapsed: 0.001 sec  <<< ERROR!
java.lang.StringIndexOutOfBoundsException: String index out of range: 25
	at java.lang.String.charAt(String.java:658)
	at org.joda.time.format.DateTimeFormat.parseToken(DateTimeFormat.java:130)
	at org.joda.time.format.DateTimeFormat.parsePatternTo(DateTimeFormat.java:54)
	at org.joda.time.format.DateTimeFormat.createFormatterForPattern(DateTimeFormat.java:155)
	at org.joda.time.format.DateTimeFormat.forPattern(DateTimeFormat.java:30)
	at org.joda.time.IllegalInstantException.createMessage(IllegalInstantException.java:67)
	at org.joda.time.IllegalInstantException.<init>(IllegalInstantException.java:63)
	at org.joda.time.chrono.ZonedChronology$ZonedDateTimeField.set(ZonedChronology.java:485)
	at org.joda.time.DateTime$Property.setCopy(DateTime.java:2220)
	at org.joda.time.TestDateTimeZoneCutover.test_DateTime_setHourBack_NewYork_Spring(TestDateTimeZoneCutover.java:538)

test_DateTime_setHourForward_Moscow_Spring(org.joda.time.TestDateTimeZoneCutover)  Time elapsed: 0 sec  <<< ERROR!
java.lang.StringIndexOutOfBoundsException: String index out of range: 25
	at java.lang.String.charAt(String.java:658)
	at org.joda.time.format.DateTimeFormat.parseToken(DateTimeFormat.java:130)
	at org.joda.time.format.DateTimeFormat.parsePatternTo(DateTimeFormat.java:54)
	at org.joda.time.format.DateTimeFormat.createFormatterForPattern(DateTimeFormat.java:155)
	at org.joda.time.format.DateTimeFormat.forPattern(DateTimeFormat.java:30)
	at org.joda.time.IllegalInstantException.createMessage(IllegalInstantException.java:67)
	at org.joda.time.IllegalInstantException.<init>(IllegalInstantException.java:63)
	at org.joda.time.chrono.ZonedChronology$ZonedDateTimeField.set(ZonedChronology.java:485)
	at org.joda.time.DateTime$Property.setCopy(DateTime.java:2220)
	at org.joda.time.TestDateTimeZoneCutover.test_DateTime_setHourForward_Moscow_Spring(TestDateTimeZoneCutover.java:857)

test_DateTime_setHourBack_Moscow_Spring(org.joda.time.TestDateTimeZoneCutover)  Time elapsed: 0.001 sec  <<< ERROR!
java.lang.StringIndexOutOfBoundsException: String index out of range: 25
	at java.lang.String.charAt(String.java:658)
	at org.joda.time.format.DateTimeFormat.parseToken(DateTimeFormat.java:130)
	at org.joda.time.format.DateTimeFormat.parsePatternTo(DateTimeFormat.java:54)
	at org.joda.time.format.DateTimeFormat.createFormatterForPattern(DateTimeFormat.java:155)
	at org.joda.time.format.DateTimeFormat.forPattern(DateTimeFormat.java:30)
	at org.joda.time.IllegalInstantException.createMessage(IllegalInstantException.java:67)
	at org.joda.time.IllegalInstantException.<init>(IllegalInstantException.java:63)
	at org.joda.time.chrono.ZonedChronology$ZonedDateTimeField.set(ZonedChronology.java:485)
	at org.joda.time.DateTime$Property.setCopy(DateTime.java:2220)
	at org.joda.time.TestDateTimeZoneCutover.test_DateTime_setHourBack_Moscow_Spring(TestDateTimeZoneCutover.java:869)

testMonthDay(org.joda.time.TestStringConvert)  Time elapsed: 0.001 sec  <<< ERROR!
java.lang.NoClassDefFoundError: Could not initialize class org.joda.time.MonthDay
	at org.joda.time.TestStringConvert.testMonthDay(TestStringConvert.java:103)

testMonthDay_leapDay(org.joda.time.TestStringConvert)  Time elapsed: 0 sec  <<< ERROR!
java.lang.NoClassDefFoundError: Could not initialize class org.joda.time.MonthDay
	at org.joda.time.TestStringConvert.testMonthDay_leapDay(TestStringConvert.java:110)

testZoneTransition(org.joda.time.TestIllegalFieldValueException)  Time elapsed: 0 sec  <<< ERROR!
java.lang.StringIndexOutOfBoundsException: String index out of range: 25
	at java.lang.String.charAt(String.java:658)
	at org.joda.time.format.DateTimeFormat.parseToken(DateTimeFormat.java:130)
	at org.joda.time.format.DateTimeFormat.parsePatternTo(DateTimeFormat.java:54)
	at org.joda.time.format.DateTimeFormat.createFormatterForPattern(DateTimeFormat.java:155)
	at org.joda.time.format.DateTimeFormat.forPattern(DateTimeFormat.java:30)
	at org.joda.time.IllegalInstantException.createMessage(IllegalInstantException.java:67)
	at org.joda.time.IllegalInstantException.<init>(IllegalInstantException.java:63)
	at org.joda.time.chrono.ZonedChronology$ZonedDateTimeField.set(ZonedChronology.java:485)
	at org.joda.time.DateTime$Property.setCopy(DateTime.java:2220)
	at org.joda.time.TestIllegalFieldValueException.testZoneTransition(TestIllegalFieldValueException.java:197)

test_isoChrononolgy_Chicago(org.joda.time.chrono.TestLenientChronology)  Time elapsed: 0.002 sec  <<< ERROR!
java.lang.StringIndexOutOfBoundsException: String index out of range: 25
	at java.lang.String.charAt(String.java:658)
	at org.joda.time.format.DateTimeFormat.parseToken(DateTimeFormat.java:130)
	at org.joda.time.format.DateTimeFormat.parsePatternTo(DateTimeFormat.java:54)
	at org.joda.time.format.DateTimeFormat.createFormatterForPattern(DateTimeFormat.java:155)
	at org.joda.time.format.DateTimeFormat.forPattern(DateTimeFormat.java:30)
	at org.joda.time.IllegalInstantException.createMessage(IllegalInstantException.java:67)
	at org.joda.time.IllegalInstantException.<init>(IllegalInstantException.java:63)
	at org.joda.time.chrono.ZonedChronology.localToUTC(ZonedChronology.java:143)
	at org.joda.time.chrono.ZonedChronology.getDateTimeMillis(ZonedChronology.java:118)
	at org.joda.time.chrono.AssembledChronology.getDateTimeMillis(AssembledChronology.java:133)
	at org.joda.time.base.BaseDateTime.<init>(BaseDateTime.java:258)
	at org.joda.time.DateTime.<init>(DateTime.java:532)
	at org.joda.time.chrono.TestLenientChronology.test_isoChrononolgy_Chicago(TestLenientChronology.java:163)

test_strictChrononolgy_Chicago(org.joda.time.chrono.TestLenientChronology)  Time elapsed: 0.001 sec  <<< ERROR!
java.lang.StringIndexOutOfBoundsException: String index out of range: 25
	at java.lang.String.charAt(String.java:658)
	at org.joda.time.format.DateTimeFormat.parseToken(DateTimeFormat.java:130)
	at org.joda.time.format.DateTimeFormat.parsePatternTo(DateTimeFormat.java:54)
	at org.joda.time.format.DateTimeFormat.createFormatterForPattern(DateTimeFormat.java:155)
	at org.joda.time.format.DateTimeFormat.forPattern(DateTimeFormat.java:30)
	at org.joda.time.IllegalInstantException.createMessage(IllegalInstantException.java:67)
	at org.joda.time.IllegalInstantException.<init>(IllegalInstantException.java:63)
	at org.joda.time.chrono.ZonedChronology.localToUTC(ZonedChronology.java:143)
	at org.joda.time.chrono.ZonedChronology.getDateTimeMillis(ZonedChronology.java:118)
	at org.joda.time.chrono.AssembledChronology.getDateTimeMillis(AssembledChronology.java:133)
	at org.joda.time.chrono.AssembledChronology.getDateTimeMillis(AssembledChronology.java:133)
	at org.joda.time.base.BaseDateTime.<init>(BaseDateTime.java:258)
	at org.joda.time.DateTime.<init>(DateTime.java:532)
	at org.joda.time.chrono.TestLenientChronology.test_strictChrononolgy_Chicago(TestLenientChronology.java:152)

testParseInto_monthOnly(org.joda.time.format.TestDateTimeFormatter)  Time elapsed: 0.001 sec  <<< ERROR!
java.lang.StringIndexOutOfBoundsException: String index out of range: 1
	at java.lang.String.charAt(String.java:658)
	at org.joda.time.format.DateTimeFormat.parseToken(DateTimeFormat.java:130)
	at org.joda.time.format.DateTimeFormat.parsePatternTo(DateTimeFormat.java:54)
	at org.joda.time.format.DateTimeFormat.createFormatterForPattern(DateTimeFormat.java:155)
	at org.joda.time.format.DateTimeFormat.forPattern(DateTimeFormat.java:30)
	at org.joda.time.format.TestDateTimeFormatter.testParseInto_monthOnly(TestDateTimeFormatter.java:867)

testParseInto_monthOnly_baseStartYear(org.joda.time.format.TestDateTimeFormatter)  Time elapsed: 0 sec  <<< ERROR!
java.lang.StringIndexOutOfBoundsException: String index out of range: 1
	at java.lang.String.charAt(String.java:658)
	at org.joda.time.format.DateTimeFormat.parseToken(DateTimeFormat.java:130)
	at org.joda.time.format.DateTimeFormat.parsePatternTo(DateTimeFormat.java:54)
	at org.joda.time.format.DateTimeFormat.createFormatterForPattern(DateTimeFormat.java:155)
	at org.joda.time.format.DateTimeFormat.forPattern(DateTimeFormat.java:30)
	at org.joda.time.format.TestDateTimeFormatter.testParseInto_monthOnly_baseStartYear(TestDateTimeFormatter.java:874)

testParseInto_monthOnly_parseStartYear(org.joda.time.format.TestDateTimeFormatter)  Time elapsed: 0.001 sec  <<< ERROR!
java.lang.StringIndexOutOfBoundsException: String index out of range: 1
	at java.lang.String.charAt(String.java:658)
	at org.joda.time.format.DateTimeFormat.parseToken(DateTimeFormat.java:130)
	at org.joda.time.format.DateTimeFormat.parsePatternTo(DateTimeFormat.java:54)
	at org.joda.time.format.DateTimeFormat.createFormatterForPattern(DateTimeFormat.java:155)
	at org.joda.time.format.DateTimeFormat.forPattern(DateTimeFormat.java:30)
	at org.joda.time.format.TestDateTimeFormatter.testParseInto_monthOnly_parseStartYear(TestDateTimeFormatter.java:881)

testParseInto_monthOnly_baseEndYear(org.joda.time.format.TestDateTimeFormatter)  Time elapsed: 0 sec  <<< ERROR!
java.lang.StringIndexOutOfBoundsException: String index out of range: 1
	at java.lang.String.charAt(String.java:658)
	at org.joda.time.format.DateTimeFormat.parseToken(DateTimeFormat.java:130)
	at org.joda.time.format.DateTimeFormat.parsePatternTo(DateTimeFormat.java:54)
	at org.joda.time.format.DateTimeFormat.createFormatterForPattern(DateTimeFormat.java:155)
	at org.joda.time.format.DateTimeFormat.forPattern(DateTimeFormat.java:30)
	at org.joda.time.format.TestDateTimeFormatter.testParseInto_monthOnly_baseEndYear(TestDateTimeFormatter.java:888)

testParseInto_monthOnly_parseEndYear(org.joda.time.format.TestDateTimeFormatter)  Time elapsed: 0.001 sec  <<< ERROR!
java.lang.StringIndexOutOfBoundsException: String index out of range: 1
	at java.lang.String.charAt(String.java:658)
	at org.joda.time.format.DateTimeFormat.parseToken(DateTimeFormat.java:130)
	at org.joda.time.format.DateTimeFormat.parsePatternTo(DateTimeFormat.java:54)
	at org.joda.time.format.DateTimeFormat.createFormatterForPattern(DateTimeFormat.java:155)
	at org.joda.time.format.DateTimeFormat.forPattern(DateTimeFormat.java:30)
	at org.joda.time.format.TestDateTimeFormatter.testParseInto_monthOnly_parseEndYear(TestDateTimeFormatter.java:895)

testParseInto_monthDay_feb29(org.joda.time.format.TestDateTimeFormatter)  Time elapsed: 0 sec  <<< ERROR!
java.lang.StringIndexOutOfBoundsException: String index out of range: 3
	at java.lang.String.charAt(String.java:658)
	at org.joda.time.format.DateTimeFormat.parseToken(DateTimeFormat.java:130)
	at org.joda.time.format.DateTimeFormat.parsePatternTo(DateTimeFormat.java:54)
	at org.joda.time.format.DateTimeFormat.createFormatterForPattern(DateTimeFormat.java:155)
	at org.joda.time.format.DateTimeFormat.forPattern(DateTimeFormat.java:30)
	at org.joda.time.format.TestDateTimeFormatter.testParseInto_monthDay_feb29(TestDateTimeFormatter.java:902)

testParseInto_monthDay_feb29_startOfYear(org.joda.time.format.TestDateTimeFormatter)  Time elapsed: 0 sec  <<< ERROR!
java.lang.StringIndexOutOfBoundsException: String index out of range: 3
	at java.lang.String.charAt(String.java:658)
	at org.joda.time.format.DateTimeFormat.parseToken(DateTimeFormat.java:130)
	at org.joda.time.format.DateTimeFormat.parsePatternTo(DateTimeFormat.java:54)
	at org.joda.time.format.DateTimeFormat.createFormatterForPattern(DateTimeFormat.java:155)
	at org.joda.time.format.DateTimeFormat.forPattern(DateTimeFormat.java:30)
	at org.joda.time.format.TestDateTimeFormatter.testParseInto_monthDay_feb29_startOfYear(TestDateTimeFormatter.java:909)

testParseInto_monthDay_feb29_OfYear(org.joda.time.format.TestDateTimeFormatter)  Time elapsed: 0.001 sec  <<< ERROR!
java.lang.StringIndexOutOfBoundsException: String index out of range: 3
	at java.lang.String.charAt(String.java:658)
	at org.joda.time.format.DateTimeFormat.parseToken(DateTimeFormat.java:130)
	at org.joda.time.format.DateTimeFormat.parsePatternTo(DateTimeFormat.java:54)
	at org.joda.time.format.DateTimeFormat.createFormatterForPattern(DateTimeFormat.java:155)
	at org.joda.time.format.DateTimeFormat.forPattern(DateTimeFormat.java:30)
	at org.joda.time.format.TestDateTimeFormatter.testParseInto_monthDay_feb29_OfYear(TestDateTimeFormatter.java:916)

testParseInto_monthDay_feb29_newYork(org.joda.time.format.TestDateTimeFormatter)  Time elapsed: 0 sec  <<< ERROR!
java.lang.StringIndexOutOfBoundsException: String index out of range: 3
	at java.lang.String.charAt(String.java:658)
	at org.joda.time.format.DateTimeFormat.parseToken(DateTimeFormat.java:130)
	at org.joda.time.format.DateTimeFormat.parsePatternTo(DateTimeFormat.java:54)
	at org.joda.time.format.DateTimeFormat.createFormatterForPattern(DateTimeFormat.java:155)
	at org.joda.time.format.DateTimeFormat.forPattern(DateTimeFormat.java:30)
	at org.joda.time.format.TestDateTimeFormatter.testParseInto_monthDay_feb29_newYork(TestDateTimeFormatter.java:923)

testParseInto_monthDay_feb29_newYork_startOfYear(org.joda.time.format.TestDateTimeFormatter)  Time elapsed: 0.001 sec  <<< ERROR!
java.lang.StringIndexOutOfBoundsException: String index out of range: 3
	at java.lang.String.charAt(String.java:658)
	at org.joda.time.format.DateTimeFormat.parseToken(DateTimeFormat.java:130)
	at org.joda.time.format.DateTimeFormat.parsePatternTo(DateTimeFormat.java:54)
	at org.joda.time.format.DateTimeFormat.createFormatterForPattern(DateTimeFormat.java:155)
	at org.joda.time.format.DateTimeFormat.forPattern(DateTimeFormat.java:30)
	at org.joda.time.format.TestDateTimeFormatter.testParseInto_monthDay_feb29_newYork_startOfYear(TestDateTimeFormatter.java:930)

testParseInto_monthDay_feb29_newYork_endOfYear(org.joda.time.format.TestDateTimeFormatter)  Time elapsed: 0 sec  <<< ERROR!
java.lang.StringIndexOutOfBoundsException: String index out of range: 3
	at java.lang.String.charAt(String.java:658)
	at org.joda.time.format.DateTimeFormat.parseToken(DateTimeFormat.java:130)
	at org.joda.time.format.DateTimeFormat.parsePatternTo(DateTimeFormat.java:54)
	at org.joda.time.format.DateTimeFormat.createFormatterForPattern(DateTimeFormat.java:155)
	at org.joda.time.format.DateTimeFormat.forPattern(DateTimeFormat.java:30)
	at org.joda.time.format.TestDateTimeFormatter.testParseInto_monthDay_feb29_newYork_endOfYear(TestDateTimeFormatter.java:937)

testParseInto_monthDay_feb29_tokyo(org.joda.time.format.TestDateTimeFormatter)  Time elapsed: 0 sec  <<< ERROR!
java.lang.StringIndexOutOfBoundsException: String index out of range: 3
	at java.lang.String.charAt(String.java:658)
	at org.joda.time.format.DateTimeFormat.parseToken(DateTimeFormat.java:130)
	at org.joda.time.format.DateTimeFormat.parsePatternTo(DateTimeFormat.java:54)
	at org.joda.time.format.DateTimeFormat.createFormatterForPattern(DateTimeFormat.java:155)
	at org.joda.time.format.DateTimeFormat.forPattern(DateTimeFormat.java:30)
	at org.joda.time.format.TestDateTimeFormatter.testParseInto_monthDay_feb29_tokyo(TestDateTimeFormatter.java:944)

testParseInto_monthDay_feb29_tokyo_startOfYear(org.joda.time.format.TestDateTimeFormatter)  Time elapsed: 0.001 sec  <<< ERROR!
java.lang.StringIndexOutOfBoundsException: String index out of range: 3
	at java.lang.String.charAt(String.java:658)
	at org.joda.time.format.DateTimeFormat.parseToken(DateTimeFormat.java:130)
	at org.joda.time.format.DateTimeFormat.parsePatternTo(DateTimeFormat.java:54)
	at org.joda.time.format.DateTimeFormat.createFormatterForPattern(DateTimeFormat.java:155)
	at org.joda.time.format.DateTimeFormat.forPattern(DateTimeFormat.java:30)
	at org.joda.time.format.TestDateTimeFormatter.testParseInto_monthDay_feb29_tokyo_startOfYear(TestDateTimeFormatter.java:951)

testParseInto_monthDay_feb29_tokyo_endOfYear(org.joda.time.format.TestDateTimeFormatter)  Time elapsed: 0 sec  <<< ERROR!
java.lang.StringIndexOutOfBoundsException: String index out of range: 3
	at java.lang.String.charAt(String.java:658)
	at org.joda.time.format.DateTimeFormat.parseToken(DateTimeFormat.java:130)
	at org.joda.time.format.DateTimeFormat.parsePatternTo(DateTimeFormat.java:54)
	at org.joda.time.format.DateTimeFormat.createFormatterForPattern(DateTimeFormat.java:155)
	at org.joda.time.format.DateTimeFormat.forPattern(DateTimeFormat.java:30)
	at org.joda.time.format.TestDateTimeFormatter.testParseInto_monthDay_feb29_tokyo_endOfYear(TestDateTimeFormatter.java:958)

testParseInto_monthDay_withDefaultYear_feb29(org.joda.time.format.TestDateTimeFormatter)  Time elapsed: 0.001 sec  <<< ERROR!
java.lang.StringIndexOutOfBoundsException: String index out of range: 3
	at java.lang.String.charAt(String.java:658)
	at org.joda.time.format.DateTimeFormat.parseToken(DateTimeFormat.java:130)
	at org.joda.time.format.DateTimeFormat.parsePatternTo(DateTimeFormat.java:54)
	at org.joda.time.format.DateTimeFormat.createFormatterForPattern(DateTimeFormat.java:155)
	at org.joda.time.format.DateTimeFormat.forPattern(DateTimeFormat.java:30)
	at org.joda.time.format.TestDateTimeFormatter.testParseInto_monthDay_withDefaultYear_feb29(TestDateTimeFormatter.java:965)

testParseInto_monthDay_withDefaultYear_feb29_newYork(org.joda.time.format.TestDateTimeFormatter)  Time elapsed: 0 sec  <<< ERROR!
java.lang.StringIndexOutOfBoundsException: String index out of range: 3
	at java.lang.String.charAt(String.java:658)
	at org.joda.time.format.DateTimeFormat.parseToken(DateTimeFormat.java:130)
	at org.joda.time.format.DateTimeFormat.parsePatternTo(DateTimeFormat.java:54)
	at org.joda.time.format.DateTimeFormat.createFormatterForPattern(DateTimeFormat.java:155)
	at org.joda.time.format.DateTimeFormat.forPattern(DateTimeFormat.java:30)
	at org.joda.time.format.TestDateTimeFormatter.testParseInto_monthDay_withDefaultYear_feb29_newYork(TestDateTimeFormatter.java:972)

testParseInto_monthDay_withDefaultYear_feb29_newYork_endOfYear(org.joda.time.format.TestDateTimeFormatter)  Time elapsed: 0 sec  <<< ERROR!
java.lang.StringIndexOutOfBoundsException: String index out of range: 3
	at java.lang.String.charAt(String.java:658)
	at org.joda.time.format.DateTimeFormat.parseToken(DateTimeFormat.java:130)
	at org.joda.time.format.DateTimeFormat.parsePatternTo(DateTimeFormat.java:54)
	at org.joda.time.format.DateTimeFormat.createFormatterForPattern(DateTimeFormat.java:155)
	at org.joda.time.format.DateTimeFormat.forPattern(DateTimeFormat.java:30)
	at org.joda.time.format.TestDateTimeFormatter.testParseInto_monthDay_withDefaultYear_feb29_newYork_endOfYear(TestDateTimeFormatter.java:979)

testParseLocalDate_yearOfEra(org.joda.time.format.TestDateTimeFormatter)  Time elapsed: 0.001 sec  <<< ERROR!
java.lang.StringIndexOutOfBoundsException: String index out of range: 10
	at java.lang.String.charAt(String.java:658)
	at org.joda.time.format.DateTimeFormat.parseToken(DateTimeFormat.java:130)
	at org.joda.time.format.DateTimeFormat.parsePatternTo(DateTimeFormat.java:54)
	at org.joda.time.format.DateTimeFormat.createFormatterForPattern(DateTimeFormat.java:155)
	at org.joda.time.format.DateTimeFormat.forPattern(DateTimeFormat.java:30)
	at org.joda.time.format.TestDateTimeFormatter.testParseLocalDate_yearOfEra(TestDateTimeFormatter.java:378)

testParseLocalDate_yearOfCentury(org.joda.time.format.TestDateTimeFormatter)  Time elapsed: 0.001 sec  <<< ERROR!
java.lang.StringIndexOutOfBoundsException: String index out of range: 6
	at java.lang.String.charAt(String.java:658)
	at org.joda.time.format.DateTimeFormat.parseToken(DateTimeFormat.java:130)
	at org.joda.time.format.DateTimeFormat.parsePatternTo(DateTimeFormat.java:54)
	at org.joda.time.format.DateTimeFormat.createFormatterForPattern(DateTimeFormat.java:155)
	at org.joda.time.format.DateTimeFormat.forPattern(DateTimeFormat.java:30)
	at org.joda.time.format.TestDateTimeFormatter.testParseLocalDate_yearOfCentury(TestDateTimeFormatter.java:394)

testParseLocalDate_monthDay_feb29(org.joda.time.format.TestDateTimeFormatter)  Time elapsed: 0.001 sec  <<< ERROR!
java.lang.StringIndexOutOfBoundsException: String index out of range: 3
	at java.lang.String.charAt(String.java:658)
	at org.joda.time.format.DateTimeFormat.parseToken(DateTimeFormat.java:130)
	at org.joda.time.format.DateTimeFormat.parsePatternTo(DateTimeFormat.java:54)
	at org.joda.time.format.DateTimeFormat.createFormatterForPattern(DateTimeFormat.java:155)
	at org.joda.time.format.DateTimeFormat.forPattern(DateTimeFormat.java:30)
	at org.joda.time.format.TestDateTimeFormatter.testParseLocalDate_monthDay_feb29(TestDateTimeFormatter.java:406)

testParseLocalDate_monthDay_withDefaultYear_feb29(org.joda.time.format.TestDateTimeFormatter)  Time elapsed: 0.001 sec  <<< ERROR!
java.lang.StringIndexOutOfBoundsException: String index out of range: 3
	at java.lang.String.charAt(String.java:658)
	at org.joda.time.format.DateTimeFormat.parseToken(DateTimeFormat.java:130)
	at org.joda.time.format.DateTimeFormat.parsePatternTo(DateTimeFormat.java:54)
	at org.joda.time.format.DateTimeFormat.createFormatterForPattern(DateTimeFormat.java:155)
	at org.joda.time.format.DateTimeFormat.forPattern(DateTimeFormat.java:30)
	at org.joda.time.format.TestDateTimeFormatter.testParseLocalDate_monthDay_withDefaultYear_feb29(TestDateTimeFormatter.java:416)

testParseLocalDate_weekyear_month_week_2010(org.joda.time.format.TestDateTimeFormatter)  Time elapsed: 0 sec  <<< ERROR!
java.lang.StringIndexOutOfBoundsException: String index out of range: 10
	at java.lang.String.charAt(String.java:658)
	at org.joda.time.format.DateTimeFormat.parseToken(DateTimeFormat.java:130)
	at org.joda.time.format.DateTimeFormat.parsePatternTo(DateTimeFormat.java:54)
	at org.joda.time.format.DateTimeFormat.createFormatterForPattern(DateTimeFormat.java:155)
	at org.joda.time.format.DateTimeFormat.forPattern(DateTimeFormat.java:30)
	at org.joda.time.format.TestDateTimeFormatter.testParseLocalDate_weekyear_month_week_2010(TestDateTimeFormatter.java:427)

testParseLocalDate_weekyear_month_week_2011(org.joda.time.format.TestDateTimeFormatter)  Time elapsed: 0.001 sec  <<< ERROR!
java.lang.StringIndexOutOfBoundsException: String index out of range: 10
	at java.lang.String.charAt(String.java:658)
	at org.joda.time.format.DateTimeFormat.parseToken(DateTimeFormat.java:130)
	at org.joda.time.format.DateTimeFormat.parsePatternTo(DateTimeFormat.java:54)
	at org.joda.time.format.DateTimeFormat.createFormatterForPattern(DateTimeFormat.java:155)
	at org.joda.time.format.DateTimeFormat.forPattern(DateTimeFormat.java:30)
	at org.joda.time.format.TestDateTimeFormatter.testParseLocalDate_weekyear_month_week_2011(TestDateTimeFormatter.java:433)

testParseLocalDate_weekyear_month_week_2012(org.joda.time.format.TestDateTimeFormatter)  Time elapsed: 0.001 sec  <<< ERROR!
java.lang.StringIndexOutOfBoundsException: String index out of range: 10
	at java.lang.String.charAt(String.java:658)
	at org.joda.time.format.DateTimeFormat.parseToken(DateTimeFormat.java:130)
	at org.joda.time.format.DateTimeFormat.parsePatternTo(DateTimeFormat.java:54)
	at org.joda.time.format.DateTimeFormat.createFormatterForPattern(DateTimeFormat.java:155)
	at org.joda.time.format.DateTimeFormat.forPattern(DateTimeFormat.java:30)
	at org.joda.time.format.TestDateTimeFormatter.testParseLocalDate_weekyear_month_week_2012(TestDateTimeFormatter.java:439)

testParseLocalDate_year_month_week_2010(org.joda.time.format.TestDateTimeFormatter)  Time elapsed: 0 sec  <<< ERROR!
java.lang.StringIndexOutOfBoundsException: String index out of range: 10
	at java.lang.String.charAt(String.java:658)
	at org.joda.time.format.DateTimeFormat.parseToken(DateTimeFormat.java:130)
	at org.joda.time.format.DateTimeFormat.parsePatternTo(DateTimeFormat.java:54)
	at org.joda.time.format.DateTimeFormat.createFormatterForPattern(DateTimeFormat.java:155)
	at org.joda.time.format.DateTimeFormat.forPattern(DateTimeFormat.java:30)
	at org.joda.time.format.TestDateTimeFormatter.testParseLocalDate_year_month_week_2010(TestDateTimeFormatter.java:453)

testParseLocalDate_year_month_week_2011(org.joda.time.format.TestDateTimeFormatter)  Time elapsed: 0.001 sec  <<< ERROR!
java.lang.StringIndexOutOfBoundsException: String index out of range: 10
	at java.lang.String.charAt(String.java:658)
	at org.joda.time.format.DateTimeFormat.parseToken(DateTimeFormat.java:130)
	at org.joda.time.format.DateTimeFormat.parsePatternTo(DateTimeFormat.java:54)
	at org.joda.time.format.DateTimeFormat.createFormatterForPattern(DateTimeFormat.java:155)
	at org.joda.time.format.DateTimeFormat.forPattern(DateTimeFormat.java:30)
	at org.joda.time.format.TestDateTimeFormatter.testParseLocalDate_year_month_week_2011(TestDateTimeFormatter.java:459)

testParseLocalDate_year_month_week_2012(org.joda.time.format.TestDateTimeFormatter)  Time elapsed: 0 sec  <<< ERROR!
java.lang.StringIndexOutOfBoundsException: String index out of range: 10
	at java.lang.String.charAt(String.java:658)
	at org.joda.time.format.DateTimeFormat.parseToken(DateTimeFormat.java:130)
	at org.joda.time.format.DateTimeFormat.parsePatternTo(DateTimeFormat.java:54)
	at org.joda.time.format.DateTimeFormat.createFormatterForPattern(DateTimeFormat.java:155)
	at org.joda.time.format.DateTimeFormat.forPattern(DateTimeFormat.java:30)
	at org.joda.time.format.TestDateTimeFormatter.testParseLocalDate_year_month_week_2012(TestDateTimeFormatter.java:465)

testZoneNameNearTransition(org.joda.time.format.TestDateTimeFormatter)  Time elapsed: 0.001 sec  <<< ERROR!
java.lang.StringIndexOutOfBoundsException: String index out of range: 25
	at java.lang.String.charAt(String.java:658)
	at org.joda.time.format.DateTimeFormat.parseToken(DateTimeFormat.java:130)
	at org.joda.time.format.DateTimeFormat.parsePatternTo(DateTimeFormat.java:54)
	at org.joda.time.format.DateTimeFormat.createFormatterForPattern(DateTimeFormat.java:155)
	at org.joda.time.format.DateTimeFormat.forPattern(DateTimeFormat.java:30)
	at org.joda.time.format.TestDateTimeFormatter.testZoneNameNearTransition(TestDateTimeFormatter.java:1002)

testZoneShortNameNearTransition(org.joda.time.format.TestDateTimeFormatter)  Time elapsed: 0.001 sec  <<< ERROR!
java.lang.StringIndexOutOfBoundsException: String index out of range: 22
	at java.lang.String.charAt(String.java:658)
	at org.joda.time.format.DateTimeFormat.parseToken(DateTimeFormat.java:130)
	at org.joda.time.format.DateTimeFormat.parsePatternTo(DateTimeFormat.java:54)
	at org.joda.time.format.DateTimeFormat.createFormatterForPattern(DateTimeFormat.java:155)
	at org.joda.time.format.DateTimeFormat.forPattern(DateTimeFormat.java:30)
	at org.joda.time.format.TestDateTimeFormatter.testZoneShortNameNearTransition(TestDateTimeFormatter.java:1018)

testParseLocalDate_year_month_week_2013(org.joda.time.format.TestDateTimeFormatter)  Time elapsed: 0 sec  <<< ERROR!
java.lang.StringIndexOutOfBoundsException: String index out of range: 10
	at java.lang.String.charAt(String.java:658)
	at org.joda.time.format.DateTimeFormat.parseToken(DateTimeFormat.java:130)
	at org.joda.time.format.DateTimeFormat.parsePatternTo(DateTimeFormat.java:54)
	at org.joda.time.format.DateTimeFormat.createFormatterForPattern(DateTimeFormat.java:155)
	at org.joda.time.format.DateTimeFormat.forPattern(DateTimeFormat.java:30)
	at org.joda.time.format.TestDateTimeFormatter.testParseLocalDate_year_month_week_2013(TestDateTimeFormatter.java:471)

testParseLocalDate_year_month_week_2014(org.joda.time.format.TestDateTimeFormatter)  Time elapsed: 0.001 sec  <<< ERROR!
java.lang.StringIndexOutOfBoundsException: String index out of range: 10
	at java.lang.String.charAt(String.java:658)
	at org.joda.time.format.DateTimeFormat.parseToken(DateTimeFormat.java:130)
	at org.joda.time.format.DateTimeFormat.parsePatternTo(DateTimeFormat.java:54)
	at org.joda.time.format.DateTimeFormat.createFormatterForPattern(DateTimeFormat.java:155)
	at org.joda.time.format.DateTimeFormat.forPattern(DateTimeFormat.java:30)
	at org.joda.time.format.TestDateTimeFormatter.testParseLocalDate_year_month_week_2014(TestDateTimeFormatter.java:477)

testParseLocalDate_year_month_week_2015(org.joda.time.format.TestDateTimeFormatter)  Time elapsed: 0.001 sec  <<< ERROR!
java.lang.StringIndexOutOfBoundsException: String index out of range: 10
	at java.lang.String.charAt(String.java:658)
	at org.joda.time.format.DateTimeFormat.parseToken(DateTimeFormat.java:130)
	at org.joda.time.format.DateTimeFormat.parsePatternTo(DateTimeFormat.java:54)
	at org.joda.time.format.DateTimeFormat.createFormatterForPattern(DateTimeFormat.java:155)
	at org.joda.time.format.DateTimeFormat.forPattern(DateTimeFormat.java:30)
	at org.joda.time.format.TestDateTimeFormatter.testParseLocalDate_year_month_week_2015(TestDateTimeFormatter.java:483)

testParseLocalDate_year_month_week_2016(org.joda.time.format.TestDateTimeFormatter)  Time elapsed: 0 sec  <<< ERROR!
java.lang.StringIndexOutOfBoundsException: String index out of range: 10
	at java.lang.String.charAt(String.java:658)
	at org.joda.time.format.DateTimeFormat.parseToken(DateTimeFormat.java:130)
	at org.joda.time.format.DateTimeFormat.parsePatternTo(DateTimeFormat.java:54)
	at org.joda.time.format.DateTimeFormat.createFormatterForPattern(DateTimeFormat.java:155)
	at org.joda.time.format.DateTimeFormat.forPattern(DateTimeFormat.java:30)
	at org.joda.time.format.TestDateTimeFormatter.testParseLocalDate_year_month_week_2016(TestDateTimeFormatter.java:489)

testParseLocalDateTime_monthDay_feb29(org.joda.time.format.TestDateTimeFormatter)  Time elapsed: 0.001 sec  <<< ERROR!
java.lang.StringIndexOutOfBoundsException: String index out of range: 7
	at java.lang.String.charAt(String.java:658)
	at org.joda.time.format.DateTimeFormat.parseToken(DateTimeFormat.java:130)
	at org.joda.time.format.DateTimeFormat.parsePatternTo(DateTimeFormat.java:54)
	at org.joda.time.format.DateTimeFormat.createFormatterForPattern(DateTimeFormat.java:155)
	at org.joda.time.format.DateTimeFormat.forPattern(DateTimeFormat.java:30)
	at org.joda.time.format.TestDateTimeFormatter.testParseLocalDateTime_monthDay_feb29(TestDateTimeFormatter.java:521)

testParseLocalDateTime_monthDay_withDefaultYear_feb29(org.joda.time.format.TestDateTimeFormatter)  Time elapsed: 0 sec  <<< ERROR!
java.lang.StringIndexOutOfBoundsException: String index out of range: 7
	at java.lang.String.charAt(String.java:658)
	at org.joda.time.format.DateTimeFormat.parseToken(DateTimeFormat.java:130)
	at org.joda.time.format.DateTimeFormat.parsePatternTo(DateTimeFormat.java:54)
	at org.joda.time.format.DateTimeFormat.createFormatterForPattern(DateTimeFormat.java:155)
	at org.joda.time.format.DateTimeFormat.forPattern(DateTimeFormat.java:30)
	at org.joda.time.format.TestDateTimeFormatter.testParseLocalDateTime_monthDay_withDefaultYear_feb29(TestDateTimeFormatter.java:531)

testFormat_era(org.joda.time.format.TestDateTimeFormat)  Time elapsed: 0 sec  <<< ERROR!
java.lang.StringIndexOutOfBoundsException: String index out of range: 1
	at java.lang.String.charAt(String.java:658)
	at org.joda.time.format.DateTimeFormat.parseToken(DateTimeFormat.java:130)
	at org.joda.time.format.DateTimeFormat.parsePatternTo(DateTimeFormat.java:54)
	at org.joda.time.format.DateTimeFormat.createFormatterForPattern(DateTimeFormat.java:155)
	at org.joda.time.format.DateTimeFormat.forPattern(DateTimeFormat.java:30)
	at org.joda.time.format.TestDateTimeFormat.testFormat_era(TestDateTimeFormat.java:101)

testFormat_dayOfYearText(org.joda.time.format.TestDateTimeFormat)  Time elapsed: 0.001 sec  <<< ERROR!
java.lang.StringIndexOutOfBoundsException: String index out of range: 1
	at java.lang.String.charAt(String.java:658)
	at org.joda.time.format.DateTimeFormat.parseToken(DateTimeFormat.java:130)
	at org.joda.time.format.DateTimeFormat.parsePatternTo(DateTimeFormat.java:54)
	at org.joda.time.format.DateTimeFormat.createFormatterForPattern(DateTimeFormat.java:155)
	at org.joda.time.format.DateTimeFormat.forPattern(DateTimeFormat.java:30)
	at org.joda.time.format.TestDateTimeFormat.testFormat_dayOfYearText(TestDateTimeFormat.java:556)

testFormat_monthOfYear(org.joda.time.format.TestDateTimeFormat)  Time elapsed: 0 sec  <<< ERROR!
java.lang.StringIndexOutOfBoundsException: String index out of range: 1
	at java.lang.String.charAt(String.java:658)
	at org.joda.time.format.DateTimeFormat.parseToken(DateTimeFormat.java:130)
	at org.joda.time.format.DateTimeFormat.parsePatternTo(DateTimeFormat.java:54)
	at org.joda.time.format.DateTimeFormat.createFormatterForPattern(DateTimeFormat.java:155)
	at org.joda.time.format.DateTimeFormat.forPattern(DateTimeFormat.java:30)
	at org.joda.time.format.TestDateTimeFormat.testFormat_monthOfYear(TestDateTimeFormat.java:569)

testFormat_monthOfYearShortText(org.joda.time.format.TestDateTimeFormat)  Time elapsed: 0.001 sec  <<< ERROR!
java.lang.StringIndexOutOfBoundsException: String index out of range: 3
	at java.lang.String.charAt(String.java:658)
	at org.joda.time.format.DateTimeFormat.parseToken(DateTimeFormat.java:130)
	at org.joda.time.format.DateTimeFormat.parsePatternTo(DateTimeFormat.java:54)
	at org.joda.time.format.DateTimeFormat.createFormatterForPattern(DateTimeFormat.java:155)
	at org.joda.time.format.DateTimeFormat.forPattern(DateTimeFormat.java:30)
	at org.joda.time.format.TestDateTimeFormat.testFormat_monthOfYearShortText(TestDateTimeFormat.java:582)

testFormat_monthOfYearText(org.joda.time.format.TestDateTimeFormat)  Time elapsed: 0 sec  <<< ERROR!
java.lang.StringIndexOutOfBoundsException: String index out of range: 4
	at java.lang.String.charAt(String.java:658)
	at org.joda.time.format.DateTimeFormat.parseToken(DateTimeFormat.java:130)
	at org.joda.time.format.DateTimeFormat.parsePatternTo(DateTimeFormat.java:54)
	at org.joda.time.format.DateTimeFormat.createFormatterForPattern(DateTimeFormat.java:155)
	at org.joda.time.format.DateTimeFormat.forPattern(DateTimeFormat.java:30)
	at org.joda.time.format.TestDateTimeFormat.testFormat_monthOfYearText(TestDateTimeFormat.java:598)

testFormat_dayOfMonth(org.joda.time.format.TestDateTimeFormat)  Time elapsed: 0.001 sec  <<< ERROR!
java.lang.StringIndexOutOfBoundsException: String index out of range: 1
	at java.lang.String.charAt(String.java:658)
	at org.joda.time.format.DateTimeFormat.parseToken(DateTimeFormat.java:130)
	at org.joda.time.format.DateTimeFormat.parsePatternTo(DateTimeFormat.java:54)
	at org.joda.time.format.DateTimeFormat.createFormatterForPattern(DateTimeFormat.java:155)
	at org.joda.time.format.DateTimeFormat.forPattern(DateTimeFormat.java:30)
	at org.joda.time.format.TestDateTimeFormat.testFormat_dayOfMonth(TestDateTimeFormat.java:614)

testFormat_halfdayOfDay(org.joda.time.format.TestDateTimeFormat)  Time elapsed: 0 sec  <<< ERROR!
java.lang.StringIndexOutOfBoundsException: String index out of range: 1
	at java.lang.String.charAt(String.java:658)
	at org.joda.time.format.DateTimeFormat.parseToken(DateTimeFormat.java:130)
	at org.joda.time.format.DateTimeFormat.parsePatternTo(DateTimeFormat.java:54)
	at org.joda.time.format.DateTimeFormat.createFormatterForPattern(DateTimeFormat.java:155)
	at org.joda.time.format.DateTimeFormat.forPattern(DateTimeFormat.java:30)
	at org.joda.time.format.TestDateTimeFormat.testFormat_halfdayOfDay(TestDateTimeFormat.java:627)

testFormat_hourOfHalfday(org.joda.time.format.TestDateTimeFormat)  Time elapsed: 0.001 sec  <<< ERROR!
java.lang.StringIndexOutOfBoundsException: String index out of range: 1
	at java.lang.String.charAt(String.java:658)
	at org.joda.time.format.DateTimeFormat.parseToken(DateTimeFormat.java:130)
	at org.joda.time.format.DateTimeFormat.parsePatternTo(DateTimeFormat.java:54)
	at org.joda.time.format.DateTimeFormat.createFormatterForPattern(DateTimeFormat.java:155)
	at org.joda.time.format.DateTimeFormat.forPattern(DateTimeFormat.java:30)
	at org.joda.time.format.TestDateTimeFormat.testFormat_hourOfHalfday(TestDateTimeFormat.java:640)

testFormat_clockhourOfHalfday(org.joda.time.format.TestDateTimeFormat)  Time elapsed: 0 sec  <<< ERROR!
java.lang.StringIndexOutOfBoundsException: String index out of range: 1
	at java.lang.String.charAt(String.java:658)
	at org.joda.time.format.DateTimeFormat.parseToken(DateTimeFormat.java:130)
	at org.joda.time.format.DateTimeFormat.parsePatternTo(DateTimeFormat.java:54)
	at org.joda.time.format.DateTimeFormat.createFormatterForPattern(DateTimeFormat.java:155)
	at org.joda.time.format.DateTimeFormat.forPattern(DateTimeFormat.java:30)
	at org.joda.time.format.TestDateTimeFormat.testFormat_clockhourOfHalfday(TestDateTimeFormat.java:656)

testFormat_hourOfDay(org.joda.time.format.TestDateTimeFormat)  Time elapsed: 0.001 sec  <<< ERROR!
java.lang.StringIndexOutOfBoundsException: String index out of range: 1
	at java.lang.String.charAt(String.java:658)
	at org.joda.time.format.DateTimeFormat.parseToken(DateTimeFormat.java:130)
	at org.joda.time.format.DateTimeFormat.parsePatternTo(DateTimeFormat.java:54)
	at org.joda.time.format.DateTimeFormat.createFormatterForPattern(DateTimeFormat.java:155)
	at org.joda.time.format.DateTimeFormat.forPattern(DateTimeFormat.java:30)
	at org.joda.time.format.TestDateTimeFormat.testFormat_hourOfDay(TestDateTimeFormat.java:672)

testFormat_clockhourOfDay(org.joda.time.format.TestDateTimeFormat)  Time elapsed: 0.001 sec  <<< ERROR!
java.lang.StringIndexOutOfBoundsException: String index out of range: 1
	at java.lang.String.charAt(String.java:658)
	at org.joda.time.format.DateTimeFormat.parseToken(DateTimeFormat.java:130)
	at org.joda.time.format.DateTimeFormat.parsePatternTo(DateTimeFormat.java:54)
	at org.joda.time.format.DateTimeFormat.createFormatterForPattern(DateTimeFormat.java:155)
	at org.joda.time.format.DateTimeFormat.forPattern(DateTimeFormat.java:30)
	at org.joda.time.format.TestDateTimeFormat.testFormat_clockhourOfDay(TestDateTimeFormat.java:688)

testFormat_minute(org.joda.time.format.TestDateTimeFormat)  Time elapsed: 0 sec  <<< ERROR!
java.lang.StringIndexOutOfBoundsException: String index out of range: 1
	at java.lang.String.charAt(String.java:658)
	at org.joda.time.format.DateTimeFormat.parseToken(DateTimeFormat.java:130)
	at org.joda.time.format.DateTimeFormat.parsePatternTo(DateTimeFormat.java:54)
	at org.joda.time.format.DateTimeFormat.createFormatterForPattern(DateTimeFormat.java:155)
	at org.joda.time.format.DateTimeFormat.forPattern(DateTimeFormat.java:30)
	at org.joda.time.format.TestDateTimeFormat.testFormat_minute(TestDateTimeFormat.java:704)

testFormat_second(org.joda.time.format.TestDateTimeFormat)  Time elapsed: 0.001 sec  <<< ERROR!
java.lang.StringIndexOutOfBoundsException: String index out of range: 1
	at java.lang.String.charAt(String.java:658)
	at org.joda.time.format.DateTimeFormat.parseToken(DateTimeFormat.java:130)
	at org.joda.time.format.DateTimeFormat.parsePatternTo(DateTimeFormat.java:54)
	at org.joda.time.format.DateTimeFormat.createFormatterForPattern(DateTimeFormat.java:155)
	at org.joda.time.format.DateTimeFormat.forPattern(DateTimeFormat.java:30)
	at org.joda.time.format.TestDateTimeFormat.testFormat_second(TestDateTimeFormat.java:717)

testFormatParse_textMonthAtEnd_France(org.joda.time.format.TestDateTimeFormat)  Time elapsed: 0 sec  <<< ERROR!
java.lang.StringIndexOutOfBoundsException: String index out of range: 6
	at java.lang.String.charAt(String.java:658)
	at org.joda.time.format.DateTimeFormat.parseToken(DateTimeFormat.java:130)
	at org.joda.time.format.DateTimeFormat.parsePatternTo(DateTimeFormat.java:54)
	at org.joda.time.format.DateTimeFormat.createFormatterForPattern(DateTimeFormat.java:155)
	at org.joda.time.format.DateTimeFormat.forPattern(DateTimeFormat.java:30)
	at org.joda.time.format.TestDateTimeFormat.testFormatParse_textMonthAtEnd_France(TestDateTimeFormat.java:968)

testFormatParse_textMonthAtEnd_France_withSpecifiedDefault(org.joda.time.format.TestDateTimeFormat)  Time elapsed: 0.001 sec  <<< ERROR!
java.lang.StringIndexOutOfBoundsException: String index out of range: 6
	at java.lang.String.charAt(String.java:658)
	at org.joda.time.format.DateTimeFormat.parseToken(DateTimeFormat.java:130)
	at org.joda.time.format.DateTimeFormat.parsePatternTo(DateTimeFormat.java:54)
	at org.joda.time.format.DateTimeFormat.createFormatterForPattern(DateTimeFormat.java:155)
	at org.joda.time.format.DateTimeFormat.forPattern(DateTimeFormat.java:30)
	at org.joda.time.format.TestDateTimeFormat.testFormatParse_textMonthAtEnd_France_withSpecifiedDefault(TestDateTimeFormat.java:978)

testFormatParse_textMonthApr_Korean(org.joda.time.format.TestDateTimeFormat)  Time elapsed: 0 sec  <<< ERROR!
java.lang.StringIndexOutOfBoundsException: String index out of range: 23
	at java.lang.String.charAt(String.java:658)
	at org.joda.time.format.DateTimeFormat.parseToken(DateTimeFormat.java:130)
	at org.joda.time.format.DateTimeFormat.parsePatternTo(DateTimeFormat.java:54)
	at org.joda.time.format.DateTimeFormat.createFormatterForPattern(DateTimeFormat.java:155)
	at org.joda.time.format.DateTimeFormat.forPattern(DateTimeFormat.java:30)
	at org.joda.time.format.TestDateTimeFormat.testFormatParse_textMonthApr_Korean(TestDateTimeFormat.java:988)

testFormatParse_zoneId_noColon(org.joda.time.format.TestDateTimeFormat)  Time elapsed: 0.001 sec  <<< ERROR!
java.lang.StringIndexOutOfBoundsException: String index out of range: 7
	at java.lang.String.charAt(String.java:658)
	at org.joda.time.format.DateTimeFormat.parseToken(DateTimeFormat.java:130)
	at org.joda.time.format.DateTimeFormat.parsePatternTo(DateTimeFormat.java:54)
	at org.joda.time.format.DateTimeFormat.createFormatterForPattern(DateTimeFormat.java:155)
	at org.joda.time.format.DateTimeFormat.forPattern(DateTimeFormat.java:30)
	at org.joda.time.format.TestDateTimeFormat.testFormatParse_zoneId_noColon(TestDateTimeFormat.java:1140)

testFormatParse_zoneId_noColon_parseZ(org.joda.time.format.TestDateTimeFormat)  Time elapsed: 0 sec  <<< ERROR!
java.lang.StringIndexOutOfBoundsException: String index out of range: 7
	at java.lang.String.charAt(String.java:658)
	at org.joda.time.format.DateTimeFormat.parseToken(DateTimeFormat.java:130)
	at org.joda.time.format.DateTimeFormat.parsePatternTo(DateTimeFormat.java:54)
	at org.joda.time.format.DateTimeFormat.createFormatterForPattern(DateTimeFormat.java:155)
	at org.joda.time.format.DateTimeFormat.forPattern(DateTimeFormat.java:30)
	at org.joda.time.format.TestDateTimeFormat.testFormatParse_zoneId_noColon_parseZ(TestDateTimeFormat.java:1149)

testFormatParse_zoneId_colon(org.joda.time.format.TestDateTimeFormat)  Time elapsed: 0.001 sec  <<< ERROR!
java.lang.StringIndexOutOfBoundsException: String index out of range: 8
	at java.lang.String.charAt(String.java:658)
	at org.joda.time.format.DateTimeFormat.parseToken(DateTimeFormat.java:130)
	at org.joda.time.format.DateTimeFormat.parsePatternTo(DateTimeFormat.java:54)
	at org.joda.time.format.DateTimeFormat.createFormatterForPattern(DateTimeFormat.java:155)
	at org.joda.time.format.DateTimeFormat.forPattern(DateTimeFormat.java:30)
	at org.joda.time.format.TestDateTimeFormat.testFormatParse_zoneId_colon(TestDateTimeFormat.java:1156)

testFormatParse_zoneId_colon_parseZ(org.joda.time.format.TestDateTimeFormat)  Time elapsed: 0 sec  <<< ERROR!
java.lang.StringIndexOutOfBoundsException: String index out of range: 8
	at java.lang.String.charAt(String.java:658)
	at org.joda.time.format.DateTimeFormat.parseToken(DateTimeFormat.java:130)
	at org.joda.time.format.DateTimeFormat.parsePatternTo(DateTimeFormat.java:54)
	at org.joda.time.format.DateTimeFormat.createFormatterForPattern(DateTimeFormat.java:155)
	at org.joda.time.format.DateTimeFormat.forPattern(DateTimeFormat.java:30)
	at org.joda.time.format.TestDateTimeFormat.testFormatParse_zoneId_colon_parseZ(TestDateTimeFormat.java:1165)

testFormat_fractionOfSecond(org.joda.time.format.TestDateTimeFormat)  Time elapsed: 0.001 sec  <<< ERROR!
java.lang.StringIndexOutOfBoundsException: String index out of range: 3
	at java.lang.String.charAt(String.java:658)
	at org.joda.time.format.DateTimeFormat.parseToken(DateTimeFormat.java:130)
	at org.joda.time.format.DateTimeFormat.parsePatternTo(DateTimeFormat.java:54)
	at org.joda.time.format.DateTimeFormat.createFormatterForPattern(DateTimeFormat.java:155)
	at org.joda.time.format.DateTimeFormat.forPattern(DateTimeFormat.java:30)
	at org.joda.time.format.TestDateTimeFormat.testFormat_fractionOfSecond(TestDateTimeFormat.java:730)

testFormat_fractionOfSecondLong(org.joda.time.format.TestDateTimeFormat)  Time elapsed: 0 sec  <<< ERROR!
java.lang.StringIndexOutOfBoundsException: String index out of range: 6
	at java.lang.String.charAt(String.java:658)
	at org.joda.time.format.DateTimeFormat.parseToken(DateTimeFormat.java:130)
	at org.joda.time.format.DateTimeFormat.parsePatternTo(DateTimeFormat.java:54)
	at org.joda.time.format.DateTimeFormat.createFormatterForPattern(DateTimeFormat.java:155)
	at org.joda.time.format.DateTimeFormat.forPattern(DateTimeFormat.java:30)
	at org.joda.time.format.TestDateTimeFormat.testFormat_fractionOfSecondLong(TestDateTimeFormat.java:743)

testFormat_zoneText(org.joda.time.format.TestDateTimeFormat)  Time elapsed: 0.001 sec  <<< ERROR!
java.lang.StringIndexOutOfBoundsException: String index out of range: 1
	at java.lang.String.charAt(String.java:658)
	at org.joda.time.format.DateTimeFormat.parseToken(DateTimeFormat.java:130)
	at org.joda.time.format.DateTimeFormat.parsePatternTo(DateTimeFormat.java:54)
	at org.joda.time.format.DateTimeFormat.createFormatterForPattern(DateTimeFormat.java:155)
	at org.joda.time.format.DateTimeFormat.forPattern(DateTimeFormat.java:30)
	at org.joda.time.format.TestDateTimeFormat.testFormat_zoneText(TestDateTimeFormat.java:756)

testFormat_zoneLongText(org.joda.time.format.TestDateTimeFormat)  Time elapsed: 0 sec  <<< ERROR!
java.lang.StringIndexOutOfBoundsException: String index out of range: 4
	at java.lang.String.charAt(String.java:658)
	at org.joda.time.format.DateTimeFormat.parseToken(DateTimeFormat.java:130)
	at org.joda.time.format.DateTimeFormat.parsePatternTo(DateTimeFormat.java:54)
	at org.joda.time.format.DateTimeFormat.createFormatterForPattern(DateTimeFormat.java:155)
	at org.joda.time.format.DateTimeFormat.forPattern(DateTimeFormat.java:30)
	at org.joda.time.format.TestDateTimeFormat.testFormat_zoneLongText(TestDateTimeFormat.java:768)

testFormat_zoneAmount(org.joda.time.format.TestDateTimeFormat)  Time elapsed: 0.001 sec  <<< ERROR!
java.lang.StringIndexOutOfBoundsException: String index out of range: 1
	at java.lang.String.charAt(String.java:658)
	at org.joda.time.format.DateTimeFormat.parseToken(DateTimeFormat.java:130)
	at org.joda.time.format.DateTimeFormat.parsePatternTo(DateTimeFormat.java:54)
	at org.joda.time.format.DateTimeFormat.createFormatterForPattern(DateTimeFormat.java:155)
	at org.joda.time.format.DateTimeFormat.forPattern(DateTimeFormat.java:30)
	at org.joda.time.format.TestDateTimeFormat.testFormat_zoneAmount(TestDateTimeFormat.java:781)

testFormat_zoneAmountColon(org.joda.time.format.TestDateTimeFormat)  Time elapsed: 0 sec  <<< ERROR!
java.lang.StringIndexOutOfBoundsException: String index out of range: 2
	at java.lang.String.charAt(String.java:658)
	at org.joda.time.format.DateTimeFormat.parseToken(DateTimeFormat.java:130)
	at org.joda.time.format.DateTimeFormat.parsePatternTo(DateTimeFormat.java:54)
	at org.joda.time.format.DateTimeFormat.createFormatterForPattern(DateTimeFormat.java:155)
	at org.joda.time.format.DateTimeFormat.forPattern(DateTimeFormat.java:30)
	at org.joda.time.format.TestDateTimeFormat.testFormat_zoneAmountColon(TestDateTimeFormat.java:793)

testFormat_zoneAmountID(org.joda.time.format.TestDateTimeFormat)  Time elapsed: 0.001 sec  <<< ERROR!
java.lang.StringIndexOutOfBoundsException: String index out of range: 3
	at java.lang.String.charAt(String.java:658)
	at org.joda.time.format.DateTimeFormat.parseToken(DateTimeFormat.java:130)
	at org.joda.time.format.DateTimeFormat.parsePatternTo(DateTimeFormat.java:54)
	at org.joda.time.format.DateTimeFormat.createFormatterForPattern(DateTimeFormat.java:155)
	at org.joda.time.format.DateTimeFormat.forPattern(DateTimeFormat.java:30)
	at org.joda.time.format.TestDateTimeFormat.testFormat_zoneAmountID(TestDateTimeFormat.java:805)

testFormat_invalid(org.joda.time.format.TestDateTimeFormat)  Time elapsed: 0.001 sec  <<< ERROR!
java.lang.StringIndexOutOfBoundsException: String index out of range: 1
	at java.lang.String.charAt(String.java:658)
	at org.joda.time.format.DateTimeFormat.parseToken(DateTimeFormat.java:130)
	at org.joda.time.format.DateTimeFormat.parsePatternTo(DateTimeFormat.java:54)
	at org.joda.time.format.DateTimeFormat.createFormatterForPattern(DateTimeFormat.java:155)
	at org.joda.time.format.DateTimeFormat.forPattern(DateTimeFormat.java:30)
	at org.joda.time.format.TestDateTimeFormat.testFormat_invalid(TestDateTimeFormat.java:832)

testFormat_samples(org.joda.time.format.TestDateTimeFormat)  Time elapsed: 0 sec  <<< ERROR!
java.lang.StringIndexOutOfBoundsException: String index out of range: 19
	at java.lang.String.charAt(String.java:658)
	at org.joda.time.format.DateTimeFormat.parseToken(DateTimeFormat.java:130)
	at org.joda.time.format.DateTimeFormat.parsePatternTo(DateTimeFormat.java:54)
	at org.joda.time.format.DateTimeFormat.createFormatterForPattern(DateTimeFormat.java:155)
	at org.joda.time.format.DateTimeFormat.forPattern(DateTimeFormat.java:30)
	at org.joda.time.format.TestDateTimeFormat.testFormat_samples(TestDateTimeFormat.java:843)

testFormat_shortBasicParse(org.joda.time.format.TestDateTimeFormat)  Time elapsed: 0.001 sec  <<< ERROR!
java.lang.StringIndexOutOfBoundsException: String index out of range: 6
	at java.lang.String.charAt(String.java:658)
	at org.joda.time.format.DateTimeFormat.parseToken(DateTimeFormat.java:130)
	at org.joda.time.format.DateTimeFormat.parsePatternTo(DateTimeFormat.java:54)
	at org.joda.time.format.DateTimeFormat.createFormatterForPattern(DateTimeFormat.java:155)
	at org.joda.time.format.DateTimeFormat.forPattern(DateTimeFormat.java:30)
	at org.joda.time.format.TestDateTimeFormat.testFormat_shortBasicParse(TestDateTimeFormat.java:853)

testParse_pivotYear(org.joda.time.format.TestDateTimeFormat)  Time elapsed: 0 sec  <<< ERROR!
java.lang.StringIndexOutOfBoundsException: String index out of range: 8
	at java.lang.String.charAt(String.java:658)
	at org.joda.time.format.DateTimeFormat.parseToken(DateTimeFormat.java:130)
	at org.joda.time.format.DateTimeFormat.parsePatternTo(DateTimeFormat.java:54)
	at org.joda.time.format.DateTimeFormat.createFormatterForPattern(DateTimeFormat.java:155)
	at org.joda.time.format.DateTimeFormat.forPattern(DateTimeFormat.java:30)
	at org.joda.time.format.TestDateTimeFormat.testParse_pivotYear(TestDateTimeFormat.java:867)

testParse_pivotYear_ignored4DigitYear(org.joda.time.format.TestDateTimeFormat)  Time elapsed: 0 sec  <<< ERROR!
java.lang.StringIndexOutOfBoundsException: String index out of range: 10
	at java.lang.String.charAt(String.java:658)
	at org.joda.time.format.DateTimeFormat.parseToken(DateTimeFormat.java:130)
	at org.joda.time.format.DateTimeFormat.parsePatternTo(DateTimeFormat.java:54)
	at org.joda.time.format.DateTimeFormat.createFormatterForPattern(DateTimeFormat.java:155)
	at org.joda.time.format.DateTimeFormat.forPattern(DateTimeFormat.java:30)
	at org.joda.time.format.TestDateTimeFormat.testParse_pivotYear_ignored4DigitYear(TestDateTimeFormat.java:880)

testFormatParse_textMonthJanShort_UK(org.joda.time.format.TestDateTimeFormat)  Time elapsed: 0.001 sec  <<< ERROR!
java.lang.StringIndexOutOfBoundsException: String index out of range: 11
	at java.lang.String.charAt(String.java:658)
	at org.joda.time.format.DateTimeFormat.parseToken(DateTimeFormat.java:130)
	at org.joda.time.format.DateTimeFormat.parsePatternTo(DateTimeFormat.java:54)
	at org.joda.time.format.DateTimeFormat.createFormatterForPattern(DateTimeFormat.java:155)
	at org.joda.time.format.DateTimeFormat.forPattern(DateTimeFormat.java:30)
	at org.joda.time.format.TestDateTimeFormat.testFormatParse_textMonthJanShort_UK(TestDateTimeFormat.java:894)

testFormatParse_textMonthJanShortLowerCase_UK(org.joda.time.format.TestDateTimeFormat)  Time elapsed: 0 sec  <<< ERROR!
java.lang.StringIndexOutOfBoundsException: String index out of range: 11
	at java.lang.String.charAt(String.java:658)
	at org.joda.time.format.DateTimeFormat.parseToken(DateTimeFormat.java:130)
	at org.joda.time.format.DateTimeFormat.parsePatternTo(DateTimeFormat.java:54)
	at org.joda.time.format.DateTimeFormat.createFormatterForPattern(DateTimeFormat.java:155)
	at org.joda.time.format.DateTimeFormat.forPattern(DateTimeFormat.java:30)
	at org.joda.time.format.TestDateTimeFormat.testFormatParse_textMonthJanShortLowerCase_UK(TestDateTimeFormat.java:904)

testFormatParse_textMonthJanShortUpperCase_UK(org.joda.time.format.TestDateTimeFormat)  Time elapsed: 0 sec  <<< ERROR!
java.lang.StringIndexOutOfBoundsException: String index out of range: 11
	at java.lang.String.charAt(String.java:658)
	at org.joda.time.format.DateTimeFormat.parseToken(DateTimeFormat.java:130)
	at org.joda.time.format.DateTimeFormat.parsePatternTo(DateTimeFormat.java:54)
	at org.joda.time.format.DateTimeFormat.createFormatterForPattern(DateTimeFormat.java:155)
	at org.joda.time.format.DateTimeFormat.forPattern(DateTimeFormat.java:30)
	at org.joda.time.format.TestDateTimeFormat.testFormatParse_textMonthJanShortUpperCase_UK(TestDateTimeFormat.java:911)

testParse_textMonthJanLong_UK(org.joda.time.format.TestDateTimeFormat)  Time elapsed: 0.001 sec  <<< ERROR!
java.lang.StringIndexOutOfBoundsException: String index out of range: 11
	at java.lang.String.charAt(String.java:658)
	at org.joda.time.format.DateTimeFormat.parseToken(DateTimeFormat.java:130)
	at org.joda.time.format.DateTimeFormat.parsePatternTo(DateTimeFormat.java:54)
	at org.joda.time.format.DateTimeFormat.createFormatterForPattern(DateTimeFormat.java:155)
	at org.joda.time.format.DateTimeFormat.forPattern(DateTimeFormat.java:30)
	at org.joda.time.format.TestDateTimeFormat.testParse_textMonthJanLong_UK(TestDateTimeFormat.java:918)

testFormatParse_textMonthJanLongLowerCase_UK(org.joda.time.format.TestDateTimeFormat)  Time elapsed: 0 sec  <<< ERROR!
java.lang.StringIndexOutOfBoundsException: String index out of range: 11
	at java.lang.String.charAt(String.java:658)
	at org.joda.time.format.DateTimeFormat.parseToken(DateTimeFormat.java:130)
	at org.joda.time.format.DateTimeFormat.parsePatternTo(DateTimeFormat.java:54)
	at org.joda.time.format.DateTimeFormat.createFormatterForPattern(DateTimeFormat.java:155)
	at org.joda.time.format.DateTimeFormat.forPattern(DateTimeFormat.java:30)
	at org.joda.time.format.TestDateTimeFormat.testFormatParse_textMonthJanLongLowerCase_UK(TestDateTimeFormat.java:926)

testFormatParse_textMonthJanLongUpperCase_UK(org.joda.time.format.TestDateTimeFormat)  Time elapsed: 0 sec  <<< ERROR!
java.lang.StringIndexOutOfBoundsException: String index out of range: 11
	at java.lang.String.charAt(String.java:658)
	at org.joda.time.format.DateTimeFormat.parseToken(DateTimeFormat.java:130)
	at org.joda.time.format.DateTimeFormat.parsePatternTo(DateTimeFormat.java:54)
	at org.joda.time.format.DateTimeFormat.createFormatterForPattern(DateTimeFormat.java:155)
	at org.joda.time.format.DateTimeFormat.forPattern(DateTimeFormat.java:30)
	at org.joda.time.format.TestDateTimeFormat.testFormatParse_textMonthJanLongUpperCase_UK(TestDateTimeFormat.java:933)

testFormatParse_textMonthJanShort_France(org.joda.time.format.TestDateTimeFormat)  Time elapsed: 0.001 sec  <<< ERROR!
java.lang.StringIndexOutOfBoundsException: String index out of range: 11
	at java.lang.String.charAt(String.java:658)
	at org.joda.time.format.DateTimeFormat.parseToken(DateTimeFormat.java:130)
	at org.joda.time.format.DateTimeFormat.parsePatternTo(DateTimeFormat.java:54)
	at org.joda.time.format.DateTimeFormat.createFormatterForPattern(DateTimeFormat.java:155)
	at org.joda.time.format.DateTimeFormat.forPattern(DateTimeFormat.java:30)
	at org.joda.time.format.TestDateTimeFormat.testFormatParse_textMonthJanShort_France(TestDateTimeFormat.java:940)

testFormatParse_textMonthJanLong_France(org.joda.time.format.TestDateTimeFormat)  Time elapsed: 0 sec  <<< ERROR!
java.lang.StringIndexOutOfBoundsException: String index out of range: 11
	at java.lang.String.charAt(String.java:658)
	at org.joda.time.format.DateTimeFormat.parseToken(DateTimeFormat.java:130)
	at org.joda.time.format.DateTimeFormat.parsePatternTo(DateTimeFormat.java:54)
	at org.joda.time.format.DateTimeFormat.createFormatterForPattern(DateTimeFormat.java:155)
	at org.joda.time.format.DateTimeFormat.forPattern(DateTimeFormat.java:30)
	at org.joda.time.format.TestDateTimeFormat.testFormatParse_textMonthJanLong_France(TestDateTimeFormat.java:950)

testFormatParse_textMonthApr_France(org.joda.time.format.TestDateTimeFormat)  Time elapsed: 0 sec  <<< ERROR!
java.lang.StringIndexOutOfBoundsException: String index out of range: 11
	at java.lang.String.charAt(String.java:658)
	at org.joda.time.format.DateTimeFormat.parseToken(DateTimeFormat.java:130)
	at org.joda.time.format.DateTimeFormat.parsePatternTo(DateTimeFormat.java:54)
	at org.joda.time.format.DateTimeFormat.createFormatterForPattern(DateTimeFormat.java:155)
	at org.joda.time.format.DateTimeFormat.forPattern(DateTimeFormat.java:30)
	at org.joda.time.format.TestDateTimeFormat.testFormatParse_textMonthApr_France(TestDateTimeFormat.java:958)

testFormat_yearOfEra_twoDigit(org.joda.time.format.TestDateTimeFormat)  Time elapsed: 0.001 sec  <<< ERROR!
java.lang.StringIndexOutOfBoundsException: String index out of range: 2
	at java.lang.String.charAt(String.java:658)
	at org.joda.time.format.DateTimeFormat.parseToken(DateTimeFormat.java:130)
	at org.joda.time.format.DateTimeFormat.parsePatternTo(DateTimeFormat.java:54)
	at org.joda.time.format.DateTimeFormat.createFormatterForPattern(DateTimeFormat.java:155)
	at org.joda.time.format.DateTimeFormat.forPattern(DateTimeFormat.java:30)
	at org.joda.time.format.TestDateTimeFormat.testFormat_yearOfEra_twoDigit(TestDateTimeFormat.java:145)

testFormat_yearOfEraParse(org.joda.time.format.TestDateTimeFormat)  Time elapsed: 0 sec  <<< ERROR!
java.lang.StringIndexOutOfBoundsException: String index out of range: 10
	at java.lang.String.charAt(String.java:658)
	at org.joda.time.format.DateTimeFormat.parseToken(DateTimeFormat.java:130)
	at org.joda.time.format.DateTimeFormat.parsePatternTo(DateTimeFormat.java:54)
	at org.joda.time.format.DateTimeFormat.createFormatterForPattern(DateTimeFormat.java:155)
	at org.joda.time.format.DateTimeFormat.forPattern(DateTimeFormat.java:30)
	at org.joda.time.format.TestDateTimeFormat.testFormat_yearOfEraParse(TestDateTimeFormat.java:194)

testFormat_year(org.joda.time.format.TestDateTimeFormat)  Time elapsed: 0.001 sec  <<< ERROR!
java.lang.StringIndexOutOfBoundsException: String index out of range: 1
	at java.lang.String.charAt(String.java:658)
	at org.joda.time.format.DateTimeFormat.parseToken(DateTimeFormat.java:130)
	at org.joda.time.format.DateTimeFormat.parsePatternTo(DateTimeFormat.java:54)
	at org.joda.time.format.DateTimeFormat.createFormatterForPattern(DateTimeFormat.java:155)
	at org.joda.time.format.DateTimeFormat.forPattern(DateTimeFormat.java:30)
	at org.joda.time.format.TestDateTimeFormat.testFormat_year(TestDateTimeFormat.java:211)

testFormat_year_twoDigit(org.joda.time.format.TestDateTimeFormat)  Time elapsed: 0 sec  <<< ERROR!
java.lang.StringIndexOutOfBoundsException: String index out of range: 2
	at java.lang.String.charAt(String.java:658)
	at org.joda.time.format.DateTimeFormat.parseToken(DateTimeFormat.java:130)
	at org.joda.time.format.DateTimeFormat.parsePatternTo(DateTimeFormat.java:54)
	at org.joda.time.format.DateTimeFormat.createFormatterForPattern(DateTimeFormat.java:155)
	at org.joda.time.format.DateTimeFormat.forPattern(DateTimeFormat.java:30)
	at org.joda.time.format.TestDateTimeFormat.testFormat_year_twoDigit(TestDateTimeFormat.java:237)

testFormat_year_long(org.joda.time.format.TestDateTimeFormat)  Time elapsed: 0 sec  <<< ERROR!
java.lang.StringIndexOutOfBoundsException: String index out of range: 4
	at java.lang.String.charAt(String.java:658)
	at org.joda.time.format.DateTimeFormat.parseToken(DateTimeFormat.java:130)
	at org.joda.time.format.DateTimeFormat.parsePatternTo(DateTimeFormat.java:54)
	at org.joda.time.format.DateTimeFormat.createFormatterForPattern(DateTimeFormat.java:155)
	at org.joda.time.format.DateTimeFormat.forPattern(DateTimeFormat.java:30)
	at org.joda.time.format.TestDateTimeFormat.testFormat_year_long(TestDateTimeFormat.java:352)

testFormat_weekyear(org.joda.time.format.TestDateTimeFormat)  Time elapsed: 0.001 sec  <<< ERROR!
java.lang.StringIndexOutOfBoundsException: String index out of range: 1
	at java.lang.String.charAt(String.java:658)
	at org.joda.time.format.DateTimeFormat.parseToken(DateTimeFormat.java:130)
	at org.joda.time.format.DateTimeFormat.parsePatternTo(DateTimeFormat.java:54)
	at org.joda.time.format.DateTimeFormat.createFormatterForPattern(DateTimeFormat.java:155)
	at org.joda.time.format.DateTimeFormat.forPattern(DateTimeFormat.java:30)
	at org.joda.time.format.TestDateTimeFormat.testFormat_weekyear(TestDateTimeFormat.java:367)

testFormat_weekyearOfEra_twoDigit(org.joda.time.format.TestDateTimeFormat)  Time elapsed: 0 sec  <<< ERROR!
java.lang.StringIndexOutOfBoundsException: String index out of range: 2
	at java.lang.String.charAt(String.java:658)
	at org.joda.time.format.DateTimeFormat.parseToken(DateTimeFormat.java:130)
	at org.joda.time.format.DateTimeFormat.parsePatternTo(DateTimeFormat.java:54)
	at org.joda.time.format.DateTimeFormat.createFormatterForPattern(DateTimeFormat.java:155)
	at org.joda.time.format.DateTimeFormat.forPattern(DateTimeFormat.java:30)
	at org.joda.time.format.TestDateTimeFormat.testFormat_weekyearOfEra_twoDigit(TestDateTimeFormat.java:382)

testFormat_weekOfWeekyear(org.joda.time.format.TestDateTimeFormat)  Time elapsed: 0 sec  <<< ERROR!
java.lang.StringIndexOutOfBoundsException: String index out of range: 1
	at java.lang.String.charAt(String.java:658)
	at org.joda.time.format.DateTimeFormat.parseToken(DateTimeFormat.java:130)
	at org.joda.time.format.DateTimeFormat.parsePatternTo(DateTimeFormat.java:54)
	at org.joda.time.format.DateTimeFormat.createFormatterForPattern(DateTimeFormat.java:155)
	at org.joda.time.format.DateTimeFormat.forPattern(DateTimeFormat.java:30)
	at org.joda.time.format.TestDateTimeFormat.testFormat_weekOfWeekyear(TestDateTimeFormat.java:498)

testFormat_dayOfWeek(org.joda.time.format.TestDateTimeFormat)  Time elapsed: 0.001 sec  <<< ERROR!
java.lang.StringIndexOutOfBoundsException: String index out of range: 1
	at java.lang.String.charAt(String.java:658)
	at org.joda.time.format.DateTimeFormat.parseToken(DateTimeFormat.java:130)
	at org.joda.time.format.DateTimeFormat.parsePatternTo(DateTimeFormat.java:54)
	at org.joda.time.format.DateTimeFormat.createFormatterForPattern(DateTimeFormat.java:155)
	at org.joda.time.format.DateTimeFormat.forPattern(DateTimeFormat.java:30)
	at org.joda.time.format.TestDateTimeFormat.testFormat_dayOfWeek(TestDateTimeFormat.java:511)

testFormat_dayOfWeekShortText(org.joda.time.format.TestDateTimeFormat)  Time elapsed: 0 sec  <<< ERROR!
java.lang.StringIndexOutOfBoundsException: String index out of range: 1
	at java.lang.String.charAt(String.java:658)
	at org.joda.time.format.DateTimeFormat.parseToken(DateTimeFormat.java:130)
	at org.joda.time.format.DateTimeFormat.parsePatternTo(DateTimeFormat.java:54)
	at org.joda.time.format.DateTimeFormat.createFormatterForPattern(DateTimeFormat.java:155)
	at org.joda.time.format.DateTimeFormat.forPattern(DateTimeFormat.java:30)
	at org.joda.time.format.TestDateTimeFormat.testFormat_dayOfWeekShortText(TestDateTimeFormat.java:524)

testFormat_dayOfWeekText(org.joda.time.format.TestDateTimeFormat)  Time elapsed: 0 sec  <<< ERROR!
java.lang.StringIndexOutOfBoundsException: String index out of range: 4
	at java.lang.String.charAt(String.java:658)
	at org.joda.time.format.DateTimeFormat.parseToken(DateTimeFormat.java:130)
	at org.joda.time.format.DateTimeFormat.parsePatternTo(DateTimeFormat.java:54)
	at org.joda.time.format.DateTimeFormat.createFormatterForPattern(DateTimeFormat.java:155)
	at org.joda.time.format.DateTimeFormat.forPattern(DateTimeFormat.java:30)
	at org.joda.time.format.TestDateTimeFormat.testFormat_dayOfWeekText(TestDateTimeFormat.java:540)

testFormat_centuryOfEra(org.joda.time.format.TestDateTimeFormat)  Time elapsed: 0 sec  <<< ERROR!
java.lang.StringIndexOutOfBoundsException: String index out of range: 1
	at java.lang.String.charAt(String.java:658)
	at org.joda.time.format.DateTimeFormat.parseToken(DateTimeFormat.java:130)
	at org.joda.time.format.DateTimeFormat.parsePatternTo(DateTimeFormat.java:54)
	at org.joda.time.format.DateTimeFormat.createFormatterForPattern(DateTimeFormat.java:155)
	at org.joda.time.format.DateTimeFormat.forPattern(DateTimeFormat.java:30)
	at org.joda.time.format.TestDateTimeFormat.testFormat_centuryOfEra(TestDateTimeFormat.java:114)

testFormat_yearOfEra(org.joda.time.format.TestDateTimeFormat)  Time elapsed: 0 sec  <<< ERROR!
java.lang.StringIndexOutOfBoundsException: String index out of range: 1
	at java.lang.String.charAt(String.java:658)
	at org.joda.time.format.DateTimeFormat.parseToken(DateTimeFormat.java:130)
	at org.joda.time.format.DateTimeFormat.parsePatternTo(DateTimeFormat.java:54)
	at org.joda.time.format.DateTimeFormat.createFormatterForPattern(DateTimeFormat.java:155)
	at org.joda.time.format.DateTimeFormat.forPattern(DateTimeFormat.java:30)
	at org.joda.time.format.TestDateTimeFormat.testFormat_yearOfEra(TestDateTimeFormat.java:130)

testForStyle_shortDate(org.joda.time.format.TestDateTimeFormatStyle)  Time elapsed: 0.007 sec  <<< ERROR!
java.lang.StringIndexOutOfBoundsException: String index out of range: 8
	at java.lang.String.charAt(String.java:658)
	at org.joda.time.format.DateTimeFormat.parseToken(DateTimeFormat.java:130)
	at org.joda.time.format.DateTimeFormat.parsePatternTo(DateTimeFormat.java:54)
	at org.joda.time.format.DateTimeFormat.createFormatterForPattern(DateTimeFormat.java:155)
	at org.joda.time.format.DateTimeFormat.forPattern(DateTimeFormat.java:30)
	at org.joda.time.format.DateTimeFormat$StyleFormatter.getFormatter(DateTimeFormat.java:201)
	at org.joda.time.format.DateTimeFormat$StyleFormatter.printTo(DateTimeFormat.java:191)
	at org.joda.time.format.DateTimeFormatter.printTo(DateTimeFormatter.java:684)
	at org.joda.time.format.DateTimeFormatter.printTo(DateTimeFormatter.java:521)
	at org.joda.time.format.DateTimeFormatter.print(DateTimeFormatter.java:625)
	at org.joda.time.format.TestDateTimeFormatStyle.testForStyle_shortDate(TestDateTimeFormatStyle.java:133)

testForStyle_shortTime(org.joda.time.format.TestDateTimeFormatStyle)  Time elapsed: 0.001 sec  <<< ERROR!
java.lang.StringIndexOutOfBoundsException: String index out of range: 5
	at java.lang.String.charAt(String.java:658)
	at org.joda.time.format.DateTimeFormat.parseToken(DateTimeFormat.java:130)
	at org.joda.time.format.DateTimeFormat.parsePatternTo(DateTimeFormat.java:54)
	at org.joda.time.format.DateTimeFormat.createFormatterForPattern(DateTimeFormat.java:155)
	at org.joda.time.format.DateTimeFormat.forPattern(DateTimeFormat.java:30)
	at org.joda.time.format.DateTimeFormat$StyleFormatter.getFormatter(DateTimeFormat.java:201)
	at org.joda.time.format.DateTimeFormat$StyleFormatter.printTo(DateTimeFormat.java:191)
	at org.joda.time.format.DateTimeFormatter.printTo(DateTimeFormatter.java:684)
	at org.joda.time.format.DateTimeFormatter.printTo(DateTimeFormatter.java:521)
	at org.joda.time.format.DateTimeFormatter.print(DateTimeFormatter.java:625)
	at org.joda.time.format.TestDateTimeFormatStyle.testForStyle_shortTime(TestDateTimeFormatStyle.java:150)

testForStyle_shortDateTime(org.joda.time.format.TestDateTimeFormatStyle)  Time elapsed: 0.001 sec  <<< ERROR!
java.lang.StringIndexOutOfBoundsException: String index out of range: 14
	at java.lang.String.charAt(String.java:658)
	at org.joda.time.format.DateTimeFormat.parseToken(DateTimeFormat.java:130)
	at org.joda.time.format.DateTimeFormat.parsePatternTo(DateTimeFormat.java:54)
	at org.joda.time.format.DateTimeFormat.createFormatterForPattern(DateTimeFormat.java:155)
	at org.joda.time.format.DateTimeFormat.forPattern(DateTimeFormat.java:30)
	at org.joda.time.format.DateTimeFormat$StyleFormatter.getFormatter(DateTimeFormat.java:201)
	at org.joda.time.format.DateTimeFormat$StyleFormatter.printTo(DateTimeFormat.java:191)
	at org.joda.time.format.DateTimeFormatter.printTo(DateTimeFormatter.java:684)
	at org.joda.time.format.DateTimeFormatter.printTo(DateTimeFormatter.java:521)
	at org.joda.time.format.DateTimeFormatter.print(DateTimeFormatter.java:625)
	at org.joda.time.format.TestDateTimeFormatStyle.testForStyle_shortDateTime(TestDateTimeFormatStyle.java:171)

testForStyle_mediumDate(org.joda.time.format.TestDateTimeFormatStyle)  Time elapsed: 0.001 sec  <<< ERROR!
java.lang.StringIndexOutOfBoundsException: String index out of range: 11
	at java.lang.String.charAt(String.java:658)
	at org.joda.time.format.DateTimeFormat.parseToken(DateTimeFormat.java:130)
	at org.joda.time.format.DateTimeFormat.parsePatternTo(DateTimeFormat.java:54)
	at org.joda.time.format.DateTimeFormat.createFormatterForPattern(DateTimeFormat.java:155)
	at org.joda.time.format.DateTimeFormat.forPattern(DateTimeFormat.java:30)
	at org.joda.time.format.DateTimeFormat$StyleFormatter.getFormatter(DateTimeFormat.java:201)
	at org.joda.time.format.DateTimeFormat$StyleFormatter.printTo(DateTimeFormat.java:191)
	at org.joda.time.format.DateTimeFormatter.printTo(DateTimeFormatter.java:684)
	at org.joda.time.format.DateTimeFormatter.printTo(DateTimeFormatter.java:521)
	at org.joda.time.format.DateTimeFormatter.print(DateTimeFormatter.java:625)
	at org.joda.time.format.TestDateTimeFormatStyle.testForStyle_mediumDate(TestDateTimeFormatStyle.java:189)

testForStyle_mediumTime(org.joda.time.format.TestDateTimeFormatStyle)  Time elapsed: 0.001 sec  <<< ERROR!
java.lang.StringIndexOutOfBoundsException: String index out of range: 8
	at java.lang.String.charAt(String.java:658)
	at org.joda.time.format.DateTimeFormat.parseToken(DateTimeFormat.java:130)
	at org.joda.time.format.DateTimeFormat.parsePatternTo(DateTimeFormat.java:54)
	at org.joda.time.format.DateTimeFormat.createFormatterForPattern(DateTimeFormat.java:155)
	at org.joda.time.format.DateTimeFormat.forPattern(DateTimeFormat.java:30)
	at org.joda.time.format.DateTimeFormat$StyleFormatter.getFormatter(DateTimeFormat.java:201)
	at org.joda.time.format.DateTimeFormat$StyleFormatter.printTo(DateTimeFormat.java:191)
	at org.joda.time.format.DateTimeFormatter.printTo(DateTimeFormatter.java:684)
	at org.joda.time.format.DateTimeFormatter.printTo(DateTimeFormatter.java:521)
	at org.joda.time.format.DateTimeFormatter.print(DateTimeFormatter.java:625)
	at org.joda.time.format.TestDateTimeFormatStyle.testForStyle_mediumTime(TestDateTimeFormatStyle.java:202)

testForStyle_mediumDateTime(org.joda.time.format.TestDateTimeFormatStyle)  Time elapsed: 0.001 sec  <<< ERROR!
java.lang.StringIndexOutOfBoundsException: String index out of range: 20
	at java.lang.String.charAt(String.java:658)
	at org.joda.time.format.DateTimeFormat.parseToken(DateTimeFormat.java:130)
	at org.joda.time.format.DateTimeFormat.parsePatternTo(DateTimeFormat.java:54)
	at org.joda.time.format.DateTimeFormat.createFormatterForPattern(DateTimeFormat.java:155)
	at org.joda.time.format.DateTimeFormat.forPattern(DateTimeFormat.java:30)
	at org.joda.time.format.DateTimeFormat$StyleFormatter.getFormatter(DateTimeFormat.java:201)
	at org.joda.time.format.DateTimeFormat$StyleFormatter.printTo(DateTimeFormat.java:191)
	at org.joda.time.format.DateTimeFormatter.printTo(DateTimeFormatter.java:684)
	at org.joda.time.format.DateTimeFormatter.printTo(DateTimeFormatter.java:521)
	at org.joda.time.format.DateTimeFormatter.print(DateTimeFormatter.java:625)
	at org.joda.time.format.TestDateTimeFormatStyle.testForStyle_mediumDateTime(TestDateTimeFormatStyle.java:215)

testForStyle_longDate(org.joda.time.format.TestDateTimeFormatStyle)  Time elapsed: 0.001 sec  <<< ERROR!
java.lang.StringIndexOutOfBoundsException: String index out of range: 12
	at java.lang.String.charAt(String.java:658)
	at org.joda.time.format.DateTimeFormat.parseToken(DateTimeFormat.java:130)
	at org.joda.time.format.DateTimeFormat.parsePatternTo(DateTimeFormat.java:54)
	at org.joda.time.format.DateTimeFormat.createFormatterForPattern(DateTimeFormat.java:155)
	at org.joda.time.format.DateTimeFormat.forPattern(DateTimeFormat.java:30)
	at org.joda.time.format.DateTimeFormat$StyleFormatter.getFormatter(DateTimeFormat.java:201)
	at org.joda.time.format.DateTimeFormat$StyleFormatter.printTo(DateTimeFormat.java:191)
	at org.joda.time.format.DateTimeFormatter.printTo(DateTimeFormatter.java:684)
	at org.joda.time.format.DateTimeFormatter.printTo(DateTimeFormatter.java:521)
	at org.joda.time.format.DateTimeFormatter.print(DateTimeFormatter.java:625)
	at org.joda.time.format.TestDateTimeFormatStyle.testForStyle_longDate(TestDateTimeFormatStyle.java:229)

testForStyle_longTime(org.joda.time.format.TestDateTimeFormatStyle)  Time elapsed: 0 sec  <<< ERROR!
java.lang.StringIndexOutOfBoundsException: String index out of range: 10
	at java.lang.String.charAt(String.java:658)
	at org.joda.time.format.DateTimeFormat.parseToken(DateTimeFormat.java:130)
	at org.joda.time.format.DateTimeFormat.parsePatternTo(DateTimeFormat.java:54)
	at org.joda.time.format.DateTimeFormat.createFormatterForPattern(DateTimeFormat.java:155)
	at org.joda.time.format.DateTimeFormat.forPattern(DateTimeFormat.java:30)
	at org.joda.time.format.DateTimeFormat$StyleFormatter.getFormatter(DateTimeFormat.java:201)
	at org.joda.time.format.DateTimeFormat$StyleFormatter.printTo(DateTimeFormat.java:191)
	at org.joda.time.format.DateTimeFormatter.printTo(DateTimeFormatter.java:684)
	at org.joda.time.format.DateTimeFormatter.printTo(DateTimeFormatter.java:521)
	at org.joda.time.format.DateTimeFormatter.print(DateTimeFormatter.java:625)
	at org.joda.time.format.TestDateTimeFormatStyle.testForStyle_longTime(TestDateTimeFormatStyle.java:242)

testForStyle_longDateTime(org.joda.time.format.TestDateTimeFormatStyle)  Time elapsed: 0.001 sec  <<< ERROR!
java.lang.StringIndexOutOfBoundsException: String index out of range: 23
	at java.lang.String.charAt(String.java:658)
	at org.joda.time.format.DateTimeFormat.parseToken(DateTimeFormat.java:130)
	at org.joda.time.format.DateTimeFormat.parsePatternTo(DateTimeFormat.java:54)
	at org.joda.time.format.DateTimeFormat.createFormatterForPattern(DateTimeFormat.java:155)
	at org.joda.time.format.DateTimeFormat.forPattern(DateTimeFormat.java:30)
	at org.joda.time.format.DateTimeFormat$StyleFormatter.getFormatter(DateTimeFormat.java:201)
	at org.joda.time.format.DateTimeFormat$StyleFormatter.printTo(DateTimeFormat.java:191)
	at org.joda.time.format.DateTimeFormatter.printTo(DateTimeFormatter.java:684)
	at org.joda.time.format.DateTimeFormatter.printTo(DateTimeFormatter.java:521)
	at org.joda.time.format.DateTimeFormatter.print(DateTimeFormatter.java:625)
	at org.joda.time.format.TestDateTimeFormatStyle.testForStyle_longDateTime(TestDateTimeFormatStyle.java:255)

testForStyle_fullDate(org.joda.time.format.TestDateTimeFormatStyle)  Time elapsed: 0.001 sec  <<< ERROR!
java.lang.StringIndexOutOfBoundsException: String index out of range: 17
	at java.lang.String.charAt(String.java:658)
	at org.joda.time.format.DateTimeFormat.parseToken(DateTimeFormat.java:130)
	at org.joda.time.format.DateTimeFormat.parsePatternTo(DateTimeFormat.java:54)
	at org.joda.time.format.DateTimeFormat.createFormatterForPattern(DateTimeFormat.java:155)
	at org.joda.time.format.DateTimeFormat.forPattern(DateTimeFormat.java:30)
	at org.joda.time.format.DateTimeFormat$StyleFormatter.getFormatter(DateTimeFormat.java:201)
	at org.joda.time.format.DateTimeFormat$StyleFormatter.printTo(DateTimeFormat.java:191)
	at org.joda.time.format.DateTimeFormatter.printTo(DateTimeFormatter.java:684)
	at org.joda.time.format.DateTimeFormatter.printTo(DateTimeFormatter.java:521)
	at org.joda.time.format.DateTimeFormatter.print(DateTimeFormatter.java:625)
	at org.joda.time.format.TestDateTimeFormatStyle.testForStyle_fullDate(TestDateTimeFormatStyle.java:269)

testForStyle_fullTime(org.joda.time.format.TestDateTimeFormatStyle)  Time elapsed: 0.001 sec  <<< ERROR!
java.lang.StringIndexOutOfBoundsException: String index out of range: 21
	at java.lang.String.charAt(String.java:658)
	at org.joda.time.format.DateTimeFormat.parseToken(DateTimeFormat.java:130)
	at org.joda.time.format.DateTimeFormat.parsePatternTo(DateTimeFormat.java:54)
	at org.joda.time.format.DateTimeFormat.createFormatterForPattern(DateTimeFormat.java:155)
	at org.joda.time.format.DateTimeFormat.forPattern(DateTimeFormat.java:30)
	at org.joda.time.format.DateTimeFormat$StyleFormatter.getFormatter(DateTimeFormat.java:201)
	at org.joda.time.format.DateTimeFormat$StyleFormatter.printTo(DateTimeFormat.java:191)
	at org.joda.time.format.DateTimeFormatter.printTo(DateTimeFormatter.java:684)
	at org.joda.time.format.DateTimeFormatter.printTo(DateTimeFormatter.java:521)
	at org.joda.time.format.DateTimeFormatter.print(DateTimeFormatter.java:625)
	at org.joda.time.format.TestDateTimeFormatStyle.testForStyle_fullTime(TestDateTimeFormatStyle.java:282)

testForStyle_fullDateTime(org.joda.time.format.TestDateTimeFormatStyle)  Time elapsed: 0.001 sec  <<< ERROR!
java.lang.StringIndexOutOfBoundsException: String index out of range: 39
	at java.lang.String.charAt(String.java:658)
	at org.joda.time.format.DateTimeFormat.parseToken(DateTimeFormat.java:130)
	at org.joda.time.format.DateTimeFormat.parsePatternTo(DateTimeFormat.java:54)
	at org.joda.time.format.DateTimeFormat.createFormatterForPattern(DateTimeFormat.java:155)
	at org.joda.time.format.DateTimeFormat.forPattern(DateTimeFormat.java:30)
	at org.joda.time.format.DateTimeFormat$StyleFormatter.getFormatter(DateTimeFormat.java:201)
	at org.joda.time.format.DateTimeFormat$StyleFormatter.printTo(DateTimeFormat.java:191)
	at org.joda.time.format.DateTimeFormatter.printTo(DateTimeFormatter.java:684)
	at org.joda.time.format.DateTimeFormatter.printTo(DateTimeFormatter.java:521)
	at org.joda.time.format.DateTimeFormatter.print(DateTimeFormatter.java:625)
	at org.joda.time.format.TestDateTimeFormatStyle.testForStyle_fullDateTime(TestDateTimeFormatStyle.java:295)

testForStyle_shortMediumDateTime(org.joda.time.format.TestDateTimeFormatStyle)  Time elapsed: 0.001 sec  <<< ERROR!
java.lang.StringIndexOutOfBoundsException: String index out of range: 17
	at java.lang.String.charAt(String.java:658)
	at org.joda.time.format.DateTimeFormat.parseToken(DateTimeFormat.java:130)
	at org.joda.time.format.DateTimeFormat.parsePatternTo(DateTimeFormat.java:54)
	at org.joda.time.format.DateTimeFormat.createFormatterForPattern(DateTimeFormat.java:155)
	at org.joda.time.format.DateTimeFormat.forPattern(DateTimeFormat.java:30)
	at org.joda.time.format.DateTimeFormat$StyleFormatter.getFormatter(DateTimeFormat.java:201)
	at org.joda.time.format.DateTimeFormat$StyleFormatter.printTo(DateTimeFormat.java:191)
	at org.joda.time.format.DateTimeFormatter.printTo(DateTimeFormatter.java:684)
	at org.joda.time.format.DateTimeFormatter.printTo(DateTimeFormatter.java:521)
	at org.joda.time.format.DateTimeFormatter.print(DateTimeFormatter.java:625)
	at org.joda.time.format.TestDateTimeFormatStyle.testForStyle_shortMediumDateTime(TestDateTimeFormatStyle.java:307)

testForStyle_shortLongDateTime(org.joda.time.format.TestDateTimeFormatStyle)  Time elapsed: 0.001 sec  <<< ERROR!
java.lang.StringIndexOutOfBoundsException: String index out of range: 19
	at java.lang.String.charAt(String.java:658)
	at org.joda.time.format.DateTimeFormat.parseToken(DateTimeFormat.java:130)
	at org.joda.time.format.DateTimeFormat.parsePatternTo(DateTimeFormat.java:54)
	at org.joda.time.format.DateTimeFormat.createFormatterForPattern(DateTimeFormat.java:155)
	at org.joda.time.format.DateTimeFormat.forPattern(DateTimeFormat.java:30)
	at org.joda.time.format.DateTimeFormat$StyleFormatter.getFormatter(DateTimeFormat.java:201)
	at org.joda.time.format.DateTimeFormat$StyleFormatter.printTo(DateTimeFormat.java:191)
	at org.joda.time.format.DateTimeFormatter.printTo(DateTimeFormatter.java:684)
	at org.joda.time.format.DateTimeFormatter.printTo(DateTimeFormatter.java:521)
	at org.joda.time.format.DateTimeFormatter.print(DateTimeFormatter.java:625)
	at org.joda.time.format.TestDateTimeFormatStyle.testForStyle_shortLongDateTime(TestDateTimeFormatStyle.java:318)

testForStyle_shortFullDateTime(org.joda.time.format.TestDateTimeFormatStyle)  Time elapsed: 0.001 sec  <<< ERROR!
java.lang.StringIndexOutOfBoundsException: String index out of range: 30
	at java.lang.String.charAt(String.java:658)
	at org.joda.time.format.DateTimeFormat.parseToken(DateTimeFormat.java:130)
	at org.joda.time.format.DateTimeFormat.parsePatternTo(DateTimeFormat.java:54)
	at org.joda.time.format.DateTimeFormat.createFormatterForPattern(DateTimeFormat.java:155)
	at org.joda.time.format.DateTimeFormat.forPattern(DateTimeFormat.java:30)
	at org.joda.time.format.DateTimeFormat$StyleFormatter.getFormatter(DateTimeFormat.java:201)
	at org.joda.time.format.DateTimeFormat$StyleFormatter.printTo(DateTimeFormat.java:191)
	at org.joda.time.format.DateTimeFormatter.printTo(DateTimeFormatter.java:684)
	at org.joda.time.format.DateTimeFormatter.printTo(DateTimeFormatter.java:521)
	at org.joda.time.format.DateTimeFormatter.print(DateTimeFormatter.java:625)
	at org.joda.time.format.TestDateTimeFormatStyle.testForStyle_shortFullDateTime(TestDateTimeFormatStyle.java:329)

testForStyle_mediumShortDateTime(org.joda.time.format.TestDateTimeFormatStyle)  Time elapsed: 0 sec  <<< ERROR!
java.lang.StringIndexOutOfBoundsException: String index out of range: 17
	at java.lang.String.charAt(String.java:658)
	at org.joda.time.format.DateTimeFormat.parseToken(DateTimeFormat.java:130)
	at org.joda.time.format.DateTimeFormat.parsePatternTo(DateTimeFormat.java:54)
	at org.joda.time.format.DateTimeFormat.createFormatterForPattern(DateTimeFormat.java:155)
	at org.joda.time.format.DateTimeFormat.forPattern(DateTimeFormat.java:30)
	at org.joda.time.format.DateTimeFormat$StyleFormatter.getFormatter(DateTimeFormat.java:201)
	at org.joda.time.format.DateTimeFormat$StyleFormatter.printTo(DateTimeFormat.java:191)
	at org.joda.time.format.DateTimeFormatter.printTo(DateTimeFormatter.java:684)
	at org.joda.time.format.DateTimeFormatter.printTo(DateTimeFormatter.java:521)
	at org.joda.time.format.DateTimeFormatter.print(DateTimeFormatter.java:625)
	at org.joda.time.format.TestDateTimeFormatStyle.testForStyle_mediumShortDateTime(TestDateTimeFormatStyle.java:341)

testForStyle_mediumLongDateTime(org.joda.time.format.TestDateTimeFormatStyle)  Time elapsed: 0 sec  <<< ERROR!
java.lang.StringIndexOutOfBoundsException: String index out of range: 22
	at java.lang.String.charAt(String.java:658)
	at org.joda.time.format.DateTimeFormat.parseToken(DateTimeFormat.java:130)
	at org.joda.time.format.DateTimeFormat.parsePatternTo(DateTimeFormat.java:54)
	at org.joda.time.format.DateTimeFormat.createFormatterForPattern(DateTimeFormat.java:155)
	at org.joda.time.format.DateTimeFormat.forPattern(DateTimeFormat.java:30)
	at org.joda.time.format.DateTimeFormat$StyleFormatter.getFormatter(DateTimeFormat.java:201)
	at org.joda.time.format.DateTimeFormat$StyleFormatter.printTo(DateTimeFormat.java:191)
	at org.joda.time.format.DateTimeFormatter.printTo(DateTimeFormatter.java:684)
	at org.joda.time.format.DateTimeFormatter.printTo(DateTimeFormatter.java:521)
	at org.joda.time.format.DateTimeFormatter.print(DateTimeFormatter.java:625)
	at org.joda.time.format.TestDateTimeFormatStyle.testForStyle_mediumLongDateTime(TestDateTimeFormatStyle.java:352)

testForStyle_mediumFullDateTime(org.joda.time.format.TestDateTimeFormatStyle)  Time elapsed: 0.001 sec  <<< ERROR!
java.lang.StringIndexOutOfBoundsException: String index out of range: 33
	at java.lang.String.charAt(String.java:658)
	at org.joda.time.format.DateTimeFormat.parseToken(DateTimeFormat.java:130)
	at org.joda.time.format.DateTimeFormat.parsePatternTo(DateTimeFormat.java:54)
	at org.joda.time.format.DateTimeFormat.createFormatterForPattern(DateTimeFormat.java:155)
	at org.joda.time.format.DateTimeFormat.forPattern(DateTimeFormat.java:30)
	at org.joda.time.format.DateTimeFormat$StyleFormatter.getFormatter(DateTimeFormat.java:201)
	at org.joda.time.format.DateTimeFormat$StyleFormatter.printTo(DateTimeFormat.java:191)
	at org.joda.time.format.DateTimeFormatter.printTo(DateTimeFormatter.java:684)
	at org.joda.time.format.DateTimeFormatter.printTo(DateTimeFormatter.java:521)
	at org.joda.time.format.DateTimeFormatter.print(DateTimeFormatter.java:625)
	at org.joda.time.format.TestDateTimeFormatStyle.testForStyle_mediumFullDateTime(TestDateTimeFormatStyle.java:363)

testMonthNames_monthStart(org.joda.time.format.TestTextFields)  Time elapsed: 0 sec  <<< ERROR!
java.lang.StringIndexOutOfBoundsException: String index out of range: 4
	at java.lang.String.charAt(String.java:658)
	at org.joda.time.format.DateTimeFormat.parseToken(DateTimeFormat.java:130)
	at org.joda.time.format.DateTimeFormat.parsePatternTo(DateTimeFormat.java:54)
	at org.joda.time.format.DateTimeFormat.createFormatterForPattern(DateTimeFormat.java:155)
	at org.joda.time.format.DateTimeFormat.forPattern(DateTimeFormat.java:30)
	at org.joda.time.format.TestTextFields.testMonthNames_monthStart(TestTextFields.java:90)

testMonthNames_monthMiddle(org.joda.time.format.TestTextFields)  Time elapsed: 0 sec  <<< ERROR!
java.lang.StringIndexOutOfBoundsException: String index out of range: 4
	at java.lang.String.charAt(String.java:658)
	at org.joda.time.format.DateTimeFormat.parseToken(DateTimeFormat.java:130)
	at org.joda.time.format.DateTimeFormat.parsePatternTo(DateTimeFormat.java:54)
	at org.joda.time.format.DateTimeFormat.createFormatterForPattern(DateTimeFormat.java:155)
	at org.joda.time.format.DateTimeFormat.forPattern(DateTimeFormat.java:30)
	at org.joda.time.format.TestTextFields.testMonthNames_monthMiddle(TestTextFields.java:101)

testMonthNames_monthEnd(org.joda.time.format.TestTextFields)  Time elapsed: 0.001 sec  <<< ERROR!
java.lang.StringIndexOutOfBoundsException: String index out of range: 4
	at java.lang.String.charAt(String.java:658)
	at org.joda.time.format.DateTimeFormat.parseToken(DateTimeFormat.java:130)
	at org.joda.time.format.DateTimeFormat.parsePatternTo(DateTimeFormat.java:54)
	at org.joda.time.format.DateTimeFormat.createFormatterForPattern(DateTimeFormat.java:155)
	at org.joda.time.format.DateTimeFormat.forPattern(DateTimeFormat.java:30)
	at org.joda.time.format.TestTextFields.testMonthNames_monthEnd(TestTextFields.java:112)

testWeekdayNames(org.joda.time.format.TestTextFields)  Time elapsed: 0.001 sec  <<< ERROR!
java.lang.StringIndexOutOfBoundsException: String index out of range: 4
	at java.lang.String.charAt(String.java:658)
	at org.joda.time.format.DateTimeFormat.parseToken(DateTimeFormat.java:130)
	at org.joda.time.format.DateTimeFormat.parsePatternTo(DateTimeFormat.java:54)
	at org.joda.time.format.DateTimeFormat.createFormatterForPattern(DateTimeFormat.java:155)
	at org.joda.time.format.DateTimeFormat.forPattern(DateTimeFormat.java:30)
	at org.joda.time.format.TestTextFields.testWeekdayNames(TestTextFields.java:126)

testHalfdayNames(org.joda.time.format.TestTextFields)  Time elapsed: 0 sec  <<< ERROR!
java.lang.StringIndexOutOfBoundsException: String index out of range: 1
	at java.lang.String.charAt(String.java:658)
	at org.joda.time.format.DateTimeFormat.parseToken(DateTimeFormat.java:130)
	at org.joda.time.format.DateTimeFormat.parsePatternTo(DateTimeFormat.java:54)
	at org.joda.time.format.DateTimeFormat.createFormatterForPattern(DateTimeFormat.java:155)
	at org.joda.time.format.DateTimeFormat.forPattern(DateTimeFormat.java:30)
	at org.joda.time.format.TestTextFields.testHalfdayNames(TestTextFields.java:139)


Results :

Tests in error: 
  org.joda.time.TestDateMidnight_Basics#testToString_DTFormatter StringIndexOutOfBoundsException
  org.joda.time.TestDateMidnight_Basics#testToString_String StringIndexOutOfBoundsException
  org.joda.time.TestDateMidnight_Basics#testToString_String_String StringIndexOutOfBoundsException
  org.joda.time.TestDateMidnight_Constructors#testParse_formatter StringIndexOutOfBoundsException
  org.joda.time.TestDateTimeZone#testIsLocalDateTimeGap_Berlin StringIndexOutOfBoundsException
  org.joda.time.TestDateTimeZone#testIsLocalDateTimeGap_NewYork StringIndexOutOfBoundsException
  org.joda.time.TestDateTimeZoneCutover#test_DateTime_new_Gaza StringIndexOutOfBoundsException
  org.joda.time.TestDateTimeZoneCutover#test_DateTime_new_Turk StringIndexOutOfBoundsException
  org.joda.time.TestDateTimeZoneCutover#test_DateTime_setHourBack_Moscow_Spring StringIndexOutOfBoundsException
  org.joda.time.TestDateTimeZoneCutover#test_DateTime_setHourBack_NewYork_Spring StringIndexOutOfBoundsException
  org.joda.time.TestDateTimeZoneCutover#test_DateTime_setHourForward_Moscow_Spring StringIndexOutOfBoundsException
  org.joda.time.TestDateTimeZoneCutover#test_DateTime_setHourForward_NewYork_Spring StringIndexOutOfBoundsException
  org.joda.time.TestDateTimeZoneCutover#test_DateTime_setHourZero_Gaza StringIndexOutOfBoundsException
  org.joda.time.TestDateTimeZoneCutover#test_DateTime_setHourZero_Turk StringIndexOutOfBoundsException
  org.joda.time.TestDateTimeZoneCutover#test_DateTime_withHourZero_Gaza StringIndexOutOfBoundsException
  org.joda.time.TestDateTimeZoneCutover#test_DateTime_withHourZero_Turk StringIndexOutOfBoundsException
  org.joda.time.TestDateTimeZoneCutover#test_LocalDate_toDateMidnight_Gaza StringIndexOutOfBoundsException
  org.joda.time.TestDateTimeZoneCutover#test_LocalDate_toDateMidnight_Turk StringIndexOutOfBoundsException
  org.joda.time.TestDateTime_Basics#testToString_DTFormatter StringIndexOutOfBoundsException
  org.joda.time.TestDateTime_Basics#testToString_String StringIndexOutOfBoundsException
  org.joda.time.TestDateTime_Basics#testToString_String_Locale StringIndexOutOfBoundsException
  org.joda.time.TestDateTime_Constructors#testParse_formatter StringIndexOutOfBoundsException
  org.joda.time.TestDateTime_Properties#testPropertyWithMaximumValueMillisOfDayDSTGap StringIndexOutOfBoundsException
  org.joda.time.TestDateTime_Properties#testPropertyWithMinimumValueMillisOfDayDSTGap StringIndexOutOfBoundsException
  org.joda.time.TestDays#testFactory_daysBetween_RPartial_MonthDay NoClassDefFoundError
  org.joda.time.TestIllegalFieldValueException#testZoneTransition StringIndexOutOfBoundsException
  org.joda.time.TestInstant_Constructors#testParse_formatter StringIndexOutOfBoundsException
  org.joda.time.TestLocalDateTime_Basics#testToDateTime_Zone_dstGap StringIndexOutOfBoundsException
  org.joda.time.TestLocalDateTime_Basics#testToString_DTFormatter StringIndexOutOfBoundsException
  org.joda.time.TestLocalDateTime_Basics#testToString_String StringIndexOutOfBoundsException
  org.joda.time.TestLocalDateTime_Basics#testToString_String_Locale StringIndexOutOfBoundsException
  org.joda.time.TestLocalDateTime_Constructors#testParse_formatter StringIndexOutOfBoundsException
  org.joda.time.TestLocalDate_Basics#testToDateTime_LocalTime_Zone_dstGap StringIndexOutOfBoundsException
  org.joda.time.TestLocalDate_Basics#testToString_DTFormatter StringIndexOutOfBoundsException
  org.joda.time.TestLocalDate_Basics#testToString_String StringIndexOutOfBoundsException
  org.joda.time.TestLocalDate_Basics#testToString_String_Locale StringIndexOutOfBoundsException
  org.joda.time.TestLocalDate_Constructors#testParse_formatter StringIndexOutOfBoundsException
  org.joda.time.TestLocalTime_Basics#testToString_DTFormatter StringIndexOutOfBoundsException
  org.joda.time.TestLocalTime_Basics#testToString_String StringIndexOutOfBoundsException
  org.joda.time.TestLocalTime_Basics#testToString_String_Locale StringIndexOutOfBoundsException
  org.joda.time.TestLocalTime_Constructors#testParse_formatter StringIndexOutOfBoundsException
  org.joda.time.TestMonthDay_Basics#testCompareTo NoClassDefFoundError Could not...
  org.joda.time.TestMonthDay_Basics#testEqualsHashCode NoClassDefFoundError Coul...
  org.joda.time.TestMonthDay_Basics#testGet NoClassDefFoundError Could not initi...
  org.joda.time.TestMonthDay_Basics#testGetField NoClassDefFoundError Could not ...
  org.joda.time.TestMonthDay_Basics#testGetFieldType NoClassDefFoundError Could ...
  org.joda.time.TestMonthDay_Basics#testGetFieldTypes NoClassDefFoundError Could...
  org.joda.time.TestMonthDay_Basics#testGetFields NoClassDefFoundError Could not...
  org.joda.time.TestMonthDay_Basics#testGetValue NoClassDefFoundError Could not ...
  org.joda.time.TestMonthDay_Basics#testGetValues NoClassDefFoundError Could not...
  org.joda.time.TestMonthDay_Basics#testIsAfter_MD NoClassDefFoundError Could no...
  org.joda.time.TestMonthDay_Basics#testIsBefore_MD NoClassDefFoundError Could n...
  org.joda.time.TestMonthDay_Basics#testIsEqual_MD NoClassDefFoundError Could no...
  org.joda.time.TestMonthDay_Basics#testIsSupported NoClassDefFoundError Could n...
  org.joda.time.TestMonthDay_Basics#testMinusDays_int NoClassDefFoundError Could...
  org.joda.time.TestMonthDay_Basics#testMinusDays_int_fromLeap NoClassDefFoundError
  org.joda.time.TestMonthDay_Basics#testMinusDays_int_negativeFromLeap NoClassDefFoundError
  org.joda.time.TestMonthDay_Basics#testMinusDays_int_toLeap NoClassDefFoundError
  org.joda.time.TestMonthDay_Basics#testMinusDays_int_wrapMonth NoClassDefFoundError
  org.joda.time.TestMonthDay_Basics#testMinusDays_int_wrapMonthIntoLastYear NoClassDefFoundError
  org.joda.time.TestMonthDay_Basics#testMinusDays_int_wrapMonthTwice NoClassDefFoundError
  org.joda.time.TestMonthDay_Basics#testMinusDays_int_wrapMonthTwiceIntoLastYear NoClassDefFoundError
  org.joda.time.TestMonthDay_Basics#testMinusDays_same NoClassDefFoundError Coul...
  org.joda.time.TestMonthDay_Basics#testMinusMonths_int NoClassDefFoundError Cou...
  org.joda.time.TestMonthDay_Basics#testMinusMonths_int_adjust NoClassDefFoundError
  org.joda.time.TestMonthDay_Basics#testMinusMonths_int_endOfMonthAdjust NoClassDefFoundError
  org.joda.time.TestMonthDay_Basics#testMinusMonths_int_fromLeap NoClassDefFoundError
  org.joda.time.TestMonthDay_Basics#testMinusMonths_int_negativeEndOfMonthAdjust NoClassDefFoundError
  org.joda.time.TestMonthDay_Basics#testMinusMonths_int_negativeFromLeap NoClassDefFoundError
  org.joda.time.TestMonthDay_Basics#testMinusMonths_int_same NoClassDefFoundError
  org.joda.time.TestMonthDay_Basics#testMinusMonths_int_wrap NoClassDefFoundError
  org.joda.time.TestMonthDay_Basics#testMinus_RP NoClassDefFoundError Could not ...
  org.joda.time.TestMonthDay_Basics#testPlusDays_int NoClassDefFoundError Could ...
  org.joda.time.TestMonthDay_Basics#testPlusDays_int_fromLeap NoClassDefFoundError
  org.joda.time.TestMonthDay_Basics#testPlusDays_int_negativeFromLeap NoClassDefFoundError
  org.joda.time.TestMonthDay_Basics#testPlusDays_int_toLeap NoClassDefFoundError
  org.joda.time.TestMonthDay_Basics#testPlusDays_int_wrap50 NoClassDefFoundError
  org.joda.time.TestMonthDay_Basics#testPlusDays_int_wrapMonth NoClassDefFoundError
  org.joda.time.TestMonthDay_Basics#testPlusDays_int_wrapMonthIntoNextYear NoClassDefFoundError
  org.joda.time.TestMonthDay_Basics#testPlusDays_int_wrapMonthTwice NoClassDefFoundError
  org.joda.time.TestMonthDay_Basics#testPlusDays_int_wrapMonthTwiceIntoNextYear NoClassDefFoundError
  org.joda.time.TestMonthDay_Basics#testPlusDays_same NoClassDefFoundError Could...
  org.joda.time.TestMonthDay_Basics#testPlusMonths_int NoClassDefFoundError Coul...
  org.joda.time.TestMonthDay_Basics#testPlusMonths_int_adjust NoClassDefFoundError
  org.joda.time.TestMonthDay_Basics#testPlusMonths_int_endOfMonthAdjust NoClassDefFoundError
  org.joda.time.TestMonthDay_Basics#testPlusMonths_int_fromLeap NoClassDefFoundError
  org.joda.time.TestMonthDay_Basics#testPlusMonths_int_negativeEndOfMonthAdjust NoClassDefFoundError
  org.joda.time.TestMonthDay_Basics#testPlusMonths_int_negativeFromLeap NoClassDefFoundError
  org.joda.time.TestMonthDay_Basics#testPlusMonths_int_same NoClassDefFoundError
  org.joda.time.TestMonthDay_Basics#testPlusMonths_int_wrap NoClassDefFoundError
  org.joda.time.TestMonthDay_Basics#testPlus_RP NoClassDefFoundError Could not i...
  org.joda.time.TestMonthDay_Basics#testProperty NoClassDefFoundError Could not ...
  org.joda.time.TestMonthDay_Basics#testSerialization NoClassDefFoundError Could...
  org.joda.time.TestMonthDay_Basics#testSize NoClassDefFoundError Could not init...
  org.joda.time.TestMonthDay_Basics#testToDateTime_RI NoClassDefFoundError Could...
  org.joda.time.TestMonthDay_Basics#testToDateTime_nullRI NoClassDefFoundError C...
  org.joda.time.TestMonthDay_Basics#testToLocalDate NoClassDefFoundError Could n...
  org.joda.time.TestMonthDay_Basics#testToString NoClassDefFoundError Could not ...
  org.joda.time.TestMonthDay_Basics#testToString_DTFormatter NoClassDefFoundError
  org.joda.time.TestMonthDay_Basics#testToString_String NoClassDefFoundError Cou...
  org.joda.time.TestMonthDay_Basics#testToString_String_Locale NoClassDefFoundError
  org.joda.time.TestMonthDay_Basics#testWithChronologyRetainFields_Chrono NoClassDefFoundError
  org.joda.time.TestMonthDay_Basics#testWithChronologyRetainFields_nullChrono NoClassDefFoundError
  org.joda.time.TestMonthDay_Basics#testWithChronologyRetainFields_sameChrono NoClassDefFoundError
  org.joda.time.TestMonthDay_Basics#testWithField NoClassDefFoundError Could not...
  org.joda.time.TestMonthDay_Basics#testWithFieldAdded NoClassDefFoundError Coul...
  org.joda.time.TestMonthDay_Basics#testWithFieldAdded_nullField_nonZero NoClassDefFoundError
  org.joda.time.TestMonthDay_Basics#testWithFieldAdded_nullField_zero NoClassDefFoundError
  org.joda.time.TestMonthDay_Basics#testWithFieldAdded_unknownField NoClassDefFoundError
  org.joda.time.TestMonthDay_Basics#testWithFieldAdded_zero NoClassDefFoundError
  org.joda.time.TestMonthDay_Basics#testWithField_nullField NoClassDefFoundError
  org.joda.time.TestMonthDay_Basics#testWithField_same NoClassDefFoundError Coul...
  org.joda.time.TestMonthDay_Basics#testWithField_unknownField NoClassDefFoundError
  org.joda.time.TestMonthDay_Basics#testWithers NoClassDefFoundError Could not i...
  org.joda.time.TestMonthDay_Constructors#testConstructor NoClassDefFoundError C...
  org.joda.time.TestMonthDay_Constructors#testConstructor_Chronology NoClassDefFoundError
  org.joda.time.TestMonthDay_Constructors#testConstructor_DateTimeZone NoClassDefFoundError
  org.joda.time.TestMonthDay_Constructors#testConstructor_Object NoClassDefFoundError
  org.joda.time.TestMonthDay_Constructors#testConstructor_ObjectString1 NoClassDefFoundError
  org.joda.time.TestMonthDay_Constructors#testConstructor_ObjectString5 NoClassDefFoundError
  org.joda.time.TestMonthDay_Constructors#testConstructor_ObjectStringEx1 NoClassDefFoundError
  org.joda.time.TestMonthDay_Constructors#testConstructor_ObjectStringEx2 NoClassDefFoundError
  org.joda.time.TestMonthDay_Constructors#testConstructor_ObjectStringEx3 NoClassDefFoundError
  org.joda.time.TestMonthDay_Constructors#testConstructor_ObjectStringEx4 NoClassDefFoundError
  org.joda.time.TestMonthDay_Constructors#testConstructor_Object_Chronology NoClassDefFoundError
  org.joda.time.TestMonthDay_Constructors#testConstructor_Object_nullChronology NoClassDefFoundError
  org.joda.time.TestMonthDay_Constructors#testConstructor_int_int NoClassDefFoundError
  org.joda.time.TestMonthDay_Constructors#testConstructor_int_int_Chronology NoClassDefFoundError
  org.joda.time.TestMonthDay_Constructors#testConstructor_int_int_nullChronology NoClassDefFoundError
  org.joda.time.TestMonthDay_Constructors#testConstructor_long1 NoClassDefFoundError
  org.joda.time.TestMonthDay_Constructors#testConstructor_long1_Chronology NoClassDefFoundError
  org.joda.time.TestMonthDay_Constructors#testConstructor_long2 NoClassDefFoundError
  org.joda.time.TestMonthDay_Constructors#testConstructor_long2_Chronology NoClassDefFoundError
  org.joda.time.TestMonthDay_Constructors#testConstructor_long_nullChronology NoClassDefFoundError
  org.joda.time.TestMonthDay_Constructors#testConstructor_nullChronology NoClassDefFoundError
  org.joda.time.TestMonthDay_Constructors#testConstructor_nullDateTimeZone NoClassDefFoundError
  org.joda.time.TestMonthDay_Constructors#testConstructor_nullObject NoClassDefFoundError
  org.joda.time.TestMonthDay_Constructors#testConstructor_nullObject_Chronology NoClassDefFoundError
  org.joda.time.TestMonthDay_Constructors#testConstructor_nullObject_nullChronology NoClassDefFoundError
  org.joda.time.TestMonthDay_Constructors#testFactory_FromCalendarFields NoClassDefFoundError
  org.joda.time.TestMonthDay_Constructors#testFactory_FromDateFields NoClassDefFoundError
  org.joda.time.TestMonthDay_Constructors#testParse_formatter StringIndexOutOfBoundsException
  org.joda.time.TestMonthDay_Constructors#testParse_noFormatter NoClassDefFoundError
  org.joda.time.TestMonthDay_Properties#testPropertyAddDayOfMonth NoClassDefFoundError
  org.joda.time.TestMonthDay_Properties#testPropertyAddMonthOfYear NoClassDefFoundError
  org.joda.time.TestMonthDay_Properties#testPropertyAddWrapFieldDayOfMonth NoClassDefFoundError
  org.joda.time.TestMonthDay_Properties#testPropertyAddWrapFieldMonthOfYear NoClassDefFoundError
  org.joda.time.TestMonthDay_Properties#testPropertyCompareToDayOfMonth NoClassDefFoundError
  org.joda.time.TestMonthDay_Properties#testPropertyCompareToMonthOfYear NoClassDefFoundError
  org.joda.time.TestMonthDay_Properties#testPropertyEquals NoClassDefFoundError ...
  org.joda.time.TestMonthDay_Properties#testPropertyEqualsHashCodeLenient NoClassDefFoundError
  org.joda.time.TestMonthDay_Properties#testPropertyEqualsHashCodeStrict NoClassDefFoundError
  org.joda.time.TestMonthDay_Properties#testPropertyGetDayOfMonth NoClassDefFoundError
  org.joda.time.TestMonthDay_Properties#testPropertyGetMaxMinValuesDayOfMonth NoClassDefFoundError
  org.joda.time.TestMonthDay_Properties#testPropertyGetMaxMinValuesMonthOfYear NoClassDefFoundError
  org.joda.time.TestMonthDay_Properties#testPropertyGetMonthOfYear NoClassDefFoundError
  org.joda.time.TestMonthDay_Properties#testPropertyHashCode NoClassDefFoundError
  org.joda.time.TestMonthDay_Properties#testPropertySetDayOfMonth NoClassDefFoundError
  org.joda.time.TestMonthDay_Properties#testPropertySetMonthOfYear NoClassDefFoundError
  org.joda.time.TestMonthDay_Properties#testPropertySetTextDayOfMonth NoClassDefFoundError
  org.joda.time.TestMonthDay_Properties#testPropertySetTextMonthOfYear NoClassDefFoundError
  org.joda.time.TestMonths#testFactory_monthsBetween_RPartial_MonthDay ExceptionInInitializerError
  org.joda.time.TestMutableDateTime_Basics#testToString_DTFormatter StringIndexOutOfBoundsException
  org.joda.time.TestMutableDateTime_Basics#testToString_String StringIndexOutOfBoundsException
  org.joda.time.TestMutableDateTime_Basics#testToString_String_String StringIndexOutOfBoundsException
  org.joda.time.TestMutableDateTime_Constructors#testParse_formatter StringIndexOutOfBoundsException
  org.joda.time.TestPartial_Basics#testToString_DTFormatter StringIndexOutOfBoundsException
  org.joda.time.TestPartial_Basics#testToString_String StringIndexOutOfBoundsException
  org.joda.time.TestPartial_Basics#testToString_String_Locale StringIndexOutOfBoundsException
  org.joda.time.TestStringConvert#testMonthDay NoClassDefFoundError Could not in...
  org.joda.time.TestStringConvert#testMonthDay_leapDay NoClassDefFoundError Coul...
  org.joda.time.TestTimeOfDay_Basics#testToString_DTFormatter StringIndexOutOfBoundsException
  org.joda.time.TestTimeOfDay_Basics#testToString_String StringIndexOutOfBoundsException
  org.joda.time.TestTimeOfDay_Basics#testToString_String_Locale StringIndexOutOfBoundsException
  org.joda.time.TestYearMonthDay_Basics#testToString_DTFormatter StringIndexOutOfBoundsException
  org.joda.time.TestYearMonthDay_Basics#testToString_String StringIndexOutOfBoundsException
  org.joda.time.TestYearMonthDay_Basics#testToString_String_Locale StringIndexOutOfBoundsException
  org.joda.time.TestYearMonth_Basics#testToString_DTFormatter StringIndexOutOfBoundsException
  org.joda.time.TestYearMonth_Basics#testToString_String StringIndexOutOfBoundsException
  org.joda.time.TestYearMonth_Basics#testToString_String_Locale StringIndexOutOfBoundsException
  org.joda.time.TestYearMonth_Constructors#testParse_formatter StringIndexOutOfBoundsException
  org.joda.time.chrono.TestLenientChronology#test_isoChrononolgy_Chicago StringIndexOutOfBoundsException
  org.joda.time.chrono.TestLenientChronology#test_strictChrononolgy_Chicago StringIndexOutOfBoundsException
  org.joda.time.format.TestDateTimeFormat#testFormatParse_textMonthApr_France StringIndexOutOfBoundsException
  org.joda.time.format.TestDateTimeFormat#testFormatParse_textMonthApr_Korean StringIndexOutOfBoundsException
  org.joda.time.format.TestDateTimeFormat#testFormatParse_textMonthAtEnd_France StringIndexOutOfBoundsException
  org.joda.time.format.TestDateTimeFormat#testFormatParse_textMonthAtEnd_France_withSpecifiedDefault StringIndexOutOfBoundsException
  org.joda.time.format.TestDateTimeFormat#testFormatParse_textMonthJanLongLowerCase_UK StringIndexOutOfBoundsException
  org.joda.time.format.TestDateTimeFormat#testFormatParse_textMonthJanLongUpperCase_UK StringIndexOutOfBoundsException
  org.joda.time.format.TestDateTimeFormat#testFormatParse_textMonthJanLong_France StringIndexOutOfBoundsException
  org.joda.time.format.TestDateTimeFormat#testFormatParse_textMonthJanShortLowerCase_UK StringIndexOutOfBoundsException
  org.joda.time.format.TestDateTimeFormat#testFormatParse_textMonthJanShortUpperCase_UK StringIndexOutOfBoundsException
  org.joda.time.format.TestDateTimeFormat#testFormatParse_textMonthJanShort_France StringIndexOutOfBoundsException
  org.joda.time.format.TestDateTimeFormat#testFormatParse_textMonthJanShort_UK StringIndexOutOfBoundsException
  org.joda.time.format.TestDateTimeFormat#testFormatParse_zoneId_colon StringIndexOutOfBoundsException
  org.joda.time.format.TestDateTimeFormat#testFormatParse_zoneId_colon_parseZ StringIndexOutOfBoundsException
  org.joda.time.format.TestDateTimeFormat#testFormatParse_zoneId_noColon StringIndexOutOfBoundsException
  org.joda.time.format.TestDateTimeFormat#testFormatParse_zoneId_noColon_parseZ StringIndexOutOfBoundsException
  org.joda.time.format.TestDateTimeFormat#testFormat_centuryOfEra StringIndexOutOfBoundsException
  org.joda.time.format.TestDateTimeFormat#testFormat_clockhourOfDay StringIndexOutOfBoundsException
  org.joda.time.format.TestDateTimeFormat#testFormat_clockhourOfHalfday StringIndexOutOfBoundsException
  org.joda.time.format.TestDateTimeFormat#testFormat_dayOfMonth StringIndexOutOfBoundsException
  org.joda.time.format.TestDateTimeFormat#testFormat_dayOfWeek StringIndexOutOfBoundsException
  org.joda.time.format.TestDateTimeFormat#testFormat_dayOfWeekShortText StringIndexOutOfBoundsException
  org.joda.time.format.TestDateTimeFormat#testFormat_dayOfWeekText StringIndexOutOfBoundsException
  org.joda.time.format.TestDateTimeFormat#testFormat_dayOfYearText StringIndexOutOfBoundsException
  org.joda.time.format.TestDateTimeFormat#testFormat_era StringIndexOutOfBoundsException
  org.joda.time.format.TestDateTimeFormat#testFormat_fractionOfSecond StringIndexOutOfBoundsException
  org.joda.time.format.TestDateTimeFormat#testFormat_fractionOfSecondLong StringIndexOutOfBoundsException
  org.joda.time.format.TestDateTimeFormat#testFormat_halfdayOfDay StringIndexOutOfBoundsException
  org.joda.time.format.TestDateTimeFormat#testFormat_hourOfDay StringIndexOutOfBoundsException
  org.joda.time.format.TestDateTimeFormat#testFormat_hourOfHalfday StringIndexOutOfBoundsException
  org.joda.time.format.TestDateTimeFormat#testFormat_invalid StringIndexOutOfBoundsException
  org.joda.time.format.TestDateTimeFormat#testFormat_minute StringIndexOutOfBoundsException
  org.joda.time.format.TestDateTimeFormat#testFormat_monthOfYear StringIndexOutOfBoundsException
  org.joda.time.format.TestDateTimeFormat#testFormat_monthOfYearShortText StringIndexOutOfBoundsException
  org.joda.time.format.TestDateTimeFormat#testFormat_monthOfYearText StringIndexOutOfBoundsException
  org.joda.time.format.TestDateTimeFormat#testFormat_samples StringIndexOutOfBoundsException
  org.joda.time.format.TestDateTimeFormat#testFormat_second StringIndexOutOfBoundsException
  org.joda.time.format.TestDateTimeFormat#testFormat_shortBasicParse StringIndexOutOfBoundsException
  org.joda.time.format.TestDateTimeFormat#testFormat_weekOfWeekyear StringIndexOutOfBoundsException
  org.joda.time.format.TestDateTimeFormat#testFormat_weekyear StringIndexOutOfBoundsException
  org.joda.time.format.TestDateTimeFormat#testFormat_weekyearOfEra_twoDigit StringIndexOutOfBoundsException
  org.joda.time.format.TestDateTimeFormat#testFormat_year StringIndexOutOfBoundsException
  org.joda.time.format.TestDateTimeFormat#testFormat_yearOfEra StringIndexOutOfBoundsException
  org.joda.time.format.TestDateTimeFormat#testFormat_yearOfEraParse StringIndexOutOfBoundsException
  org.joda.time.format.TestDateTimeFormat#testFormat_yearOfEra_twoDigit StringIndexOutOfBoundsException
  org.joda.time.format.TestDateTimeFormat#testFormat_year_long StringIndexOutOfBoundsException
  org.joda.time.format.TestDateTimeFormat#testFormat_year_twoDigit StringIndexOutOfBoundsException
  org.joda.time.format.TestDateTimeFormat#testFormat_zoneAmount StringIndexOutOfBoundsException
  org.joda.time.format.TestDateTimeFormat#testFormat_zoneAmountColon StringIndexOutOfBoundsException
  org.joda.time.format.TestDateTimeFormat#testFormat_zoneAmountID StringIndexOutOfBoundsException
  org.joda.time.format.TestDateTimeFormat#testFormat_zoneLongText StringIndexOutOfBoundsException
  org.joda.time.format.TestDateTimeFormat#testFormat_zoneText StringIndexOutOfBoundsException
  org.joda.time.format.TestDateTimeFormat#testParse_pivotYear StringIndexOutOfBoundsException
  org.joda.time.format.TestDateTimeFormat#testParse_pivotYear_ignored4DigitYear StringIndexOutOfBoundsException
  org.joda.time.format.TestDateTimeFormat#testParse_textMonthJanLong_UK StringIndexOutOfBoundsException
  org.joda.time.format.TestDateTimeFormatStyle#testForStyle_fullDate StringIndexOutOfBoundsException
  org.joda.time.format.TestDateTimeFormatStyle#testForStyle_fullDateTime StringIndexOutOfBoundsException
  org.joda.time.format.TestDateTimeFormatStyle#testForStyle_fullTime StringIndexOutOfBoundsException
  org.joda.time.format.TestDateTimeFormatStyle#testForStyle_longDate StringIndexOutOfBoundsException
  org.joda.time.format.TestDateTimeFormatStyle#testForStyle_longDateTime StringIndexOutOfBoundsException
  org.joda.time.format.TestDateTimeFormatStyle#testForStyle_longTime StringIndexOutOfBoundsException
  org.joda.time.format.TestDateTimeFormatStyle#testForStyle_mediumDate StringIndexOutOfBoundsException
  org.joda.time.format.TestDateTimeFormatStyle#testForStyle_mediumDateTime StringIndexOutOfBoundsException
  org.joda.time.format.TestDateTimeFormatStyle#testForStyle_mediumFullDateTime StringIndexOutOfBoundsException
  org.joda.time.format.TestDateTimeFormatStyle#testForStyle_mediumLongDateTime StringIndexOutOfBoundsException
  org.joda.time.format.TestDateTimeFormatStyle#testForStyle_mediumShortDateTime StringIndexOutOfBoundsException
  org.joda.time.format.TestDateTimeFormatStyle#testForStyle_mediumTime StringIndexOutOfBoundsException
  org.joda.time.format.TestDateTimeFormatStyle#testForStyle_shortDate StringIndexOutOfBoundsException
  org.joda.time.format.TestDateTimeFormatStyle#testForStyle_shortDateTime StringIndexOutOfBoundsException
  org.joda.time.format.TestDateTimeFormatStyle#testForStyle_shortFullDateTime StringIndexOutOfBoundsException
  org.joda.time.format.TestDateTimeFormatStyle#testForStyle_shortLongDateTime StringIndexOutOfBoundsException
  org.joda.time.format.TestDateTimeFormatStyle#testForStyle_shortMediumDateTime StringIndexOutOfBoundsException
  org.joda.time.format.TestDateTimeFormatStyle#testForStyle_shortTime StringIndexOutOfBoundsException
  org.joda.time.format.TestDateTimeFormatter#testParseInto_monthDay_feb29 StringIndexOutOfBoundsException
  org.joda.time.format.TestDateTimeFormatter#testParseInto_monthDay_feb29_OfYear StringIndexOutOfBoundsException
  org.joda.time.format.TestDateTimeFormatter#testParseInto_monthDay_feb29_newYork StringIndexOutOfBoundsException
  org.joda.time.format.TestDateTimeFormatter#testParseInto_monthDay_feb29_newYork_endOfYear StringIndexOutOfBoundsException
  org.joda.time.format.TestDateTimeFormatter#testParseInto_monthDay_feb29_newYork_startOfYear StringIndexOutOfBoundsException
  org.joda.time.format.TestDateTimeFormatter#testParseInto_monthDay_feb29_startOfYear StringIndexOutOfBoundsException
  org.joda.time.format.TestDateTimeFormatter#testParseInto_monthDay_feb29_tokyo StringIndexOutOfBoundsException
  org.joda.time.format.TestDateTimeFormatter#testParseInto_monthDay_feb29_tokyo_endOfYear StringIndexOutOfBoundsException
  org.joda.time.format.TestDateTimeFormatter#testParseInto_monthDay_feb29_tokyo_startOfYear StringIndexOutOfBoundsException
  org.joda.time.format.TestDateTimeFormatter#testParseInto_monthDay_withDefaultYear_feb29 StringIndexOutOfBoundsException
  org.joda.time.format.TestDateTimeFormatter#testParseInto_monthDay_withDefaultYear_feb29_newYork StringIndexOutOfBoundsException
  org.joda.time.format.TestDateTimeFormatter#testParseInto_monthDay_withDefaultYear_feb29_newYork_endOfYear StringIndexOutOfBoundsException
  org.joda.time.format.TestDateTimeFormatter#testParseInto_monthOnly StringIndexOutOfBoundsException
  org.joda.time.format.TestDateTimeFormatter#testParseInto_monthOnly_baseEndYear StringIndexOutOfBoundsException
  org.joda.time.format.TestDateTimeFormatter#testParseInto_monthOnly_baseStartYear StringIndexOutOfBoundsException
  org.joda.time.format.TestDateTimeFormatter#testParseInto_monthOnly_parseEndYear StringIndexOutOfBoundsException
  org.joda.time.format.TestDateTimeFormatter#testParseInto_monthOnly_parseStartYear StringIndexOutOfBoundsException
  org.joda.time.format.TestDateTimeFormatter#testParseLocalDateTime_monthDay_feb29 StringIndexOutOfBoundsException
  org.joda.time.format.TestDateTimeFormatter#testParseLocalDateTime_monthDay_withDefaultYear_feb29 StringIndexOutOfBoundsException
  org.joda.time.format.TestDateTimeFormatter#testParseLocalDate_monthDay_feb29 StringIndexOutOfBoundsException
  org.joda.time.format.TestDateTimeFormatter#testParseLocalDate_monthDay_withDefaultYear_feb29 StringIndexOutOfBoundsException
  org.joda.time.format.TestDateTimeFormatter#testParseLocalDate_weekyear_month_week_2010 StringIndexOutOfBoundsException
  org.joda.time.format.TestDateTimeFormatter#testParseLocalDate_weekyear_month_week_2011 StringIndexOutOfBoundsException
  org.joda.time.format.TestDateTimeFormatter#testParseLocalDate_weekyear_month_week_2012 StringIndexOutOfBoundsException
  org.joda.time.format.TestDateTimeFormatter#testParseLocalDate_yearOfCentury StringIndexOutOfBoundsException
  org.joda.time.format.TestDateTimeFormatter#testParseLocalDate_yearOfEra StringIndexOutOfBoundsException
  org.joda.time.format.TestDateTimeFormatter#testParseLocalDate_year_month_week_2010 StringIndexOutOfBoundsException
  org.joda.time.format.TestDateTimeFormatter#testParseLocalDate_year_month_week_2011 StringIndexOutOfBoundsException
  org.joda.time.format.TestDateTimeFormatter#testParseLocalDate_year_month_week_2012 StringIndexOutOfBoundsException
  org.joda.time.format.TestDateTimeFormatter#testParseLocalDate_year_month_week_2013 StringIndexOutOfBoundsException
  org.joda.time.format.TestDateTimeFormatter#testParseLocalDate_year_month_week_2014 StringIndexOutOfBoundsException
  org.joda.time.format.TestDateTimeFormatter#testParseLocalDate_year_month_week_2015 StringIndexOutOfBoundsException
  org.joda.time.format.TestDateTimeFormatter#testParseLocalDate_year_month_week_2016 StringIndexOutOfBoundsException
  org.joda.time.format.TestDateTimeFormatter#testZoneNameNearTransition StringIndexOutOfBoundsException
  org.joda.time.format.TestDateTimeFormatter#testZoneShortNameNearTransition StringIndexOutOfBoundsException
  org.joda.time.format.TestTextFields#testHalfdayNames StringIndexOutOfBoundsException
  org.joda.time.format.TestTextFields#testMonthNames_monthEnd StringIndexOutOfBoundsException
  org.joda.time.format.TestTextFields#testMonthNames_monthMiddle StringIndexOutOfBoundsException
  org.joda.time.format.TestTextFields#testMonthNames_monthStart StringIndexOutOfBoundsException
  org.joda.time.format.TestTextFields#testWeekdayNames StringIndexOutOfBoundsException

Tests run: 4157, Failures: 0, Errors: 295, Skipped: 0

[INFO] ------------------------------------------------------------------------
[INFO] BUILD FAILURE
[INFO] ------------------------------------------------------------------------
[INFO] Total time: 15.231s
[INFO] Finished at: Thu Aug 06 05:48:28 BST 2015
[INFO] Final Memory: 8M/209M
[INFO] ------------------------------------------------------------------------
[ERROR] Failed to execute goal org.apache.maven.plugins:maven-surefire-plugin:2.18.1:test (default-test) on project joda-time: There are test failures.
[ERROR] 
[ERROR] Please refer to /home/perham/Study/LittleDarwin/Cases/joda-time-2.8.1/target/surefire-reports for the individual test results.
[ERROR] -> [Help 1]
[ERROR] 
[ERROR] To see the full stack trace of the errors, re-run Maven with the -e switch.
[ERROR] Re-run Maven using the -X switch to enable full debug logging.
[ERROR] 
[ERROR] For more information about the errors and possible solutions, please read the following articles:
[ERROR] [Help 1] http://cwiki.apache.org/confluence/display/MAVEN/MojoFailureException
