[INFO] Scanning for projects...
[INFO]                                                                         
[INFO] ------------------------------------------------------------------------
[INFO] Building Joda-Time 2.8.1
[INFO] ------------------------------------------------------------------------
[INFO] 
[INFO] --- maven-resources-plugin:2.7:resources (default-resources) @ joda-time ---
[INFO] Using 'UTF-8' encoding to copy filtered resources.
[INFO] Copying 2 resources to META-INF
[INFO] Copying 10 resources
[INFO] 
[INFO] --- maven-compiler-plugin:3.3:compile (default-compile) @ joda-time ---
[INFO] Changes detected - recompiling the module!
[INFO] Compiling 166 source files to /home/perham/Study/LittleDarwin/Cases/joda-time-2.8.1/target/classes
[INFO] 
[INFO] --- exec-maven-plugin:1.4.0:java (compile-tzdb) @ joda-time ---
Writing zoneinfo files
Writing ZoneInfoMap
[INFO] 
[INFO] --- maven-resources-plugin:2.7:testResources (default-testResources) @ joda-time ---
[INFO] Using 'UTF-8' encoding to copy filtered resources.
[INFO] Copying 34 resources
[INFO] 
[INFO] --- maven-compiler-plugin:3.3:testCompile (default-testCompile) @ joda-time ---
[INFO] Nothing to compile - all classes are up to date
[INFO] 
[INFO] --- maven-surefire-plugin:2.18.1:test (default-test) @ joda-time ---
[INFO] Surefire report directory: /home/perham/Study/LittleDarwin/Cases/joda-time-2.8.1/target/surefire-reports

-------------------------------------------------------
 T E S T S
-------------------------------------------------------
Running org.joda.time.TestAllPackages

TestBuddhistChronology.testCalendar

TestCopticChronology.testCalendar

TestEthiopicChronology.testCalendar

TestIslamicChronology.testCalendar

Testing Gregorian chronology over 1000 iterations
100% complete (i=1000)

Testing Julian chronology over 1000 iterations
100% complete (i=1000)
Writing zoneinfo files
Writing ZoneInfoMap
Tests run: 4157, Failures: 0, Errors: 34, Skipped: 0, Time elapsed: 5.29 sec <<< FAILURE! - in org.joda.time.TestAllPackages
test_eras(org.joda.time.TestDurationFieldType)  Time elapsed: 0.006 sec  <<< ERROR!
java.lang.NullPointerException
	at org.joda.time.TestDurationFieldType.test_eras(TestDurationFieldType.java:59)

testWithZoneRetainFields_DateTimeZone(org.joda.time.TestDateTime_Basics)  Time elapsed: 0.001 sec  <<< ERROR!
java.lang.IllegalArgumentException
	at org.joda.time.field.UnsupportedDateTimeField.<init>(UnsupportedDateTimeField.java:84)
	at org.joda.time.field.UnsupportedDateTimeField.getInstance(UnsupportedDateTimeField.java:65)
	at org.joda.time.chrono.BaseChronology.year(BaseChronology.java:613)
	at org.joda.time.base.BaseDateTime.<init>(BaseDateTime.java:128)
	at org.joda.time.DateTime.<init>(DateTime.java:236)
	at org.joda.time.TestDateTime_Basics.testWithZoneRetainFields_DateTimeZone(TestDateTime_Basics.java:823)

testEqualsHashCode(org.joda.time.TestDateTime_Basics)  Time elapsed: 0.001 sec  <<< ERROR!
java.lang.IllegalArgumentException
	at org.joda.time.field.UnsupportedDateTimeField.<init>(UnsupportedDateTimeField.java:84)
	at org.joda.time.field.UnsupportedDateTimeField.getInstance(UnsupportedDateTimeField.java:65)
	at org.joda.time.chrono.BaseChronology.year(BaseChronology.java:613)
	at org.joda.time.base.BaseDateTime.<init>(BaseDateTime.java:128)
	at org.joda.time.DateTime.<init>(DateTime.java:236)
	at org.joda.time.TestDateTime_Basics.testEqualsHashCode(TestDateTime_Basics.java:304)

testToDateTimeISO(org.joda.time.TestDateTime_Basics)  Time elapsed: 0.001 sec  <<< ERROR!
java.lang.IllegalArgumentException
	at org.joda.time.field.UnsupportedDateTimeField.<init>(UnsupportedDateTimeField.java:84)
	at org.joda.time.field.UnsupportedDateTimeField.getInstance(UnsupportedDateTimeField.java:65)
	at org.joda.time.chrono.BaseChronology.year(BaseChronology.java:613)
	at org.joda.time.base.BaseDateTime.<init>(BaseDateTime.java:128)
	at org.joda.time.DateTime.<init>(DateTime.java:236)
	at org.joda.time.TestDateTime_Basics.testToDateTimeISO(TestDateTime_Basics.java:566)

testEqualsHashCode(org.joda.time.TestMutableDateTime_Basics)  Time elapsed: 0.001 sec  <<< ERROR!
java.lang.IllegalArgumentException
	at org.joda.time.field.UnsupportedDateTimeField.<init>(UnsupportedDateTimeField.java:84)
	at org.joda.time.field.UnsupportedDateTimeField.getInstance(UnsupportedDateTimeField.java:65)
	at org.joda.time.chrono.BaseChronology.year(BaseChronology.java:613)
	at org.joda.time.base.BaseDateTime.<init>(BaseDateTime.java:128)
	at org.joda.time.MutableDateTime.<init>(MutableDateTime.java:236)
	at org.joda.time.TestMutableDateTime_Basics.testEqualsHashCode(TestMutableDateTime_Basics.java:247)

testSetZoneRetainFields_DateTimeZone4(org.joda.time.TestMutableDateTime_Sets)  Time elapsed: 0 sec  <<< ERROR!
java.lang.IllegalArgumentException
	at org.joda.time.field.UnsupportedDateTimeField.<init>(UnsupportedDateTimeField.java:84)
	at org.joda.time.field.UnsupportedDateTimeField.getInstance(UnsupportedDateTimeField.java:65)
	at org.joda.time.chrono.BaseChronology.year(BaseChronology.java:613)
	at org.joda.time.base.BaseDateTime.<init>(BaseDateTime.java:128)
	at org.joda.time.MutableDateTime.<init>(MutableDateTime.java:236)
	at org.joda.time.TestMutableDateTime_Sets.testSetZoneRetainFields_DateTimeZone4(TestMutableDateTime_Sets.java:170)

testSetTime_Object3(org.joda.time.TestMutableDateTime_Sets)  Time elapsed: 0 sec  <<< ERROR!
java.lang.IllegalArgumentException
	at org.joda.time.field.UnsupportedDateTimeField.<init>(UnsupportedDateTimeField.java:84)
	at org.joda.time.field.UnsupportedDateTimeField.getInstance(UnsupportedDateTimeField.java:65)
	at org.joda.time.chrono.BaseChronology.year(BaseChronology.java:613)
	at org.joda.time.base.BaseDateTime.<init>(BaseDateTime.java:128)
	at org.joda.time.DateTime.<init>(DateTime.java:236)
	at org.joda.time.TestMutableDateTime_Sets.testSetTime_Object3(TestMutableDateTime_Sets.java:381)

testWithZoneRetainFields_DateTimeZone(org.joda.time.TestDateMidnight_Basics)  Time elapsed: 0 sec  <<< ERROR!
java.lang.IllegalArgumentException
	at org.joda.time.field.UnsupportedDateTimeField.<init>(UnsupportedDateTimeField.java:84)
	at org.joda.time.field.UnsupportedDateTimeField.getInstance(UnsupportedDateTimeField.java:65)
	at org.joda.time.chrono.BaseChronology.year(BaseChronology.java:613)
	at org.joda.time.base.BaseDateTime.<init>(BaseDateTime.java:128)
	at org.joda.time.DateMidnight.<init>(DateMidnight.java:234)
	at org.joda.time.TestDateMidnight_Basics.testWithZoneRetainFields_DateTimeZone(TestDateMidnight_Basics.java:722)

testIsSupported_DurationFieldType(org.joda.time.TestLocalDateTime_Basics)  Time elapsed: 0 sec  <<< ERROR!
java.lang.NullPointerException
	at org.joda.time.LocalDateTime.isSupported(LocalDateTime.java:639)
	at org.joda.time.TestLocalDateTime_Basics.testIsSupported_DurationFieldType(TestLocalDateTime_Basics.java:265)

testIsSupported_DurationFieldType(org.joda.time.TestLocalDate_Basics)  Time elapsed: 0.001 sec  <<< ERROR!
java.lang.NullPointerException
	at org.joda.time.LocalDate.isSupported(LocalDate.java:596)
	at org.joda.time.TestLocalDate_Basics.testIsSupported_DurationFieldType(TestLocalDate_Basics.java:231)

testWith3f(org.joda.time.TestPartial_Basics)  Time elapsed: 0 sec  <<< ERROR!
java.lang.NullPointerException
	at org.joda.time.Partial.with(Partial.java:463)
	at org.joda.time.TestPartial_Basics.testWith3f(TestPartial_Basics.java:437)

testWith_baseAndArgHaveNoRange(org.joda.time.TestPartial_Basics)  Time elapsed: 0 sec  <<< ERROR!
java.lang.NullPointerException
	at org.joda.time.Partial.with(Partial.java:463)
	at org.joda.time.TestPartial_Basics.testWith_baseAndArgHaveNoRange(TestPartial_Basics.java:469)

testGetFormatter2(org.joda.time.TestPartial_Basics)  Time elapsed: 0 sec  <<< ERROR!
java.lang.NullPointerException
	at org.joda.time.Partial.with(Partial.java:463)
	at org.joda.time.TestPartial_Basics.testGetFormatter2(TestPartial_Basics.java:817)

testToString5(org.joda.time.TestPartial_Basics)  Time elapsed: 0 sec  <<< ERROR!
java.lang.NullPointerException
	at org.joda.time.Partial.with(Partial.java:467)
	at org.joda.time.TestPartial_Basics.testToString5(TestPartial_Basics.java:870)

testWith3e(org.joda.time.TestPartial_Basics)  Time elapsed: 0.001 sec  <<< ERROR!
java.lang.NullPointerException
	at org.joda.time.Partial.with(Partial.java:467)
	at org.joda.time.TestPartial_Basics.testWith3e(TestPartial_Basics.java:427)

testConstructorEx7_TypeArray_intArray_inOrder(org.joda.time.TestPartial_Constructors)  Time elapsed: 0.001 sec  <<< ERROR!
java.lang.NullPointerException
	at org.joda.time.Partial.<init>(Partial.java:221)
	at org.joda.time.Partial.<init>(Partial.java:177)
	at org.joda.time.TestPartial_Constructors.testConstructorEx7_TypeArray_intArray_inOrder(TestPartial_Constructors.java:305)

testConstructorEx8_TypeArray_intArray_duplicate(org.joda.time.TestPartial_Constructors)  Time elapsed: 0 sec  <<< ERROR!
java.lang.NullPointerException
	at org.joda.time.Partial.<init>(Partial.java:230)
	at org.joda.time.Partial.<init>(Partial.java:177)
	at org.joda.time.TestPartial_Constructors.testConstructorEx8_TypeArray_intArray_duplicate(TestPartial_Constructors.java:365)

testSerializedUnsupportedDateTimeField(org.joda.time.TestSerialization)  Time elapsed: 0.001 sec  <<< ERROR!
java.lang.IllegalArgumentException
	at org.joda.time.field.UnsupportedDateTimeField.<init>(UnsupportedDateTimeField.java:84)
	at org.joda.time.field.UnsupportedDateTimeField.getInstance(UnsupportedDateTimeField.java:65)
	at org.joda.time.TestSerialization.testSerializedUnsupportedDateTimeField(TestSerialization.java:285)

testDurationFields(org.joda.time.chrono.TestBuddhistChronology)  Time elapsed: 0 sec  <<< ERROR!
java.lang.NullPointerException
	at org.joda.time.chrono.TestBuddhistChronology.testDurationFields(TestBuddhistChronology.java:147)

testDurationFields(org.joda.time.chrono.TestCopticChronology)  Time elapsed: 0.001 sec  <<< ERROR!
java.lang.NullPointerException
	at org.joda.time.chrono.TestCopticChronology.testDurationFields(TestCopticChronology.java:150)

testDurationFields(org.joda.time.chrono.TestEthiopicChronology)  Time elapsed: 0 sec  <<< ERROR!
java.lang.NullPointerException
	at org.joda.time.chrono.TestEthiopicChronology.testDurationFields(TestEthiopicChronology.java:150)

testDurationFields(org.joda.time.chrono.TestGJChronology)  Time elapsed: 0.001 sec  <<< ERROR!
java.lang.NullPointerException
	at org.joda.time.chrono.TestGJChronology.testDurationFields(TestGJChronology.java:201)

testDurationFields(org.joda.time.chrono.TestGregorianChronology)  Time elapsed: 0 sec  <<< ERROR!
java.lang.NullPointerException
	at org.joda.time.chrono.TestGregorianChronology.testDurationFields(TestGregorianChronology.java:157)

testDurationFields(org.joda.time.chrono.TestIslamicChronology)  Time elapsed: 0.001 sec  <<< ERROR!
java.lang.NullPointerException
	at org.joda.time.chrono.TestIslamicChronology.testDurationFields(TestIslamicChronology.java:147)

testDurationFields(org.joda.time.chrono.TestJulianChronology)  Time elapsed: 0 sec  <<< ERROR!
java.lang.NullPointerException
	at org.joda.time.chrono.TestJulianChronology.testDurationFields(TestJulianChronology.java:154)

testDurationFields(org.joda.time.chrono.TestISOChronology)  Time elapsed: 0 sec  <<< ERROR!
java.lang.NullPointerException
	at org.joda.time.chrono.TestISOChronology.testDurationFields(TestISOChronology.java:147)

testGetChronology_Object_Zone(org.joda.time.convert.TestReadableInstantConverter)  Time elapsed: 0.001 sec  <<< ERROR!
java.lang.IllegalArgumentException
	at org.joda.time.field.UnsupportedDateTimeField.<init>(UnsupportedDateTimeField.java:84)
	at org.joda.time.field.UnsupportedDateTimeField.getInstance(UnsupportedDateTimeField.java:65)
	at org.joda.time.chrono.BaseChronology.year(BaseChronology.java:613)
	at org.joda.time.base.BaseDateTime.<init>(BaseDateTime.java:128)
	at org.joda.time.DateTime.<init>(DateTime.java:236)
	at org.joda.time.convert.TestReadableInstantConverter.testGetChronology_Object_Zone(TestReadableInstantConverter.java:107)

testToString(org.joda.time.field.TestUnsupportedDateTimeField)  Time elapsed: 0.001 sec  <<< ERROR!
java.lang.IllegalArgumentException
	at org.joda.time.field.UnsupportedDateTimeField.<init>(UnsupportedDateTimeField.java:84)
	at org.joda.time.field.UnsupportedDateTimeField.getInstance(UnsupportedDateTimeField.java:65)
	at org.joda.time.field.TestUnsupportedDateTimeField.testToString(TestUnsupportedDateTimeField.java:649)

testDifferentDurationReturnDifferentObjects(org.joda.time.field.TestUnsupportedDateTimeField)  Time elapsed: 0 sec  <<< ERROR!
java.lang.IllegalArgumentException
	at org.joda.time.field.UnsupportedDateTimeField.<init>(UnsupportedDateTimeField.java:84)
	at org.joda.time.field.UnsupportedDateTimeField.getInstance(UnsupportedDateTimeField.java:65)
	at org.joda.time.field.TestUnsupportedDateTimeField.testDifferentDurationReturnDifferentObjects(TestUnsupportedDateTimeField.java:85)

testAlwaysFalseReturnTypes(org.joda.time.field.TestUnsupportedDateTimeField)  Time elapsed: 0.001 sec  <<< ERROR!
java.lang.IllegalArgumentException
	at org.joda.time.field.UnsupportedDateTimeField.<init>(UnsupportedDateTimeField.java:84)
	at org.joda.time.field.UnsupportedDateTimeField.getInstance(UnsupportedDateTimeField.java:65)
	at org.joda.time.field.TestUnsupportedDateTimeField.testAlwaysFalseReturnTypes(TestUnsupportedDateTimeField.java:122)

testMethodsThatShouldAlwaysReturnNull(org.joda.time.field.TestUnsupportedDateTimeField)  Time elapsed: 0 sec  <<< ERROR!
java.lang.IllegalArgumentException
	at org.joda.time.field.UnsupportedDateTimeField.<init>(UnsupportedDateTimeField.java:84)
	at org.joda.time.field.UnsupportedDateTimeField.getInstance(UnsupportedDateTimeField.java:65)
	at org.joda.time.field.TestUnsupportedDateTimeField.testMethodsThatShouldAlwaysReturnNull(TestUnsupportedDateTimeField.java:137)

testUnsupportedMethods(org.joda.time.field.TestUnsupportedDateTimeField)  Time elapsed: 0.001 sec  <<< ERROR!
java.lang.IllegalArgumentException
	at org.joda.time.field.UnsupportedDateTimeField.<init>(UnsupportedDateTimeField.java:84)
	at org.joda.time.field.UnsupportedDateTimeField.getInstance(UnsupportedDateTimeField.java:65)
	at org.joda.time.field.TestUnsupportedDateTimeField.testUnsupportedMethods(TestUnsupportedDateTimeField.java:177)

testDelegatedMethods(org.joda.time.field.TestUnsupportedDateTimeField)  Time elapsed: 0 sec  <<< ERROR!
java.lang.IllegalArgumentException
	at org.joda.time.field.UnsupportedDateTimeField.<init>(UnsupportedDateTimeField.java:84)
	at org.joda.time.field.UnsupportedDateTimeField.getInstance(UnsupportedDateTimeField.java:65)
	at org.joda.time.field.TestUnsupportedDateTimeField.testDelegatedMethods(TestUnsupportedDateTimeField.java:549)

testPublicGetNameMethod(org.joda.time.field.TestUnsupportedDateTimeField)  Time elapsed: 0 sec  <<< ERROR!
java.lang.IllegalArgumentException
	at org.joda.time.field.UnsupportedDateTimeField.<init>(UnsupportedDateTimeField.java:84)
	at org.joda.time.field.UnsupportedDateTimeField.getInstance(UnsupportedDateTimeField.java:65)
	at org.joda.time.field.TestUnsupportedDateTimeField.testPublicGetNameMethod(TestUnsupportedDateTimeField.java:109)


Results :

Tests in error: 
  org.joda.time.TestDateMidnight_Basics#testWithZoneRetainFields_DateTimeZone IllegalArgumentException
  org.joda.time.TestDateTime_Basics#testEqualsHashCode IllegalArgumentException
  org.joda.time.TestDateTime_Basics#testToDateTimeISO IllegalArgumentException
  org.joda.time.TestDateTime_Basics#testWithZoneRetainFields_DateTimeZone IllegalArgumentException
  org.joda.time.TestDurationFieldType#test_eras NullPointerException
  org.joda.time.TestLocalDateTime_Basics#testIsSupported_DurationFieldType NullPointerException
  org.joda.time.TestLocalDate_Basics#testIsSupported_DurationFieldType NullPointerException
  org.joda.time.TestMutableDateTime_Basics#testEqualsHashCode IllegalArgumentException
  org.joda.time.TestMutableDateTime_Sets#testSetTime_Object3 IllegalArgumentException
  org.joda.time.TestMutableDateTime_Sets#testSetZoneRetainFields_DateTimeZone4 IllegalArgumentException
  org.joda.time.TestPartial_Basics#testGetFormatter2 NullPointerException
  org.joda.time.TestPartial_Basics#testToString5 NullPointerException
  org.joda.time.TestPartial_Basics#testWith3e NullPointerException
  org.joda.time.TestPartial_Basics#testWith3f NullPointerException
  org.joda.time.TestPartial_Basics#testWith_baseAndArgHaveNoRange NullPointerException
  org.joda.time.TestPartial_Constructors#testConstructorEx7_TypeArray_intArray_inOrder NullPointerException
  org.joda.time.TestPartial_Constructors#testConstructorEx8_TypeArray_intArray_duplicate NullPointerException
  org.joda.time.TestSerialization#testSerializedUnsupportedDateTimeField IllegalArgumentException
  org.joda.time.chrono.TestBuddhistChronology#testDurationFields NullPointerException
  org.joda.time.chrono.TestCopticChronology#testDurationFields NullPointerException
  org.joda.time.chrono.TestEthiopicChronology#testDurationFields NullPointerException
  org.joda.time.chrono.TestGJChronology#testDurationFields NullPointerException
  org.joda.time.chrono.TestGregorianChronology#testDurationFields NullPointerException
  org.joda.time.chrono.TestISOChronology#testDurationFields NullPointerException
  org.joda.time.chrono.TestIslamicChronology#testDurationFields NullPointerException
  org.joda.time.chrono.TestJulianChronology#testDurationFields NullPointerException
  org.joda.time.convert.TestReadableInstantConverter#testGetChronology_Object_Zone IllegalArgumentException
  org.joda.time.field.TestUnsupportedDateTimeField#testAlwaysFalseReturnTypes IllegalArgumentException
  org.joda.time.field.TestUnsupportedDateTimeField#testDelegatedMethods IllegalArgumentException
  org.joda.time.field.TestUnsupportedDateTimeField#testDifferentDurationReturnDifferentObjects IllegalArgumentException
  org.joda.time.field.TestUnsupportedDateTimeField#testMethodsThatShouldAlwaysReturnNull IllegalArgumentException
  org.joda.time.field.TestUnsupportedDateTimeField#testPublicGetNameMethod IllegalArgumentException
  org.joda.time.field.TestUnsupportedDateTimeField#testToString IllegalArgumentException
  org.joda.time.field.TestUnsupportedDateTimeField#testUnsupportedMethods IllegalArgumentException

Tests run: 4157, Failures: 0, Errors: 34, Skipped: 0

[INFO] ------------------------------------------------------------------------
[INFO] BUILD FAILURE
[INFO] ------------------------------------------------------------------------
[INFO] Total time: 15.791s
[INFO] Finished at: Thu Aug 06 05:42:52 BST 2015
[INFO] Final Memory: 8M/217M
[INFO] ------------------------------------------------------------------------
[ERROR] Failed to execute goal org.apache.maven.plugins:maven-surefire-plugin:2.18.1:test (default-test) on project joda-time: There are test failures.
[ERROR] 
[ERROR] Please refer to /home/perham/Study/LittleDarwin/Cases/joda-time-2.8.1/target/surefire-reports for the individual test results.
[ERROR] -> [Help 1]
[ERROR] 
[ERROR] To see the full stack trace of the errors, re-run Maven with the -e switch.
[ERROR] Re-run Maven using the -X switch to enable full debug logging.
[ERROR] 
[ERROR] For more information about the errors and possible solutions, please read the following articles:
[ERROR] [Help 1] http://cwiki.apache.org/confluence/display/MAVEN/MojoFailureException
