[INFO] Scanning for projects...
[INFO]                                                                         
[INFO] ------------------------------------------------------------------------
[INFO] Building Joda-Time 2.8.1
[INFO] ------------------------------------------------------------------------
[INFO] 
[INFO] --- maven-resources-plugin:2.7:resources (default-resources) @ joda-time ---
[INFO] Using 'UTF-8' encoding to copy filtered resources.
[INFO] Copying 2 resources to META-INF
[INFO] Copying 10 resources
[INFO] 
[INFO] --- maven-compiler-plugin:3.3:compile (default-compile) @ joda-time ---
[INFO] Changes detected - recompiling the module!
[INFO] Compiling 166 source files to /home/perham/Study/LittleDarwin/Cases/joda-time-2.8.1/target/classes
[INFO] 
[INFO] --- exec-maven-plugin:1.4.0:java (compile-tzdb) @ joda-time ---
Writing zoneinfo files
Writing ZoneInfoMap
[INFO] 
[INFO] --- maven-resources-plugin:2.7:testResources (default-testResources) @ joda-time ---
[INFO] Using 'UTF-8' encoding to copy filtered resources.
[INFO] Copying 34 resources
[INFO] 
[INFO] --- maven-compiler-plugin:3.3:testCompile (default-testCompile) @ joda-time ---
[INFO] Nothing to compile - all classes are up to date
[INFO] 
[INFO] --- maven-surefire-plugin:2.18.1:test (default-test) @ joda-time ---
[INFO] Surefire report directory: /home/perham/Study/LittleDarwin/Cases/joda-time-2.8.1/target/surefire-reports

-------------------------------------------------------
 T E S T S
-------------------------------------------------------
Running org.joda.time.TestAllPackages

TestBuddhistChronology.testCalendar

TestCopticChronology.testCalendar

TestEthiopicChronology.testCalendar

TestIslamicChronology.testCalendar

Testing Gregorian chronology over 1000 iterations
100% complete (i=1000)

Testing Julian chronology over 1000 iterations
100% complete (i=1000)
Writing zoneinfo files
Writing ZoneInfoMap
Tests run: 4157, Failures: 0, Errors: 12, Skipped: 0, Time elapsed: 5.256 sec <<< FAILURE! - in org.joda.time.TestAllPackages
testProperty(org.joda.time.TestDateTime_Basics)  Time elapsed: 0.005 sec  <<< ERROR!
java.lang.NullPointerException
	at org.joda.time.field.UnsupportedDateTimeField.getInstance(UnsupportedDateTimeField.java:22)
	at org.joda.time.TestDateTime_Basics$1.getField(TestDateTime_Basics.java:1269)
	at org.joda.time.DateTime.property(DateTime.java:1536)
	at org.joda.time.TestDateTime_Basics.testProperty(TestDateTime_Basics.java:1273)

testProperty(org.joda.time.TestMutableDateTime_Basics)  Time elapsed: 0.001 sec  <<< ERROR!
java.lang.NullPointerException
	at org.joda.time.field.UnsupportedDateTimeField.getInstance(UnsupportedDateTimeField.java:22)
	at org.joda.time.TestMutableDateTime_Basics$1.getField(TestMutableDateTime_Basics.java:742)
	at org.joda.time.MutableDateTime.property(MutableDateTime.java:1043)
	at org.joda.time.TestMutableDateTime_Basics.testProperty(TestMutableDateTime_Basics.java:746)

testProperty(org.joda.time.TestDateMidnight_Basics)  Time elapsed: 0.002 sec  <<< ERROR!
java.lang.NullPointerException
	at org.joda.time.field.UnsupportedDateTimeField.getInstance(UnsupportedDateTimeField.java:22)
	at org.joda.time.TestDateMidnight_Basics$1.getField(TestDateMidnight_Basics.java:1002)
	at org.joda.time.DateMidnight.property(DateMidnight.java:854)
	at org.joda.time.TestDateMidnight_Basics.testProperty(TestDateMidnight_Basics.java:1006)

test_constructor1(org.joda.time.field.TestOffsetDateTimeField)  Time elapsed: 0.001 sec  <<< ERROR!
java.lang.NullPointerException
	at org.joda.time.field.UnsupportedDateTimeField.getInstance(UnsupportedDateTimeField.java:22)
	at org.joda.time.field.TestOffsetDateTimeField.test_constructor1(TestOffsetDateTimeField.java:74)

testToString(org.joda.time.field.TestUnsupportedDateTimeField)  Time elapsed: 0.001 sec  <<< ERROR!
java.lang.NullPointerException
	at org.joda.time.field.UnsupportedDateTimeField.getInstance(UnsupportedDateTimeField.java:22)
	at org.joda.time.field.TestUnsupportedDateTimeField.testToString(TestUnsupportedDateTimeField.java:649)

testNullValuesToGetInstanceThrowsException(org.joda.time.field.TestUnsupportedDateTimeField)  Time elapsed: 0 sec  <<< ERROR!
java.lang.NullPointerException
	at org.joda.time.field.UnsupportedDateTimeField.getInstance(UnsupportedDateTimeField.java:22)
	at org.joda.time.field.TestUnsupportedDateTimeField.testNullValuesToGetInstanceThrowsException(TestUnsupportedDateTimeField.java:61)

testDifferentDurationReturnDifferentObjects(org.joda.time.field.TestUnsupportedDateTimeField)  Time elapsed: 0.001 sec  <<< ERROR!
java.lang.NullPointerException
	at org.joda.time.field.UnsupportedDateTimeField.getInstance(UnsupportedDateTimeField.java:22)
	at org.joda.time.field.TestUnsupportedDateTimeField.testDifferentDurationReturnDifferentObjects(TestUnsupportedDateTimeField.java:85)

testPublicGetNameMethod(org.joda.time.field.TestUnsupportedDateTimeField)  Time elapsed: 0 sec  <<< ERROR!
java.lang.NullPointerException
	at org.joda.time.field.UnsupportedDateTimeField.getInstance(UnsupportedDateTimeField.java:22)
	at org.joda.time.field.TestUnsupportedDateTimeField.testPublicGetNameMethod(TestUnsupportedDateTimeField.java:109)

testAlwaysFalseReturnTypes(org.joda.time.field.TestUnsupportedDateTimeField)  Time elapsed: 0.001 sec  <<< ERROR!
java.lang.NullPointerException
	at org.joda.time.field.UnsupportedDateTimeField.getInstance(UnsupportedDateTimeField.java:22)
	at org.joda.time.field.TestUnsupportedDateTimeField.testAlwaysFalseReturnTypes(TestUnsupportedDateTimeField.java:122)

testMethodsThatShouldAlwaysReturnNull(org.joda.time.field.TestUnsupportedDateTimeField)  Time elapsed: 0.001 sec  <<< ERROR!
java.lang.NullPointerException
	at org.joda.time.field.UnsupportedDateTimeField.getInstance(UnsupportedDateTimeField.java:22)
	at org.joda.time.field.TestUnsupportedDateTimeField.testMethodsThatShouldAlwaysReturnNull(TestUnsupportedDateTimeField.java:137)

testUnsupportedMethods(org.joda.time.field.TestUnsupportedDateTimeField)  Time elapsed: 0 sec  <<< ERROR!
java.lang.NullPointerException
	at org.joda.time.field.UnsupportedDateTimeField.getInstance(UnsupportedDateTimeField.java:22)
	at org.joda.time.field.TestUnsupportedDateTimeField.testUnsupportedMethods(TestUnsupportedDateTimeField.java:177)

testDelegatedMethods(org.joda.time.field.TestUnsupportedDateTimeField)  Time elapsed: 0.001 sec  <<< ERROR!
java.lang.NullPointerException
	at org.joda.time.field.UnsupportedDateTimeField.getInstance(UnsupportedDateTimeField.java:22)
	at org.joda.time.field.TestUnsupportedDateTimeField.testDelegatedMethods(TestUnsupportedDateTimeField.java:549)


Results :

Tests in error: 
  org.joda.time.TestDateMidnight_Basics#testProperty NullPointerException
  org.joda.time.TestDateTime_Basics#testProperty NullPointerException
  org.joda.time.TestMutableDateTime_Basics#testProperty NullPointerException
  org.joda.time.field.TestOffsetDateTimeField#test_constructor1 NullPointerException
  org.joda.time.field.TestUnsupportedDateTimeField#testAlwaysFalseReturnTypes NullPointerException
  org.joda.time.field.TestUnsupportedDateTimeField#testDelegatedMethods NullPointerException
  org.joda.time.field.TestUnsupportedDateTimeField#testDifferentDurationReturnDifferentObjects NullPointerException
  org.joda.time.field.TestUnsupportedDateTimeField#testMethodsThatShouldAlwaysReturnNull NullPointerException
  org.joda.time.field.TestUnsupportedDateTimeField#testNullValuesToGetInstanceThrowsException NullPointerException
  org.joda.time.field.TestUnsupportedDateTimeField#testPublicGetNameMethod NullPointerException
  org.joda.time.field.TestUnsupportedDateTimeField#testToString NullPointerException
  org.joda.time.field.TestUnsupportedDateTimeField#testUnsupportedMethods NullPointerException

Tests run: 4157, Failures: 0, Errors: 12, Skipped: 0

[INFO] ------------------------------------------------------------------------
[INFO] BUILD FAILURE
[INFO] ------------------------------------------------------------------------
[INFO] Total time: 15.677s
[INFO] Finished at: Thu Aug 06 05:40:31 BST 2015
[INFO] Final Memory: 8M/213M
[INFO] ------------------------------------------------------------------------
[ERROR] Failed to execute goal org.apache.maven.plugins:maven-surefire-plugin:2.18.1:test (default-test) on project joda-time: There are test failures.
[ERROR] 
[ERROR] Please refer to /home/perham/Study/LittleDarwin/Cases/joda-time-2.8.1/target/surefire-reports for the individual test results.
[ERROR] -> [Help 1]
[ERROR] 
[ERROR] To see the full stack trace of the errors, re-run Maven with the -e switch.
[ERROR] Re-run Maven using the -X switch to enable full debug logging.
[ERROR] 
[ERROR] For more information about the errors and possible solutions, please read the following articles:
[ERROR] [Help 1] http://cwiki.apache.org/confluence/display/MAVEN/MojoFailureException
