[INFO] Scanning for projects...
[INFO]                                                                         
[INFO] ------------------------------------------------------------------------
[INFO] Building Joda-Time 2.8.1
[INFO] ------------------------------------------------------------------------
[INFO] 
[INFO] --- maven-resources-plugin:2.7:resources (default-resources) @ joda-time ---
[INFO] Using 'UTF-8' encoding to copy filtered resources.
[INFO] Copying 2 resources to META-INF
[INFO] Copying 10 resources
[INFO] 
[INFO] --- maven-compiler-plugin:3.3:compile (default-compile) @ joda-time ---
[INFO] Changes detected - recompiling the module!
[INFO] Compiling 166 source files to /home/perham/Study/LittleDarwin/Cases/joda-time-2.8.1/target/classes
[INFO] 
[INFO] --- exec-maven-plugin:1.4.0:java (compile-tzdb) @ joda-time ---
Writing zoneinfo files
Writing ZoneInfoMap
[INFO] 
[INFO] --- maven-resources-plugin:2.7:testResources (default-testResources) @ joda-time ---
[INFO] Using 'UTF-8' encoding to copy filtered resources.
[INFO] Copying 34 resources
[INFO] 
[INFO] --- maven-compiler-plugin:3.3:testCompile (default-testCompile) @ joda-time ---
[INFO] Nothing to compile - all classes are up to date
[INFO] 
[INFO] --- maven-surefire-plugin:2.18.1:test (default-test) @ joda-time ---
[INFO] Surefire report directory: /home/perham/Study/LittleDarwin/Cases/joda-time-2.8.1/target/surefire-reports

-------------------------------------------------------
 T E S T S
-------------------------------------------------------
Running org.joda.time.TestAllPackages

TestBuddhistChronology.testCalendar

TestCopticChronology.testCalendar

TestEthiopicChronology.testCalendar

TestIslamicChronology.testCalendar

Testing Gregorian chronology over 1000 iterations
100% complete (i=1000)

Testing Julian chronology over 1000 iterations
100% complete (i=1000)
Writing zoneinfo files
Writing ZoneInfoMap
Tests run: 4157, Failures: 0, Errors: 8, Skipped: 0, Time elapsed: 5.273 sec <<< FAILURE! - in org.joda.time.TestAllPackages
testPropertyEqualsHashCodeStrict(org.joda.time.TestDateTime_Properties)  Time elapsed: 0.004 sec  <<< ERROR!
java.lang.UnsupportedOperationException: year field is unsupported
	at org.joda.time.field.UnsupportedDateTimeField.unsupported(UnsupportedDateTimeField.java:544)
	at org.joda.time.field.UnsupportedDateTimeField.set(UnsupportedDateTimeField.java:297)
	at org.joda.time.chrono.BaseChronology.getDateTimeMillis(BaseChronology.java:132)
	at org.joda.time.chrono.AssembledChronology.getDateTimeMillis(AssembledChronology.java:136)
	at org.joda.time.base.BaseDateTime.<init>(BaseDateTime.java:258)
	at org.joda.time.DateTime.<init>(DateTime.java:532)
	at org.joda.time.TestDateTime_Properties.testPropertyEqualsHashCodeStrict(TestDateTime_Properties.java:1386)

testPropertyEqualsHashCodeStrict(org.joda.time.TestDateMidnight_Properties)  Time elapsed: 0.002 sec  <<< ERROR!
java.lang.UnsupportedOperationException: year field is unsupported
	at org.joda.time.field.UnsupportedDateTimeField.unsupported(UnsupportedDateTimeField.java:544)
	at org.joda.time.field.UnsupportedDateTimeField.set(UnsupportedDateTimeField.java:297)
	at org.joda.time.chrono.BaseChronology.getDateTimeMillis(BaseChronology.java:132)
	at org.joda.time.chrono.AssembledChronology.getDateTimeMillis(AssembledChronology.java:136)
	at org.joda.time.base.BaseDateTime.<init>(BaseDateTime.java:258)
	at org.joda.time.DateMidnight.<init>(DateMidnight.java:350)
	at org.joda.time.TestDateMidnight_Properties.testPropertyEqualsHashCodeStrict(TestDateMidnight_Properties.java:534)

testEqualsHashCodeStrict(org.joda.time.TestLocalDate_Basics)  Time elapsed: 0.001 sec  <<< ERROR!
java.lang.UnsupportedOperationException: year field is unsupported
	at org.joda.time.field.UnsupportedDateTimeField.unsupported(UnsupportedDateTimeField.java:544)
	at org.joda.time.field.UnsupportedDateTimeField.set(UnsupportedDateTimeField.java:297)
	at org.joda.time.chrono.BaseChronology.getDateTimeMillis(BaseChronology.java:102)
	at org.joda.time.chrono.AssembledChronology.getDateTimeMillis(AssembledChronology.java:122)
	at org.joda.time.LocalDate.<init>(LocalDate.java:457)
	at org.joda.time.TestLocalDate_Basics.testEqualsHashCodeStrict(TestLocalDate_Basics.java:299)

testPropertyEqualsHashCodeStrict(org.joda.time.TestLocalDate_Properties)  Time elapsed: 0 sec  <<< ERROR!
java.lang.UnsupportedOperationException: year field is unsupported
	at org.joda.time.field.UnsupportedDateTimeField.unsupported(UnsupportedDateTimeField.java:544)
	at org.joda.time.field.UnsupportedDateTimeField.set(UnsupportedDateTimeField.java:297)
	at org.joda.time.chrono.BaseChronology.getDateTimeMillis(BaseChronology.java:102)
	at org.joda.time.chrono.AssembledChronology.getDateTimeMillis(AssembledChronology.java:122)
	at org.joda.time.LocalDate.<init>(LocalDate.java:457)
	at org.joda.time.TestLocalDate_Properties.testPropertyEqualsHashCodeStrict(TestLocalDate_Properties.java:538)

testPropertyEqualsHashCodeStrict(org.joda.time.TestYearMonthDay_Properties)  Time elapsed: 0 sec  <<< ERROR!
java.lang.UnsupportedOperationException: year field is unsupported
	at org.joda.time.field.UnsupportedDateTimeField.unsupported(UnsupportedDateTimeField.java:544)
	at org.joda.time.field.UnsupportedDateTimeField.getMinimumValue(UnsupportedDateTimeField.java:388)
	at org.joda.time.chrono.BaseChronology.validate(BaseChronology.java:187)
	at org.joda.time.base.BasePartial.<init>(BasePartial.java:183)
	at org.joda.time.YearMonthDay.<init>(YearMonthDay.java:288)
	at org.joda.time.TestYearMonthDay_Properties.testPropertyEqualsHashCodeStrict(TestYearMonthDay_Properties.java:542)

testPropertyEqualsHashCodeStrict(org.joda.time.TestYearMonth_Properties)  Time elapsed: 0.001 sec  <<< ERROR!
java.lang.UnsupportedOperationException: year field is unsupported
	at org.joda.time.field.UnsupportedDateTimeField.unsupported(UnsupportedDateTimeField.java:544)
	at org.joda.time.field.UnsupportedDateTimeField.getMinimumValue(UnsupportedDateTimeField.java:388)
	at org.joda.time.chrono.BaseChronology.validate(BaseChronology.java:187)
	at org.joda.time.base.BasePartial.<init>(BasePartial.java:183)
	at org.joda.time.YearMonth.<init>(YearMonth.java:344)
	at org.joda.time.TestYearMonth_Properties.testPropertyEqualsHashCodeStrict(TestYearMonth_Properties.java:350)

testPropertyEqualsHashCodeStrict(org.joda.time.TestMonthDay_Properties)  Time elapsed: 0.001 sec  <<< ERROR!
java.lang.UnsupportedOperationException: monthOfYear field is unsupported
	at org.joda.time.field.UnsupportedDateTimeField.unsupported(UnsupportedDateTimeField.java:544)
	at org.joda.time.field.UnsupportedDateTimeField.getMinimumValue(UnsupportedDateTimeField.java:388)
	at org.joda.time.chrono.BaseChronology.validate(BaseChronology.java:187)
	at org.joda.time.base.BasePartial.<init>(BasePartial.java:183)
	at org.joda.time.MonthDay.<init>(MonthDay.java:352)
	at org.joda.time.TestMonthDay_Properties.testPropertyEqualsHashCodeStrict(TestMonthDay_Properties.java:332)

test_strictChrononolgy_Chicago(org.joda.time.chrono.TestLenientChronology)  Time elapsed: 0 sec  <<< ERROR!
java.lang.UnsupportedOperationException: year field is unsupported
	at org.joda.time.field.UnsupportedDateTimeField.unsupported(UnsupportedDateTimeField.java:544)
	at org.joda.time.field.UnsupportedDateTimeField.set(UnsupportedDateTimeField.java:297)
	at org.joda.time.chrono.BaseChronology.getDateTimeMillis(BaseChronology.java:132)
	at org.joda.time.chrono.AssembledChronology.getDateTimeMillis(AssembledChronology.java:136)
	at org.joda.time.base.BaseDateTime.<init>(BaseDateTime.java:258)
	at org.joda.time.DateTime.<init>(DateTime.java:532)
	at org.joda.time.chrono.TestLenientChronology.test_strictChrononolgy_Chicago(TestLenientChronology.java:152)


Results :

Tests in error: 
  org.joda.time.TestDateMidnight_Properties#testPropertyEqualsHashCodeStrict UnsupportedOperationException
  org.joda.time.TestDateTime_Properties#testPropertyEqualsHashCodeStrict UnsupportedOperationException
  org.joda.time.TestLocalDate_Basics#testEqualsHashCodeStrict UnsupportedOperationException
  org.joda.time.TestLocalDate_Properties#testPropertyEqualsHashCodeStrict UnsupportedOperationException
  org.joda.time.TestMonthDay_Properties#testPropertyEqualsHashCodeStrict UnsupportedOperationException
  org.joda.time.TestYearMonthDay_Properties#testPropertyEqualsHashCodeStrict UnsupportedOperationException
  org.joda.time.TestYearMonth_Properties#testPropertyEqualsHashCodeStrict UnsupportedOperationException
  org.joda.time.chrono.TestLenientChronology#test_strictChrononolgy_Chicago UnsupportedOperationException

Tests run: 4157, Failures: 0, Errors: 8, Skipped: 0

[INFO] ------------------------------------------------------------------------
[INFO] BUILD FAILURE
[INFO] ------------------------------------------------------------------------
[INFO] Total time: 15.160s
[INFO] Finished at: Thu Aug 06 05:38:28 BST 2015
[INFO] Final Memory: 9M/209M
[INFO] ------------------------------------------------------------------------
[ERROR] Failed to execute goal org.apache.maven.plugins:maven-surefire-plugin:2.18.1:test (default-test) on project joda-time: There are test failures.
[ERROR] 
[ERROR] Please refer to /home/perham/Study/LittleDarwin/Cases/joda-time-2.8.1/target/surefire-reports for the individual test results.
[ERROR] -> [Help 1]
[ERROR] 
[ERROR] To see the full stack trace of the errors, re-run Maven with the -e switch.
[ERROR] Re-run Maven using the -X switch to enable full debug logging.
[ERROR] 
[ERROR] For more information about the errors and possible solutions, please read the following articles:
[ERROR] [Help 1] http://cwiki.apache.org/confluence/display/MAVEN/MojoFailureException
