[INFO] Scanning for projects...
[INFO]                                                                         
[INFO] ------------------------------------------------------------------------
[INFO] Building Joda-Time 2.8.1
[INFO] ------------------------------------------------------------------------
[INFO] 
[INFO] --- maven-resources-plugin:2.7:resources (default-resources) @ joda-time ---
[INFO] Using 'UTF-8' encoding to copy filtered resources.
[INFO] Copying 2 resources to META-INF
[INFO] Copying 10 resources
[INFO] 
[INFO] --- maven-compiler-plugin:3.3:compile (default-compile) @ joda-time ---
[INFO] Changes detected - recompiling the module!
[INFO] Compiling 166 source files to /home/perham/Study/LittleDarwin/Cases/joda-time-2.8.1/target/classes
[INFO] 
[INFO] --- exec-maven-plugin:1.4.0:java (compile-tzdb) @ joda-time ---
Writing zoneinfo files
Writing ZoneInfoMap
[INFO] 
[INFO] --- maven-resources-plugin:2.7:testResources (default-testResources) @ joda-time ---
[INFO] Using 'UTF-8' encoding to copy filtered resources.
[INFO] Copying 34 resources
[INFO] 
[INFO] --- maven-compiler-plugin:3.3:testCompile (default-testCompile) @ joda-time ---
[INFO] Nothing to compile - all classes are up to date
[INFO] 
[INFO] --- maven-surefire-plugin:2.18.1:test (default-test) @ joda-time ---
[INFO] Surefire report directory: /home/perham/Study/LittleDarwin/Cases/joda-time-2.8.1/target/surefire-reports

-------------------------------------------------------
 T E S T S
-------------------------------------------------------
Running org.joda.time.TestAllPackages

TestBuddhistChronology.testCalendar

TestCopticChronology.testCalendar

TestEthiopicChronology.testCalendar

TestIslamicChronology.testCalendar

Testing Gregorian chronology over 1000 iterations
Failure on dayOfMonth.remainder
org.joda.time.chrono.gj.TestGJDayOfMonthField
	vs. org.joda.time.chrono.BasicDayOfMonthDateTimeField
Datetime: Sat 1960-03-26T03:29:34.-308261626Z / 1960-W12-6
Millis from 1970: -308262625532
Thu 1970-01-01T03:29:34.468Z / 1970-W1-4 != Thu 1970-01-01T23:59:56.432Z / 1970-W1-4
12574468 != 86396432
Original value as reported by first field: 26
Original value as reported by second field: 26
First new value as reported by first field: 1
First new value as reported by second field: 1
Second new value as reported by first field: 1
Second new value as reported by second field: 1
Failure index: 0
Test millis: -308262625532
Test value: -49
Test millis2: -46922557997542

Testing Julian chronology over 1000 iterations
Failure on dayOfMonth.remainder
org.joda.time.chrono.gj.TestJulianDayOfMonthField
	vs. org.joda.time.chrono.BasicDayOfMonthDateTimeField
Datetime: Sat 1960-03-13T03:29:34.-308261626Z / 1960-W11-6
Millis from 1970: -308262625532
Thu 1969-12-19T03:29:34.468Z / 1969-W51-4 != Thu 1969-12-19T23:59:56.432Z / 1969-W51-4
12574468 != 86396432
Original value as reported by first field: 13
Original value as reported by second field: 13
First new value as reported by first field: 19
First new value as reported by second field: 19
Second new value as reported by first field: 19
Second new value as reported by second field: 19
Failure index: 0
Test millis: -308262625532
Test value: -49
Test millis2: -46922557997542
Writing zoneinfo files
Writing ZoneInfoMap
Tests run: 4157, Failures: 10, Errors: 0, Skipped: 0, Time elapsed: 4.959 sec <<< FAILURE! - in org.joda.time.TestAllPackages
testPropertySetYear(org.joda.time.TestDateTime_Properties)  Time elapsed: 0.005 sec  <<< FAILURE!
junit.framework.ComparisonFailure: expected:<1960-06-09T00:00:00.[0]00+01:00> but was:<1960-06-09T00:00:00.[-3017942]00+01:00>
	at junit.framework.Assert.assertEquals(Assert.java:81)
	at junit.framework.Assert.assertEquals(Assert.java:87)
	at org.joda.time.TestDateTime_Properties.testPropertySetYear(TestDateTime_Properties.java:289)

testPropertySetTextYear(org.joda.time.TestDateTime_Properties)  Time elapsed: 0.001 sec  <<< FAILURE!
junit.framework.ComparisonFailure: expected:<1960-06-09T00:00:00.[0]00+01:00> but was:<1960-06-09T00:00:00.[-3017942]00+01:00>
	at junit.framework.Assert.assertEquals(Assert.java:81)
	at junit.framework.Assert.assertEquals(Assert.java:87)
	at org.joda.time.TestDateTime_Properties.testPropertySetTextYear(TestDateTime_Properties.java:296)

testPropertyWithMaximumValueMillisOfDayDSTGap(org.joda.time.TestDateTime_Properties)  Time elapsed: 0.001 sec  <<< FAILURE!
junit.framework.ComparisonFailure: expected:<1926-04-17T22:59:59.[999]Z> but was:<1926-04-17T22:59:59.[-1379292201]Z>
	at junit.framework.Assert.assertEquals(Assert.java:81)
	at junit.framework.Assert.assertEquals(Assert.java:87)
	at org.joda.time.TestDateTime_Properties.testPropertyWithMaximumValueMillisOfDayDSTGap(TestDateTime_Properties.java:651)

testPropertySetYear(org.joda.time.TestMutableDateTime_Properties)  Time elapsed: 0.001 sec  <<< FAILURE!
junit.framework.ComparisonFailure: expected:<1960-06-09T00:00:00.[0]00+01:00> but was:<1960-06-09T00:00:00.[-3017942]00+01:00>
	at junit.framework.Assert.assertEquals(Assert.java:81)
	at junit.framework.Assert.assertEquals(Assert.java:87)
	at org.joda.time.TestMutableDateTime_Properties.testPropertySetYear(TestMutableDateTime_Properties.java:222)

testPropertySetTextYear(org.joda.time.TestMutableDateTime_Properties)  Time elapsed: 0.001 sec  <<< FAILURE!
junit.framework.ComparisonFailure: expected:<1960-06-09T00:00:00.[0]00+01:00> but was:<1960-06-09T00:00:00.[-3017942]00+01:00>
	at junit.framework.Assert.assertEquals(Assert.java:81)
	at junit.framework.Assert.assertEquals(Assert.java:87)
	at org.joda.time.TestMutableDateTime_Properties.testPropertySetTextYear(TestMutableDateTime_Properties.java:228)

testSecond(org.joda.time.TestDateTimeComparator)  Time elapsed: 0.001 sec  <<< FAILURE!
junit.framework.AssertionFailedError: SecondM1a expected:<-1> but was:<1>
	at junit.framework.Assert.fail(Assert.java:47)
	at junit.framework.Assert.failNotEquals(Assert.java:280)
	at junit.framework.Assert.assertEquals(Assert.java:64)
	at junit.framework.Assert.assertEquals(Assert.java:198)
	at org.joda.time.TestDateTimeComparator.testSecond(TestDateTimeComparator.java:436)

testMinute(org.joda.time.TestDateTimeComparator)  Time elapsed: 0.001 sec  <<< FAILURE!
junit.framework.AssertionFailedError: MinuteM1a expected:<-1> but was:<0>
	at junit.framework.Assert.fail(Assert.java:47)
	at junit.framework.Assert.failNotEquals(Assert.java:280)
	at junit.framework.Assert.assertEquals(Assert.java:64)
	at junit.framework.Assert.assertEquals(Assert.java:198)
	at org.joda.time.TestDateTimeComparator.testMinute(TestDateTimeComparator.java:450)

testHour(org.joda.time.TestDateTimeComparator)  Time elapsed: 0 sec  <<< FAILURE!
junit.framework.AssertionFailedError: HourM1a expected:<-1> but was:<0>
	at junit.framework.Assert.fail(Assert.java:47)
	at junit.framework.Assert.failNotEquals(Assert.java:280)
	at junit.framework.Assert.assertEquals(Assert.java:64)
	at junit.framework.Assert.assertEquals(Assert.java:198)
	at org.joda.time.TestDateTimeComparator.testHour(TestDateTimeComparator.java:464)

testChronology(org.joda.time.chrono.gj.MainTest)  Time elapsed: 0.003 sec  <<< FAILURE!
junit.framework.AssertionFailedError
	at junit.framework.Assert.fail(Assert.java:47)
	at org.joda.time.chrono.gj.MainTest.testChronology(MainTest.java:158)

testChronology(org.joda.time.chrono.gj.MainTest)  Time elapsed: 0.002 sec  <<< FAILURE!
junit.framework.AssertionFailedError
	at junit.framework.Assert.fail(Assert.java:47)
	at org.joda.time.chrono.gj.MainTest.testChronology(MainTest.java:158)


Results :

Failed tests: 
  org.joda.time.TestDateTimeComparator#testHour AssertionFailedError HourM1a exp...
  org.joda.time.TestDateTimeComparator#testMinute AssertionFailedError MinuteM1a...
  org.joda.time.TestDateTimeComparator#testSecond AssertionFailedError SecondM1a...
  org.joda.time.TestDateTime_Properties#testPropertySetTextYear ComparisonFailure
  org.joda.time.TestDateTime_Properties#testPropertySetYear ComparisonFailure ex...
  org.joda.time.TestDateTime_Properties#testPropertyWithMaximumValueMillisOfDayDSTGap ComparisonFailure
  org.joda.time.TestMutableDateTime_Properties#testPropertySetTextYear ComparisonFailure
  org.joda.time.TestMutableDateTime_Properties#testPropertySetYear ComparisonFailure
org.joda.time.chrono.gj.MainTest.testChronology(org.joda.time.chrono.gj.MainTest)
  Run 1: org.joda.time.chrono.gj.MainTest#testChronology AssertionFailedError
  Run 2: org.joda.time.chrono.gj.MainTest#testChronology AssertionFailedError


Tests run: 4156, Failures: 9, Errors: 0, Skipped: 0

[INFO] ------------------------------------------------------------------------
[INFO] BUILD FAILURE
[INFO] ------------------------------------------------------------------------
[INFO] Total time: 14.730s
[INFO] Finished at: Thu Aug 06 05:08:58 BST 2015
[INFO] Final Memory: 8M/218M
[INFO] ------------------------------------------------------------------------
[ERROR] Failed to execute goal org.apache.maven.plugins:maven-surefire-plugin:2.18.1:test (default-test) on project joda-time: There are test failures.
[ERROR] 
[ERROR] Please refer to /home/perham/Study/LittleDarwin/Cases/joda-time-2.8.1/target/surefire-reports for the individual test results.
[ERROR] -> [Help 1]
[ERROR] 
[ERROR] To see the full stack trace of the errors, re-run Maven with the -e switch.
[ERROR] Re-run Maven using the -X switch to enable full debug logging.
[ERROR] 
[ERROR] For more information about the errors and possible solutions, please read the following articles:
[ERROR] [Help 1] http://cwiki.apache.org/confluence/display/MAVEN/MojoFailureException
