[INFO] Scanning for projects...
[INFO]                                                                         
[INFO] ------------------------------------------------------------------------
[INFO] Building Joda-Time 2.8.1
[INFO] ------------------------------------------------------------------------
[INFO] 
[INFO] --- maven-resources-plugin:2.7:resources (default-resources) @ joda-time ---
[INFO] Using 'UTF-8' encoding to copy filtered resources.
[INFO] Copying 2 resources to META-INF
[INFO] Copying 10 resources
[INFO] 
[INFO] --- maven-compiler-plugin:3.3:compile (default-compile) @ joda-time ---
[INFO] Changes detected - recompiling the module!
[INFO] Compiling 166 source files to /home/perham/Study/LittleDarwin/Cases/joda-time-2.8.1/target/classes
[INFO] 
[INFO] --- exec-maven-plugin:1.4.0:java (compile-tzdb) @ joda-time ---
Writing zoneinfo files
Writing ZoneInfoMap
[INFO] 
[INFO] --- maven-resources-plugin:2.7:testResources (default-testResources) @ joda-time ---
[INFO] Using 'UTF-8' encoding to copy filtered resources.
[INFO] Copying 34 resources
[INFO] 
[INFO] --- maven-compiler-plugin:3.3:testCompile (default-testCompile) @ joda-time ---
[INFO] Nothing to compile - all classes are up to date
[INFO] 
[INFO] --- maven-surefire-plugin:2.18.1:test (default-test) @ joda-time ---
[INFO] Surefire report directory: /home/perham/Study/LittleDarwin/Cases/joda-time-2.8.1/target/surefire-reports

-------------------------------------------------------
 T E S T S
-------------------------------------------------------
Running org.joda.time.TestAllPackages

TestBuddhistChronology.testCalendar

TestCopticChronology.testCalendar

TestEthiopicChronology.testCalendar

TestIslamicChronology.testCalendar

Testing Gregorian chronology over 1000 iterations
100% complete (i=1000)

Testing Julian chronology over 1000 iterations
100% complete (i=1000)
Writing zoneinfo files
Writing ZoneInfoMap
Tests run: 4157, Failures: 19, Errors: 0, Skipped: 0, Time elapsed: 5.257 sec <<< FAILURE! - in org.joda.time.TestAllPackages
testMultipliedBy(org.joda.time.TestPeriod_Basics)  Time elapsed: 0.004 sec  <<< FAILURE!
junit.framework.AssertionFailedError
	at junit.framework.Assert.fail(Assert.java:47)
	at junit.framework.Assert.fail(Assert.java:53)
	at org.joda.time.TestPeriod_Basics.testMultipliedBy(TestPeriod_Basics.java:981)

testNegated(org.joda.time.TestPeriod_Basics)  Time elapsed: 0 sec  <<< FAILURE!
junit.framework.AssertionFailedError
	at junit.framework.Assert.fail(Assert.java:47)
	at junit.framework.Assert.fail(Assert.java:53)
	at org.joda.time.TestPeriod_Basics.testNegated(TestPeriod_Basics.java:1012)

testMultipliedBy_int(org.joda.time.TestYears)  Time elapsed: 0.001 sec  <<< FAILURE!
junit.framework.AssertionFailedError
	at junit.framework.Assert.fail(Assert.java:47)
	at junit.framework.Assert.fail(Assert.java:53)
	at org.joda.time.TestYears.testMultipliedBy_int(TestYears.java:276)

testMultipliedBy_int(org.joda.time.TestMonths)  Time elapsed: 0.001 sec  <<< FAILURE!
junit.framework.AssertionFailedError
	at junit.framework.Assert.fail(Assert.java:47)
	at junit.framework.Assert.fail(Assert.java:53)
	at org.joda.time.TestMonths.testMultipliedBy_int(TestMonths.java:321)

testToStandardDays(org.joda.time.TestWeeks)  Time elapsed: 0 sec  <<< FAILURE!
junit.framework.AssertionFailedError
	at junit.framework.Assert.fail(Assert.java:47)
	at junit.framework.Assert.fail(Assert.java:53)
	at org.joda.time.TestWeeks.testToStandardDays(TestWeeks.java:220)

testToStandardHours(org.joda.time.TestWeeks)  Time elapsed: 0.001 sec  <<< FAILURE!
junit.framework.AssertionFailedError
	at junit.framework.Assert.fail(Assert.java:47)
	at junit.framework.Assert.fail(Assert.java:53)
	at org.joda.time.TestWeeks.testToStandardHours(TestWeeks.java:233)

testToStandardMinutes(org.joda.time.TestWeeks)  Time elapsed: 0 sec  <<< FAILURE!
junit.framework.AssertionFailedError
	at junit.framework.Assert.fail(Assert.java:47)
	at junit.framework.Assert.fail(Assert.java:53)
	at org.joda.time.TestWeeks.testToStandardMinutes(TestWeeks.java:246)

testToStandardSeconds(org.joda.time.TestWeeks)  Time elapsed: 0.001 sec  <<< FAILURE!
junit.framework.AssertionFailedError
	at junit.framework.Assert.fail(Assert.java:47)
	at junit.framework.Assert.fail(Assert.java:53)
	at org.joda.time.TestWeeks.testToStandardSeconds(TestWeeks.java:259)

testMultipliedBy_int(org.joda.time.TestWeeks)  Time elapsed: 0.001 sec  <<< FAILURE!
junit.framework.AssertionFailedError
	at junit.framework.Assert.fail(Assert.java:47)
	at junit.framework.Assert.fail(Assert.java:53)
	at org.joda.time.TestWeeks.testMultipliedBy_int(TestWeeks.java:355)

testToStandardHours(org.joda.time.TestDays)  Time elapsed: 0 sec  <<< FAILURE!
junit.framework.AssertionFailedError
	at junit.framework.Assert.fail(Assert.java:47)
	at junit.framework.Assert.fail(Assert.java:53)
	at org.joda.time.TestDays.testToStandardHours(TestDays.java:268)

testToStandardMinutes(org.joda.time.TestDays)  Time elapsed: 0 sec  <<< FAILURE!
junit.framework.AssertionFailedError
	at junit.framework.Assert.fail(Assert.java:47)
	at junit.framework.Assert.fail(Assert.java:53)
	at org.joda.time.TestDays.testToStandardMinutes(TestDays.java:281)

testToStandardSeconds(org.joda.time.TestDays)  Time elapsed: 0 sec  <<< FAILURE!
junit.framework.AssertionFailedError
	at junit.framework.Assert.fail(Assert.java:47)
	at junit.framework.Assert.fail(Assert.java:53)
	at org.joda.time.TestDays.testToStandardSeconds(TestDays.java:294)

testMultipliedBy_int(org.joda.time.TestDays)  Time elapsed: 0 sec  <<< FAILURE!
junit.framework.AssertionFailedError
	at junit.framework.Assert.fail(Assert.java:47)
	at junit.framework.Assert.fail(Assert.java:53)
	at org.joda.time.TestDays.testMultipliedBy_int(TestDays.java:390)

testToStandardMinutes(org.joda.time.TestHours)  Time elapsed: 0 sec  <<< FAILURE!
junit.framework.AssertionFailedError
	at junit.framework.Assert.fail(Assert.java:47)
	at junit.framework.Assert.fail(Assert.java:53)
	at org.joda.time.TestHours.testToStandardMinutes(TestHours.java:243)

testToStandardSeconds(org.joda.time.TestHours)  Time elapsed: 0.001 sec  <<< FAILURE!
junit.framework.AssertionFailedError
	at junit.framework.Assert.fail(Assert.java:47)
	at junit.framework.Assert.fail(Assert.java:53)
	at org.joda.time.TestHours.testToStandardSeconds(TestHours.java:256)

testMultipliedBy_int(org.joda.time.TestHours)  Time elapsed: 0 sec  <<< FAILURE!
junit.framework.AssertionFailedError
	at junit.framework.Assert.fail(Assert.java:47)
	at junit.framework.Assert.fail(Assert.java:53)
	at org.joda.time.TestHours.testMultipliedBy_int(TestHours.java:352)

testToStandardSeconds(org.joda.time.TestMinutes)  Time elapsed: 0 sec  <<< FAILURE!
junit.framework.AssertionFailedError
	at junit.framework.Assert.fail(Assert.java:47)
	at junit.framework.Assert.fail(Assert.java:53)
	at org.joda.time.TestMinutes.testToStandardSeconds(TestMinutes.java:239)

testMultipliedBy_int(org.joda.time.TestMinutes)  Time elapsed: 0 sec  <<< FAILURE!
junit.framework.AssertionFailedError
	at junit.framework.Assert.fail(Assert.java:47)
	at junit.framework.Assert.fail(Assert.java:53)
	at org.joda.time.TestMinutes.testMultipliedBy_int(TestMinutes.java:335)

testMultipliedBy_int(org.joda.time.TestSeconds)  Time elapsed: 0.001 sec  <<< FAILURE!
junit.framework.AssertionFailedError
	at junit.framework.Assert.fail(Assert.java:47)
	at junit.framework.Assert.fail(Assert.java:53)
	at org.joda.time.TestSeconds.testMultipliedBy_int(TestSeconds.java:325)


Results :

Failed tests: 
  org.joda.time.TestDays#testMultipliedBy_int AssertionFailedError
  org.joda.time.TestDays#testToStandardHours AssertionFailedError
  org.joda.time.TestDays#testToStandardMinutes AssertionFailedError
  org.joda.time.TestDays#testToStandardSeconds AssertionFailedError
  org.joda.time.TestHours#testMultipliedBy_int AssertionFailedError
  org.joda.time.TestHours#testToStandardMinutes AssertionFailedError
  org.joda.time.TestHours#testToStandardSeconds AssertionFailedError
  org.joda.time.TestMinutes#testMultipliedBy_int AssertionFailedError
  org.joda.time.TestMinutes#testToStandardSeconds AssertionFailedError
  org.joda.time.TestMonths#testMultipliedBy_int AssertionFailedError
  org.joda.time.TestPeriod_Basics#testMultipliedBy AssertionFailedError
  org.joda.time.TestPeriod_Basics#testNegated AssertionFailedError
  org.joda.time.TestSeconds#testMultipliedBy_int AssertionFailedError
  org.joda.time.TestWeeks#testMultipliedBy_int AssertionFailedError
  org.joda.time.TestWeeks#testToStandardDays AssertionFailedError
  org.joda.time.TestWeeks#testToStandardHours AssertionFailedError
  org.joda.time.TestWeeks#testToStandardMinutes AssertionFailedError
  org.joda.time.TestWeeks#testToStandardSeconds AssertionFailedError
  org.joda.time.TestYears#testMultipliedBy_int AssertionFailedError

Tests run: 4157, Failures: 19, Errors: 0, Skipped: 0

[INFO] ------------------------------------------------------------------------
[INFO] BUILD FAILURE
[INFO] ------------------------------------------------------------------------
[INFO] Total time: 15.389s
[INFO] Finished at: Thu Aug 06 04:51:34 BST 2015
[INFO] Final Memory: 9M/209M
[INFO] ------------------------------------------------------------------------
[ERROR] Failed to execute goal org.apache.maven.plugins:maven-surefire-plugin:2.18.1:test (default-test) on project joda-time: There are test failures.
[ERROR] 
[ERROR] Please refer to /home/perham/Study/LittleDarwin/Cases/joda-time-2.8.1/target/surefire-reports for the individual test results.
[ERROR] -> [Help 1]
[ERROR] 
[ERROR] To see the full stack trace of the errors, re-run Maven with the -e switch.
[ERROR] Re-run Maven using the -X switch to enable full debug logging.
[ERROR] 
[ERROR] For more information about the errors and possible solutions, please read the following articles:
[ERROR] [Help 1] http://cwiki.apache.org/confluence/display/MAVEN/MojoFailureException
