[INFO] Scanning for projects...
[INFO]                                                                         
[INFO] ------------------------------------------------------------------------
[INFO] Building Joda-Time 2.8.1
[INFO] ------------------------------------------------------------------------
[INFO] 
[INFO] --- maven-resources-plugin:2.7:resources (default-resources) @ joda-time ---
[INFO] Using 'UTF-8' encoding to copy filtered resources.
[INFO] Copying 2 resources to META-INF
[INFO] Copying 10 resources
[INFO] 
[INFO] --- maven-compiler-plugin:3.3:compile (default-compile) @ joda-time ---
[INFO] Changes detected - recompiling the module!
[INFO] Compiling 166 source files to /home/perham/Study/LittleDarwin/Cases/joda-time-2.8.1/target/classes
[INFO] 
[INFO] --- exec-maven-plugin:1.4.0:java (compile-tzdb) @ joda-time ---
Writing zoneinfo files
Writing ZoneInfoMap
[INFO] 
[INFO] --- maven-resources-plugin:2.7:testResources (default-testResources) @ joda-time ---
[INFO] Using 'UTF-8' encoding to copy filtered resources.
[INFO] Copying 34 resources
[INFO] 
[INFO] --- maven-compiler-plugin:3.3:testCompile (default-testCompile) @ joda-time ---
[INFO] Nothing to compile - all classes are up to date
[INFO] 
[INFO] --- maven-surefire-plugin:2.18.1:test (default-test) @ joda-time ---
[INFO] Surefire report directory: /home/perham/Study/LittleDarwin/Cases/joda-time-2.8.1/target/surefire-reports

-------------------------------------------------------
 T E S T S
-------------------------------------------------------
Running org.joda.time.TestAllPackages

TestBuddhistChronology.testCalendar

TestCopticChronology.testCalendar

TestEthiopicChronology.testCalendar

TestIslamicChronology.testCalendar

Testing Gregorian chronology over 1000 iterations
100% complete (i=1000)

Testing Julian chronology over 1000 iterations
100% complete (i=1000)
Writing zoneinfo files
Writing ZoneInfoMap
Tests run: 4157, Failures: 0, Errors: 24, Skipped: 0, Time elapsed: 5.181 sec <<< FAILURE! - in org.joda.time.TestAllPackages
testWithDurationAdded_RP_int(org.joda.time.TestDateTime_Basics)  Time elapsed: 0.006 sec  <<< ERROR!
java.lang.ArithmeticException: Multiplication overflows a long: -1 * 86400000
	at org.joda.time.field.FieldUtils.safeMultiply(FieldUtils.java:38)
	at org.joda.time.field.PreciseDurationField.add(PreciseDurationField.java:109)
	at org.joda.time.chrono.ZonedChronology$ZonedDurationField.add(ZonedChronology.java:323)
	at org.joda.time.chrono.LimitChronology$LimitDurationField.add(LimitChronology.java:424)
	at org.joda.time.chrono.BaseChronology.add(BaseChronology.java:307)
	at org.joda.time.DateTime.withPeriodAdded(DateTime.java:941)
	at org.joda.time.TestDateTime_Basics.testWithDurationAdded_RP_int(TestDateTime_Basics.java:1032)

testMinus_RP(org.joda.time.TestDateTime_Basics)  Time elapsed: 0.001 sec  <<< ERROR!
java.lang.ArithmeticException: Multiplication overflows a long: -1 * 604800000
	at org.joda.time.field.FieldUtils.safeMultiply(FieldUtils.java:38)
	at org.joda.time.field.PreciseDurationField.add(PreciseDurationField.java:109)
	at org.joda.time.chrono.ZonedChronology$ZonedDurationField.add(ZonedChronology.java:323)
	at org.joda.time.chrono.LimitChronology$LimitDurationField.add(LimitChronology.java:424)
	at org.joda.time.chrono.BaseChronology.add(BaseChronology.java:307)
	at org.joda.time.DateTime.withPeriodAdded(DateTime.java:941)
	at org.joda.time.DateTime.minus(DateTime.java:1286)
	at org.joda.time.TestDateTime_Basics.testMinus_RP(TestDateTime_Basics.java:1165)

testPropertyEqualsHashCodeLenient(org.joda.time.TestDateTime_Properties)  Time elapsed: 0.002 sec  <<< ERROR!
java.lang.ArithmeticException: Multiplication overflows a long: -1 * 3600000
	at org.joda.time.field.FieldUtils.safeMultiply(FieldUtils.java:38)
	at org.joda.time.field.PreciseDurationField.add(PreciseDurationField.java:109)
	at org.joda.time.field.BaseDateTimeField.add(BaseDateTimeField.java:267)
	at org.joda.time.chrono.LimitChronology$LimitDateTimeField.add(LimitChronology.java:485)
	at org.joda.time.field.LenientDateTimeField.set(LenientDateTimeField.java:74)
	at org.joda.time.chrono.BaseChronology.getDateTimeMillis(BaseChronology.java:135)
	at org.joda.time.chrono.AssembledChronology.getDateTimeMillis(AssembledChronology.java:136)
	at org.joda.time.base.BaseDateTime.<init>(BaseDateTime.java:258)
	at org.joda.time.DateTime.<init>(DateTime.java:532)
	at org.joda.time.TestDateTime_Properties.testPropertyEqualsHashCodeLenient(TestDateTime_Properties.java:1374)

testWithDurationAdded_RP_int(org.joda.time.TestDateMidnight_Basics)  Time elapsed: 0.001 sec  <<< ERROR!
java.lang.ArithmeticException: Multiplication overflows a long: -1 * 86400000
	at org.joda.time.field.FieldUtils.safeMultiply(FieldUtils.java:38)
	at org.joda.time.field.PreciseDurationField.add(PreciseDurationField.java:109)
	at org.joda.time.chrono.ZonedChronology$ZonedDurationField.add(ZonedChronology.java:323)
	at org.joda.time.chrono.LimitChronology$LimitDurationField.add(LimitChronology.java:424)
	at org.joda.time.chrono.BaseChronology.add(BaseChronology.java:307)
	at org.joda.time.DateMidnight.withPeriodAdded(DateMidnight.java:556)
	at org.joda.time.TestDateMidnight_Basics.testWithDurationAdded_RP_int(TestDateMidnight_Basics.java:845)

testMinus_RP(org.joda.time.TestDateMidnight_Basics)  Time elapsed: 0 sec  <<< ERROR!
java.lang.ArithmeticException: Multiplication overflows a long: -1 * 604800000
	at org.joda.time.field.FieldUtils.safeMultiply(FieldUtils.java:38)
	at org.joda.time.field.PreciseDurationField.add(PreciseDurationField.java:109)
	at org.joda.time.chrono.ZonedChronology$ZonedDurationField.add(ZonedChronology.java:323)
	at org.joda.time.chrono.LimitChronology$LimitDurationField.add(LimitChronology.java:424)
	at org.joda.time.chrono.BaseChronology.add(BaseChronology.java:307)
	at org.joda.time.DateMidnight.withPeriodAdded(DateMidnight.java:556)
	at org.joda.time.DateMidnight.minus(DateMidnight.java:742)
	at org.joda.time.TestDateMidnight_Basics.testMinus_RP(TestDateMidnight_Basics.java:938)

testPropertyEqualsHashCodeLenient(org.joda.time.TestDateMidnight_Properties)  Time elapsed: 0.001 sec  <<< ERROR!
java.lang.ArithmeticException: Multiplication overflows a long: -1 * 3600000
	at org.joda.time.field.FieldUtils.safeMultiply(FieldUtils.java:38)
	at org.joda.time.field.PreciseDurationField.add(PreciseDurationField.java:109)
	at org.joda.time.field.BaseDateTimeField.add(BaseDateTimeField.java:267)
	at org.joda.time.chrono.LimitChronology$LimitDateTimeField.add(LimitChronology.java:485)
	at org.joda.time.field.LenientDateTimeField.set(LenientDateTimeField.java:74)
	at org.joda.time.chrono.BaseChronology.getDateTimeMillis(BaseChronology.java:135)
	at org.joda.time.chrono.AssembledChronology.getDateTimeMillis(AssembledChronology.java:136)
	at org.joda.time.base.BaseDateTime.<init>(BaseDateTime.java:258)
	at org.joda.time.DateMidnight.<init>(DateMidnight.java:350)
	at org.joda.time.TestDateMidnight_Properties.testPropertyEqualsHashCodeLenient(TestDateMidnight_Properties.java:522)

testParse_noFormatter(org.joda.time.TestInterval_Constructors)  Time elapsed: 0.002 sec  <<< ERROR!
java.lang.ArithmeticException: Multiplication overflows a long: -1 * 86400000
	at org.joda.time.field.FieldUtils.safeMultiply(FieldUtils.java:38)
	at org.joda.time.field.PreciseDurationField.add(PreciseDurationField.java:109)
	at org.joda.time.chrono.ZonedChronology$ZonedDurationField.add(ZonedChronology.java:323)
	at org.joda.time.chrono.BaseChronology.add(BaseChronology.java:307)
	at org.joda.time.convert.StringConverter.setInto(StringConverter.java:232)
	at org.joda.time.base.BaseInterval.<init>(BaseInterval.java:200)
	at org.joda.time.Interval.<init>(Interval.java:193)
	at org.joda.time.Interval.parse(Interval.java:69)
	at org.joda.time.TestInterval_Constructors.testParse_noFormatter(TestInterval_Constructors.java:110)

testConstructor_RP_RI7(org.joda.time.TestInterval_Constructors)  Time elapsed: 0.001 sec  <<< ERROR!
java.lang.ArithmeticException: Multiplication overflows a long: -1 * 3600000
	at org.joda.time.field.FieldUtils.safeMultiply(FieldUtils.java:38)
	at org.joda.time.field.PreciseDurationField.add(PreciseDurationField.java:109)
	at org.joda.time.chrono.ZonedChronology$ZonedDurationField.add(ZonedChronology.java:323)
	at org.joda.time.chrono.BaseChronology.add(BaseChronology.java:307)
	at org.joda.time.base.BaseInterval.<init>(BaseInterval.java:175)
	at org.joda.time.Interval.<init>(Interval.java:176)
	at org.joda.time.TestInterval_Constructors.testConstructor_RP_RI7(TestInterval_Constructors.java:421)

testConstructor_RP_RI1(org.joda.time.TestInterval_Constructors)  Time elapsed: 0 sec  <<< ERROR!
java.lang.ArithmeticException: Multiplication overflows a long: -1 * 3600000
	at org.joda.time.field.FieldUtils.safeMultiply(FieldUtils.java:38)
	at org.joda.time.field.PreciseDurationField.add(PreciseDurationField.java:109)
	at org.joda.time.chrono.ZonedChronology$ZonedDurationField.add(ZonedChronology.java:323)
	at org.joda.time.chrono.BaseChronology.add(BaseChronology.java:307)
	at org.joda.time.base.BaseInterval.<init>(BaseInterval.java:175)
	at org.joda.time.Interval.<init>(Interval.java:176)
	at org.joda.time.TestInterval_Constructors.testConstructor_RP_RI1(TestInterval_Constructors.java:359)

testConstructor_RP_RI2(org.joda.time.TestInterval_Constructors)  Time elapsed: 0 sec  <<< ERROR!
java.lang.ArithmeticException: Multiplication overflows a long: -1 * 3600000
	at org.joda.time.field.FieldUtils.safeMultiply(FieldUtils.java:38)
	at org.joda.time.field.PreciseDurationField.add(PreciseDurationField.java:109)
	at org.joda.time.chrono.BaseChronology.add(BaseChronology.java:307)
	at org.joda.time.base.BaseInterval.<init>(BaseInterval.java:175)
	at org.joda.time.Interval.<init>(Interval.java:176)
	at org.joda.time.TestInterval_Constructors.testConstructor_RP_RI2(TestInterval_Constructors.java:372)

testConstructor_RP_RI3(org.joda.time.TestInterval_Constructors)  Time elapsed: 0.001 sec  <<< ERROR!
java.lang.ArithmeticException: Multiplication overflows a long: -1 * 3600000
	at org.joda.time.field.FieldUtils.safeMultiply(FieldUtils.java:38)
	at org.joda.time.field.PreciseDurationField.add(PreciseDurationField.java:109)
	at org.joda.time.chrono.LimitChronology$LimitDurationField.add(LimitChronology.java:424)
	at org.joda.time.chrono.BaseChronology.add(BaseChronology.java:307)
	at org.joda.time.base.BaseInterval.<init>(BaseInterval.java:175)
	at org.joda.time.Interval.<init>(Interval.java:176)
	at org.joda.time.TestInterval_Constructors.testConstructor_RP_RI3(TestInterval_Constructors.java:385)

testConstructor_RP_RI4(org.joda.time.TestInterval_Constructors)  Time elapsed: 0 sec  <<< ERROR!
java.lang.ArithmeticException: Multiplication overflows a long: -1 * 3600000
	at org.joda.time.field.FieldUtils.safeMultiply(FieldUtils.java:38)
	at org.joda.time.field.PreciseDurationField.add(PreciseDurationField.java:109)
	at org.joda.time.chrono.ZonedChronology$ZonedDurationField.add(ZonedChronology.java:323)
	at org.joda.time.chrono.BaseChronology.add(BaseChronology.java:307)
	at org.joda.time.base.BaseInterval.<init>(BaseInterval.java:175)
	at org.joda.time.Interval.<init>(Interval.java:176)
	at org.joda.time.TestInterval_Constructors.testConstructor_RP_RI4(TestInterval_Constructors.java:397)

testWithPeriodBeforeEnd1(org.joda.time.TestInterval_Basics)  Time elapsed: 0.001 sec  <<< ERROR!
java.lang.ArithmeticException: Multiplication overflows a long: -1 * 3600000
	at org.joda.time.field.FieldUtils.safeMultiply(FieldUtils.java:38)
	at org.joda.time.field.PreciseDurationField.add(PreciseDurationField.java:109)
	at org.joda.time.chrono.LimitChronology$LimitDurationField.add(LimitChronology.java:424)
	at org.joda.time.chrono.ZonedChronology$ZonedDurationField.add(ZonedChronology.java:323)
	at org.joda.time.chrono.BaseChronology.add(BaseChronology.java:307)
	at org.joda.time.Interval.withPeriodBeforeEnd(Interval.java:481)
	at org.joda.time.TestInterval_Basics.testWithPeriodBeforeEnd1(TestInterval_Basics.java:1255)

testMinus_RP(org.joda.time.TestLocalDateTime_Basics)  Time elapsed: 0.001 sec  <<< ERROR!
java.lang.ArithmeticException: Multiplication overflows a long: -1 * 604800000
	at org.joda.time.field.FieldUtils.safeMultiply(FieldUtils.java:38)
	at org.joda.time.field.PreciseDurationField.add(PreciseDurationField.java:109)
	at org.joda.time.chrono.LimitChronology$LimitDurationField.add(LimitChronology.java:424)
	at org.joda.time.chrono.BaseChronology.add(BaseChronology.java:307)
	at org.joda.time.LocalDateTime.withPeriodAdded(LocalDateTime.java:1062)
	at org.joda.time.LocalDateTime.minus(LocalDateTime.java:1311)
	at org.joda.time.TestLocalDateTime_Basics.testMinus_RP(TestLocalDateTime_Basics.java:626)

testMinus_RP(org.joda.time.TestLocalDate_Basics)  Time elapsed: 0.001 sec  <<< ERROR!
java.lang.ArithmeticException: Multiplication overflows a long: -1 * 604800000
	at org.joda.time.field.FieldUtils.safeMultiply(FieldUtils.java:38)
	at org.joda.time.field.PreciseDurationField.add(PreciseDurationField.java:109)
	at org.joda.time.chrono.LimitChronology$LimitDurationField.add(LimitChronology.java:424)
	at org.joda.time.LocalDate.withPeriodAdded(LocalDate.java:1169)
	at org.joda.time.LocalDate.minus(LocalDate.java:1312)
	at org.joda.time.TestLocalDate_Basics.testMinus_RP(TestLocalDate_Basics.java:570)

testMinus_RP(org.joda.time.TestLocalTime_Basics)  Time elapsed: 0 sec  <<< ERROR!
java.lang.ArithmeticException: Multiplication overflows a long: -1 * 604800000
	at org.joda.time.field.FieldUtils.safeMultiply(FieldUtils.java:38)
	at org.joda.time.field.PreciseDurationField.add(PreciseDurationField.java:109)
	at org.joda.time.chrono.LimitChronology$LimitDurationField.add(LimitChronology.java:424)
	at org.joda.time.chrono.BaseChronology.add(BaseChronology.java:307)
	at org.joda.time.LocalTime.withPeriodAdded(LocalTime.java:848)
	at org.joda.time.LocalTime.minus(LocalTime.java:978)
	at org.joda.time.TestLocalTime_Basics.testMinus_RP(TestLocalTime_Basics.java:591)

testParse_noFormatter(org.joda.time.TestMutableInterval_Constructors)  Time elapsed: 0 sec  <<< ERROR!
java.lang.ArithmeticException: Multiplication overflows a long: -1 * 86400000
	at org.joda.time.field.FieldUtils.safeMultiply(FieldUtils.java:38)
	at org.joda.time.field.PreciseDurationField.add(PreciseDurationField.java:109)
	at org.joda.time.chrono.ZonedChronology$ZonedDurationField.add(ZonedChronology.java:323)
	at org.joda.time.chrono.BaseChronology.add(BaseChronology.java:307)
	at org.joda.time.convert.StringConverter.setInto(StringConverter.java:232)
	at org.joda.time.base.BaseInterval.<init>(BaseInterval.java:197)
	at org.joda.time.MutableInterval.<init>(MutableInterval.java:186)
	at org.joda.time.MutableInterval.parse(MutableInterval.java:71)
	at org.joda.time.TestMutableInterval_Constructors.testParse_noFormatter(TestMutableInterval_Constructors.java:116)

testConstructor_RP_RI7(org.joda.time.TestMutableInterval_Constructors)  Time elapsed: 0 sec  <<< ERROR!
java.lang.ArithmeticException: Multiplication overflows a long: -1 * 3600000
	at org.joda.time.field.FieldUtils.safeMultiply(FieldUtils.java:38)
	at org.joda.time.field.PreciseDurationField.add(PreciseDurationField.java:109)
	at org.joda.time.chrono.ZonedChronology$ZonedDurationField.add(ZonedChronology.java:323)
	at org.joda.time.chrono.BaseChronology.add(BaseChronology.java:307)
	at org.joda.time.base.BaseInterval.<init>(BaseInterval.java:175)
	at org.joda.time.MutableInterval.<init>(MutableInterval.java:169)
	at org.joda.time.TestMutableInterval_Constructors.testConstructor_RP_RI7(TestMutableInterval_Constructors.java:397)

testConstructor_RP_RI1(org.joda.time.TestMutableInterval_Constructors)  Time elapsed: 0.001 sec  <<< ERROR!
java.lang.ArithmeticException: Multiplication overflows a long: -1 * 3600000
	at org.joda.time.field.FieldUtils.safeMultiply(FieldUtils.java:38)
	at org.joda.time.field.PreciseDurationField.add(PreciseDurationField.java:109)
	at org.joda.time.chrono.ZonedChronology$ZonedDurationField.add(ZonedChronology.java:323)
	at org.joda.time.chrono.BaseChronology.add(BaseChronology.java:307)
	at org.joda.time.base.BaseInterval.<init>(BaseInterval.java:175)
	at org.joda.time.MutableInterval.<init>(MutableInterval.java:169)
	at org.joda.time.TestMutableInterval_Constructors.testConstructor_RP_RI1(TestMutableInterval_Constructors.java:335)

testConstructor_RP_RI2(org.joda.time.TestMutableInterval_Constructors)  Time elapsed: 0 sec  <<< ERROR!
java.lang.ArithmeticException: Multiplication overflows a long: -1 * 3600000
	at org.joda.time.field.FieldUtils.safeMultiply(FieldUtils.java:38)
	at org.joda.time.field.PreciseDurationField.add(PreciseDurationField.java:109)
	at org.joda.time.chrono.BaseChronology.add(BaseChronology.java:307)
	at org.joda.time.base.BaseInterval.<init>(BaseInterval.java:175)
	at org.joda.time.MutableInterval.<init>(MutableInterval.java:169)
	at org.joda.time.TestMutableInterval_Constructors.testConstructor_RP_RI2(TestMutableInterval_Constructors.java:348)

testConstructor_RP_RI3(org.joda.time.TestMutableInterval_Constructors)  Time elapsed: 0.001 sec  <<< ERROR!
java.lang.ArithmeticException: Multiplication overflows a long: -1 * 3600000
	at org.joda.time.field.FieldUtils.safeMultiply(FieldUtils.java:38)
	at org.joda.time.field.PreciseDurationField.add(PreciseDurationField.java:109)
	at org.joda.time.chrono.BaseChronology.add(BaseChronology.java:307)
	at org.joda.time.base.BaseInterval.<init>(BaseInterval.java:175)
	at org.joda.time.MutableInterval.<init>(MutableInterval.java:169)
	at org.joda.time.TestMutableInterval_Constructors.testConstructor_RP_RI3(TestMutableInterval_Constructors.java:361)

testConstructor_RP_RI4(org.joda.time.TestMutableInterval_Constructors)  Time elapsed: 0 sec  <<< ERROR!
java.lang.ArithmeticException: Multiplication overflows a long: -1 * 3600000
	at org.joda.time.field.FieldUtils.safeMultiply(FieldUtils.java:38)
	at org.joda.time.field.PreciseDurationField.add(PreciseDurationField.java:109)
	at org.joda.time.chrono.ZonedChronology$ZonedDurationField.add(ZonedChronology.java:323)
	at org.joda.time.chrono.BaseChronology.add(BaseChronology.java:307)
	at org.joda.time.base.BaseInterval.<init>(BaseInterval.java:175)
	at org.joda.time.MutableInterval.<init>(MutableInterval.java:169)
	at org.joda.time.TestMutableInterval_Constructors.testConstructor_RP_RI4(TestMutableInterval_Constructors.java:373)

test_setDayOfMonth(org.joda.time.chrono.TestLenientChronology)  Time elapsed: 0.001 sec  <<< ERROR!
java.lang.ArithmeticException: Multiplication overflows a long: -1 * 86400000
	at org.joda.time.field.FieldUtils.safeMultiply(FieldUtils.java:38)
	at org.joda.time.field.PreciseDurationField.add(PreciseDurationField.java:109)
	at org.joda.time.field.BaseDateTimeField.add(BaseDateTimeField.java:267)
	at org.joda.time.field.LenientDateTimeField.set(LenientDateTimeField.java:74)
	at org.joda.time.DateTime.withDayOfMonth(DateTime.java:1782)
	at org.joda.time.chrono.TestLenientChronology.test_setDayOfMonth(TestLenientChronology.java:77)

test_setHourOfDay(org.joda.time.chrono.TestLenientChronology)  Time elapsed: 0 sec  <<< ERROR!
java.lang.ArithmeticException: Multiplication overflows a long: -1 * 3600000
	at org.joda.time.field.FieldUtils.safeMultiply(FieldUtils.java:38)
	at org.joda.time.field.PreciseDurationField.add(PreciseDurationField.java:109)
	at org.joda.time.field.BaseDateTimeField.add(BaseDateTimeField.java:267)
	at org.joda.time.field.LenientDateTimeField.set(LenientDateTimeField.java:74)
	at org.joda.time.DateTime.withHourOfDay(DateTime.java:1815)
	at org.joda.time.chrono.TestLenientChronology.test_setHourOfDay(TestLenientChronology.java:88)


Results :

Tests in error: 
  org.joda.time.TestDateMidnight_Basics#testMinus_RP ArithmeticException Multipl...
  org.joda.time.TestDateMidnight_Basics#testWithDurationAdded_RP_int ArithmeticException
  org.joda.time.TestDateMidnight_Properties#testPropertyEqualsHashCodeLenient ArithmeticException
  org.joda.time.TestDateTime_Basics#testMinus_RP ArithmeticException Multiplicat...
  org.joda.time.TestDateTime_Basics#testWithDurationAdded_RP_int ArithmeticException
  org.joda.time.TestDateTime_Properties#testPropertyEqualsHashCodeLenient ArithmeticException
  org.joda.time.TestInterval_Basics#testWithPeriodBeforeEnd1 ArithmeticException
  org.joda.time.TestInterval_Constructors#testConstructor_RP_RI1 ArithmeticException
  org.joda.time.TestInterval_Constructors#testConstructor_RP_RI2 ArithmeticException
  org.joda.time.TestInterval_Constructors#testConstructor_RP_RI3 ArithmeticException
  org.joda.time.TestInterval_Constructors#testConstructor_RP_RI4 ArithmeticException
  org.joda.time.TestInterval_Constructors#testConstructor_RP_RI7 ArithmeticException
  org.joda.time.TestInterval_Constructors#testParse_noFormatter ArithmeticException
  org.joda.time.TestLocalDateTime_Basics#testMinus_RP ArithmeticException Multip...
  org.joda.time.TestLocalDate_Basics#testMinus_RP ArithmeticException Multiplica...
  org.joda.time.TestLocalTime_Basics#testMinus_RP ArithmeticException Multiplica...
  org.joda.time.TestMutableInterval_Constructors#testConstructor_RP_RI1 ArithmeticException
  org.joda.time.TestMutableInterval_Constructors#testConstructor_RP_RI2 ArithmeticException
  org.joda.time.TestMutableInterval_Constructors#testConstructor_RP_RI3 ArithmeticException
  org.joda.time.TestMutableInterval_Constructors#testConstructor_RP_RI4 ArithmeticException
  org.joda.time.TestMutableInterval_Constructors#testConstructor_RP_RI7 ArithmeticException
  org.joda.time.TestMutableInterval_Constructors#testParse_noFormatter ArithmeticException
  org.joda.time.chrono.TestLenientChronology#test_setDayOfMonth ArithmeticException
  org.joda.time.chrono.TestLenientChronology#test_setHourOfDay ArithmeticException

Tests run: 4157, Failures: 0, Errors: 24, Skipped: 0

[INFO] ------------------------------------------------------------------------
[INFO] BUILD FAILURE
[INFO] ------------------------------------------------------------------------
[INFO] Total time: 15.858s
[INFO] Finished at: Thu Aug 06 04:50:07 BST 2015
[INFO] Final Memory: 8M/213M
[INFO] ------------------------------------------------------------------------
[ERROR] Failed to execute goal org.apache.maven.plugins:maven-surefire-plugin:2.18.1:test (default-test) on project joda-time: There are test failures.
[ERROR] 
[ERROR] Please refer to /home/perham/Study/LittleDarwin/Cases/joda-time-2.8.1/target/surefire-reports for the individual test results.
[ERROR] -> [Help 1]
[ERROR] 
[ERROR] To see the full stack trace of the errors, re-run Maven with the -e switch.
[ERROR] Re-run Maven using the -X switch to enable full debug logging.
[ERROR] 
[ERROR] For more information about the errors and possible solutions, please read the following articles:
[ERROR] [Help 1] http://cwiki.apache.org/confluence/display/MAVEN/MojoFailureException
