[INFO] Scanning for projects...
[INFO]                                                                         
[INFO] ------------------------------------------------------------------------
[INFO] Building Joda-Time 2.8.1
[INFO] ------------------------------------------------------------------------
[INFO] 
[INFO] --- maven-resources-plugin:2.7:resources (default-resources) @ joda-time ---
[INFO] Using 'UTF-8' encoding to copy filtered resources.
[INFO] Copying 2 resources to META-INF
[INFO] Copying 10 resources
[INFO] 
[INFO] --- maven-compiler-plugin:3.3:compile (default-compile) @ joda-time ---
[INFO] Changes detected - recompiling the module!
[INFO] Compiling 166 source files to /home/perham/Study/LittleDarwin/Cases/joda-time-2.8.1/target/classes
[INFO] 
[INFO] --- exec-maven-plugin:1.4.0:java (compile-tzdb) @ joda-time ---
Writing zoneinfo files
Writing ZoneInfoMap
[INFO] 
[INFO] --- maven-resources-plugin:2.7:testResources (default-testResources) @ joda-time ---
[INFO] Using 'UTF-8' encoding to copy filtered resources.
[INFO] Copying 34 resources
[INFO] 
[INFO] --- maven-compiler-plugin:3.3:testCompile (default-testCompile) @ joda-time ---
[INFO] Nothing to compile - all classes are up to date
[INFO] 
[INFO] --- maven-surefire-plugin:2.18.1:test (default-test) @ joda-time ---
[INFO] Surefire report directory: /home/perham/Study/LittleDarwin/Cases/joda-time-2.8.1/target/surefire-reports

-------------------------------------------------------
 T E S T S
-------------------------------------------------------
Running org.joda.time.TestAllPackages

TestBuddhistChronology.testCalendar

TestCopticChronology.testCalendar

TestEthiopicChronology.testCalendar

TestIslamicChronology.testCalendar

Testing Gregorian chronology over 1000 iterations
100% complete (i=1000)

Testing Julian chronology over 1000 iterations
100% complete (i=1000)
Writing zoneinfo files
Writing ZoneInfoMap
Tests run: 4157, Failures: 18, Errors: 2, Skipped: 0, Time elapsed: 5.282 sec <<< FAILURE! - in org.joda.time.TestAllPackages
testToStandardDays_overflow(org.joda.time.TestDuration_Basics)  Time elapsed: 0.004 sec  <<< FAILURE!
junit.framework.AssertionFailedError
	at junit.framework.Assert.fail(Assert.java:47)
	at junit.framework.Assert.fail(Assert.java:53)
	at org.joda.time.TestDuration_Basics.testToStandardDays_overflow(TestDuration_Basics.java:337)

testToStandardHours_overflow(org.joda.time.TestDuration_Basics)  Time elapsed: 0 sec  <<< FAILURE!
junit.framework.AssertionFailedError
	at junit.framework.Assert.fail(Assert.java:47)
	at junit.framework.Assert.fail(Assert.java:53)
	at org.joda.time.TestDuration_Basics.testToStandardHours_overflow(TestDuration_Basics.java:371)

testToStandardMinutes_overflow(org.joda.time.TestDuration_Basics)  Time elapsed: 0 sec  <<< FAILURE!
junit.framework.AssertionFailedError
	at junit.framework.Assert.fail(Assert.java:47)
	at junit.framework.Assert.fail(Assert.java:53)
	at org.joda.time.TestDuration_Basics.testToStandardMinutes_overflow(TestDuration_Basics.java:405)

testToStandardSeconds_overflow(org.joda.time.TestDuration_Basics)  Time elapsed: 0.001 sec  <<< FAILURE!
junit.framework.AssertionFailedError
	at junit.framework.Assert.fail(Assert.java:47)
	at junit.framework.Assert.fail(Assert.java:53)
	at org.joda.time.TestDuration_Basics.testToStandardSeconds_overflow(TestDuration_Basics.java:439)

testToStandardDays(org.joda.time.TestPeriod_Basics)  Time elapsed: 0.005 sec  <<< FAILURE!
junit.framework.AssertionFailedError
	at junit.framework.Assert.fail(Assert.java:47)
	at junit.framework.Assert.fail(Assert.java:53)
	at org.joda.time.TestPeriod_Basics.testToStandardDays(TestPeriod_Basics.java:1109)

testToStandardWeeks(org.joda.time.TestPeriod_Basics)  Time elapsed: 0.001 sec  <<< FAILURE!
junit.framework.AssertionFailedError
	at junit.framework.Assert.fail(Assert.java:47)
	at junit.framework.Assert.fail(Assert.java:53)
	at org.joda.time.TestPeriod_Basics.testToStandardWeeks(TestPeriod_Basics.java:1044)

testNormalizedStandard_yearMonth2(org.joda.time.TestPeriod_Basics)  Time elapsed: 0 sec  <<< ERROR!
java.lang.UnsupportedOperationException: Unable to normalize as PeriodType is missing either years or months but period has a month/year amount: P2147483647Y15M
	at org.joda.time.Period.normalizedStandard(Period.java:1660)
	at org.joda.time.Period.normalizedStandard(Period.java:1601)
	at org.joda.time.TestPeriod_Basics.testNormalizedStandard_yearMonth2(TestPeriod_Basics.java:1412)

testNormalizedStandard_weekDay2(org.joda.time.TestPeriod_Basics)  Time elapsed: 0.001 sec  <<< FAILURE!
junit.framework.AssertionFailedError
	at junit.framework.Assert.fail(Assert.java:47)
	at junit.framework.Assert.fail(Assert.java:53)
	at org.joda.time.TestPeriod_Basics.testNormalizedStandard_weekDay2(TestPeriod_Basics.java:1428)

testNormalizedStandard_periodType_yearMonth2(org.joda.time.TestPeriod_Basics)  Time elapsed: 0.003 sec  <<< ERROR!
java.lang.UnsupportedOperationException: Unable to normalize as PeriodType is missing either years or months but period has a month/year amount: P2147483647Y15M
	at org.joda.time.Period.normalizedStandard(Period.java:1660)
	at org.joda.time.TestPeriod_Basics.testNormalizedStandard_periodType_yearMonth2(TestPeriod_Basics.java:1471)

testNormalizedStandard_periodType_weekDay2(org.joda.time.TestPeriod_Basics)  Time elapsed: 0 sec  <<< FAILURE!
junit.framework.AssertionFailedError
	at junit.framework.Assert.fail(Assert.java:47)
	at junit.framework.Assert.fail(Assert.java:53)
	at org.joda.time.TestPeriod_Basics.testNormalizedStandard_periodType_weekDay2(TestPeriod_Basics.java:1495)

testToStandardHours(org.joda.time.TestPeriod_Basics)  Time elapsed: 0 sec  <<< FAILURE!
junit.framework.AssertionFailedError
	at junit.framework.Assert.fail(Assert.java:47)
	at junit.framework.Assert.fail(Assert.java:53)
	at org.joda.time.TestPeriod_Basics.testToStandardHours(TestPeriod_Basics.java:1173)

testToStandardMinutes(org.joda.time.TestPeriod_Basics)  Time elapsed: 0 sec  <<< FAILURE!
junit.framework.AssertionFailedError
	at junit.framework.Assert.fail(Assert.java:47)
	at junit.framework.Assert.fail(Assert.java:53)
	at org.joda.time.TestPeriod_Basics.testToStandardMinutes(TestPeriod_Basics.java:1236)

testToStandardSeconds(org.joda.time.TestPeriod_Basics)  Time elapsed: 0 sec  <<< FAILURE!
junit.framework.AssertionFailedError
	at junit.framework.Assert.fail(Assert.java:47)
	at junit.framework.Assert.fail(Assert.java:53)
	at org.joda.time.TestPeriod_Basics.testToStandardSeconds(TestPeriod_Basics.java:1296)

test_getValue_long(org.joda.time.field.TestMillisDurationField)  Time elapsed: 0.001 sec  <<< FAILURE!
junit.framework.AssertionFailedError
	at junit.framework.Assert.fail(Assert.java:47)
	at junit.framework.Assert.fail(Assert.java:53)
	at org.joda.time.field.TestMillisDurationField.test_getValue_long(TestMillisDurationField.java:87)

test_getValue_long_long(org.joda.time.field.TestMillisDurationField)  Time elapsed: 0 sec  <<< FAILURE!
junit.framework.AssertionFailedError
	at junit.framework.Assert.fail(Assert.java:47)
	at junit.framework.Assert.fail(Assert.java:53)
	at org.joda.time.field.TestMillisDurationField.test_getValue_long_long(TestMillisDurationField.java:104)

test_getDifference_long_int(org.joda.time.field.TestMillisDurationField)  Time elapsed: 0.001 sec  <<< FAILURE!
junit.framework.AssertionFailedError
	at junit.framework.Assert.fail(Assert.java:47)
	at junit.framework.Assert.fail(Assert.java:53)
	at org.joda.time.field.TestMillisDurationField.test_getDifference_long_int(TestMillisDurationField.java:168)

test_getValue_long(org.joda.time.field.TestPreciseDurationField)  Time elapsed: 0.001 sec  <<< FAILURE!
junit.framework.AssertionFailedError
	at junit.framework.Assert.fail(Assert.java:47)
	at junit.framework.Assert.fail(Assert.java:53)
	at org.joda.time.field.TestPreciseDurationField.test_getValue_long(TestPreciseDurationField.java:104)

test_getValue_long_long(org.joda.time.field.TestPreciseDurationField)  Time elapsed: 0 sec  <<< FAILURE!
junit.framework.AssertionFailedError
	at junit.framework.Assert.fail(Assert.java:47)
	at junit.framework.Assert.fail(Assert.java:53)
	at org.joda.time.field.TestPreciseDurationField.test_getValue_long_long(TestPreciseDurationField.java:122)

test_getValue_long(org.joda.time.field.TestScaledDurationField)  Time elapsed: 0.001 sec  <<< FAILURE!
junit.framework.AssertionFailedError
	at junit.framework.Assert.fail(Assert.java:47)
	at junit.framework.Assert.fail(Assert.java:53)
	at org.joda.time.field.TestScaledDurationField.test_getValue_long(TestScaledDurationField.java:121)

test_getValue_long_long(org.joda.time.field.TestScaledDurationField)  Time elapsed: 0 sec  <<< FAILURE!
junit.framework.AssertionFailedError
	at junit.framework.Assert.fail(Assert.java:47)
	at junit.framework.Assert.fail(Assert.java:53)
	at org.joda.time.field.TestScaledDurationField.test_getValue_long_long(TestScaledDurationField.java:139)


Results :

Failed tests: 
  org.joda.time.TestDuration_Basics#testToStandardDays_overflow AssertionFailedError
  org.joda.time.TestDuration_Basics#testToStandardHours_overflow AssertionFailedError
  org.joda.time.TestDuration_Basics#testToStandardMinutes_overflow AssertionFailedError
  org.joda.time.TestDuration_Basics#testToStandardSeconds_overflow AssertionFailedError
  org.joda.time.TestPeriod_Basics#testNormalizedStandard_periodType_weekDay2 AssertionFailedError
  org.joda.time.TestPeriod_Basics#testNormalizedStandard_weekDay2 AssertionFailedError
  org.joda.time.TestPeriod_Basics#testToStandardDays AssertionFailedError
  org.joda.time.TestPeriod_Basics#testToStandardHours AssertionFailedError
  org.joda.time.TestPeriod_Basics#testToStandardMinutes AssertionFailedError
  org.joda.time.TestPeriod_Basics#testToStandardSeconds AssertionFailedError
  org.joda.time.TestPeriod_Basics#testToStandardWeeks AssertionFailedError
  org.joda.time.field.TestMillisDurationField#test_getDifference_long_int AssertionFailedError
  org.joda.time.field.TestMillisDurationField#test_getValue_long AssertionFailedError
  org.joda.time.field.TestMillisDurationField#test_getValue_long_long AssertionFailedError
  org.joda.time.field.TestPreciseDurationField#test_getValue_long AssertionFailedError
  org.joda.time.field.TestPreciseDurationField#test_getValue_long_long AssertionFailedError
  org.joda.time.field.TestScaledDurationField#test_getValue_long AssertionFailedError
  org.joda.time.field.TestScaledDurationField#test_getValue_long_long AssertionFailedError
Tests in error: 
  org.joda.time.TestPeriod_Basics#testNormalizedStandard_periodType_yearMonth2 UnsupportedOperationException
  org.joda.time.TestPeriod_Basics#testNormalizedStandard_yearMonth2 UnsupportedOperationException

Tests run: 4157, Failures: 18, Errors: 2, Skipped: 0

[INFO] ------------------------------------------------------------------------
[INFO] BUILD FAILURE
[INFO] ------------------------------------------------------------------------
[INFO] Total time: 16.254s
[INFO] Finished at: Thu Aug 06 04:49:32 BST 2015
[INFO] Final Memory: 9M/213M
[INFO] ------------------------------------------------------------------------
[ERROR] Failed to execute goal org.apache.maven.plugins:maven-surefire-plugin:2.18.1:test (default-test) on project joda-time: There are test failures.
[ERROR] 
[ERROR] Please refer to /home/perham/Study/LittleDarwin/Cases/joda-time-2.8.1/target/surefire-reports for the individual test results.
[ERROR] -> [Help 1]
[ERROR] 
[ERROR] To see the full stack trace of the errors, re-run Maven with the -e switch.
[ERROR] Re-run Maven using the -X switch to enable full debug logging.
[ERROR] 
[ERROR] For more information about the errors and possible solutions, please read the following articles:
[ERROR] [Help 1] http://cwiki.apache.org/confluence/display/MAVEN/MojoFailureException
