[INFO] Scanning for projects...
[INFO]                                                                         
[INFO] ------------------------------------------------------------------------
[INFO] Building Joda-Time 2.8.1
[INFO] ------------------------------------------------------------------------
[INFO] 
[INFO] --- maven-resources-plugin:2.7:resources (default-resources) @ joda-time ---
[INFO] Using 'UTF-8' encoding to copy filtered resources.
[INFO] Copying 2 resources to META-INF
[INFO] Copying 10 resources
[INFO] 
[INFO] --- maven-compiler-plugin:3.3:compile (default-compile) @ joda-time ---
[INFO] Changes detected - recompiling the module!
[INFO] Compiling 166 source files to /home/perham/Study/LittleDarwin/Cases/joda-time-2.8.1/target/classes
[INFO] 
[INFO] --- exec-maven-plugin:1.4.0:java (compile-tzdb) @ joda-time ---
Writing zoneinfo files
Writing ZoneInfoMap
[INFO] 
[INFO] --- maven-resources-plugin:2.7:testResources (default-testResources) @ joda-time ---
[INFO] Using 'UTF-8' encoding to copy filtered resources.
[INFO] Copying 34 resources
[INFO] 
[INFO] --- maven-compiler-plugin:3.3:testCompile (default-testCompile) @ joda-time ---
[INFO] Nothing to compile - all classes are up to date
[INFO] 
[INFO] --- maven-surefire-plugin:2.18.1:test (default-test) @ joda-time ---
[INFO] Surefire report directory: /home/perham/Study/LittleDarwin/Cases/joda-time-2.8.1/target/surefire-reports

-------------------------------------------------------
 T E S T S
-------------------------------------------------------
Running org.joda.time.TestAllPackages

TestBuddhistChronology.testCalendar

TestCopticChronology.testCalendar

TestEthiopicChronology.testCalendar

TestIslamicChronology.testCalendar

Testing Gregorian chronology over 1000 iterations
100% complete (i=1000)

Testing Julian chronology over 1000 iterations
100% complete (i=1000)
Writing zoneinfo files
Writing ZoneInfoMap
Tests run: 4157, Failures: 45, Errors: 13, Skipped: 0, Time elapsed: 5.391 sec <<< FAILURE! - in org.joda.time.TestAllPackages
testConstructor_long_max(org.joda.time.TestDateTime_Constructors)  Time elapsed: 0.005 sec  <<< FAILURE!
junit.framework.AssertionFailedError
	at junit.framework.Assert.fail(Assert.java:47)
	at junit.framework.Assert.fail(Assert.java:53)
	at org.joda.time.TestDateTime_Constructors.testConstructor_long_max(TestDateTime_Constructors.java:255)

testConstructor_long_min(org.joda.time.TestDateTime_Constructors)  Time elapsed: 0 sec  <<< FAILURE!
junit.framework.AssertionFailedError
	at junit.framework.Assert.fail(Assert.java:47)
	at junit.framework.Assert.fail(Assert.java:53)
	at org.joda.time.TestDateTime_Constructors.testConstructor_long_min(TestDateTime_Constructors.java:270)

testWithTime_LocalTime(org.joda.time.TestDateTime_Basics)  Time elapsed: 0.002 sec  <<< FAILURE!
junit.framework.AssertionFailedError
	at junit.framework.Assert.fail(Assert.java:47)
	at junit.framework.Assert.fail(Assert.java:53)
	at org.joda.time.TestDateTime_Basics.testWithTime_LocalTime(TestDateTime_Basics.java:910)

testWithers(org.joda.time.TestDateTime_Basics)  Time elapsed: 0 sec  <<< ERROR!
java.lang.ArrayIndexOutOfBoundsException: -1
	at org.joda.time.chrono.BasicGJChronology.getDaysInYearMonth(BasicGJChronology.java:128)
	at org.joda.time.chrono.BasicMonthOfYearDateTimeField.set(BasicMonthOfYearDateTimeField.java:304)
	at org.joda.time.chrono.GJChronology$CutoverField.set(GJChronology.java:727)
	at org.joda.time.chrono.ZonedChronology$ZonedDateTimeField.set(ZonedChronology.java:482)
	at org.joda.time.DateTime.withMonthOfYear(DateTime.java:1729)
	at org.joda.time.TestDateTime_Basics.testWithers(TestDateTime_Basics.java:272)

testPropertySetMonthOfYear(org.joda.time.TestDateTime_Properties)  Time elapsed: 0.001 sec  <<< ERROR!
java.lang.ArrayIndexOutOfBoundsException: 12
	at org.joda.time.chrono.BasicGJChronology.getDaysInYearMonth(BasicGJChronology.java:126)
	at org.joda.time.chrono.BasicMonthOfYearDateTimeField.set(BasicMonthOfYearDateTimeField.java:304)
	at org.joda.time.chrono.ZonedChronology$ZonedDateTimeField.set(ZonedChronology.java:482)
	at org.joda.time.DateTime$Property.setCopy(DateTime.java:2220)
	at org.joda.time.TestDateTime_Properties.testPropertySetMonthOfYear(TestDateTime_Properties.java:468)

testPropertyAddYear(org.joda.time.TestDateTime_Properties)  Time elapsed: 0.001 sec  <<< FAILURE!
junit.framework.AssertionFailedError
	at junit.framework.Assert.fail(Assert.java:47)
	at junit.framework.Assert.fail(Assert.java:53)
	at org.joda.time.TestDateTime_Properties.testPropertyAddYear(TestDateTime_Properties.java:254)

testSet_DateTimeFieldType_int3(org.joda.time.TestMutableDateTime_Sets)  Time elapsed: 0 sec  <<< ERROR!
java.lang.ArrayIndexOutOfBoundsException: 12
	at org.joda.time.chrono.BasicGJChronology.getDaysInYearMonth(BasicGJChronology.java:128)
	at org.joda.time.chrono.BasicMonthOfYearDateTimeField.set(BasicMonthOfYearDateTimeField.java:304)
	at org.joda.time.chrono.ZonedChronology$ZonedDateTimeField.set(ZonedChronology.java:482)
	at org.joda.time.MutableDateTime.set(MutableDateTime.java:623)
	at org.joda.time.TestMutableDateTime_Sets.testSet_DateTimeFieldType_int3(TestMutableDateTime_Sets.java:210)

testSetTime_int_int_int2(org.joda.time.TestMutableDateTime_Sets)  Time elapsed: 0.001 sec  <<< FAILURE!
junit.framework.AssertionFailedError
	at junit.framework.Assert.fail(Assert.java:47)
	at junit.framework.Assert.fail(Assert.java:53)
	at org.joda.time.TestMutableDateTime_Sets.testSetTime_int_int_int2(TestMutableDateTime_Sets.java:334)

testSetMonthOfYear_int2(org.joda.time.TestMutableDateTime_Sets)  Time elapsed: 0.001 sec  <<< ERROR!
java.lang.ArrayIndexOutOfBoundsException: 12
	at org.joda.time.chrono.BasicGJChronology.getDaysInYearMonth(BasicGJChronology.java:128)
	at org.joda.time.chrono.BasicMonthOfYearDateTimeField.set(BasicMonthOfYearDateTimeField.java:304)
	at org.joda.time.chrono.ZonedChronology$ZonedDateTimeField.set(ZonedChronology.java:482)
	at org.joda.time.MutableDateTime.setMonthOfYear(MutableDateTime.java:697)
	at org.joda.time.TestMutableDateTime_Sets.testSetMonthOfYear_int2(TestMutableDateTime_Sets.java:448)

testWithers(org.joda.time.TestDateMidnight_Basics)  Time elapsed: 0.001 sec  <<< ERROR!
java.lang.ArrayIndexOutOfBoundsException: -1
	at org.joda.time.chrono.BasicGJChronology.getDaysInYearMonth(BasicGJChronology.java:128)
	at org.joda.time.chrono.BasicMonthOfYearDateTimeField.set(BasicMonthOfYearDateTimeField.java:304)
	at org.joda.time.chrono.GJChronology$CutoverField.set(GJChronology.java:727)
	at org.joda.time.chrono.ZonedChronology$ZonedDateTimeField.set(ZonedChronology.java:482)
	at org.joda.time.DateMidnight.withMonthOfYear(DateMidnight.java:1017)
	at org.joda.time.TestDateMidnight_Basics.testWithers(TestDateMidnight_Basics.java:255)

testWithers(org.joda.time.TestLocalDateTime_Basics)  Time elapsed: 0.001 sec  <<< ERROR!
java.lang.ArrayIndexOutOfBoundsException: -1
	at org.joda.time.chrono.BasicGJChronology.getDaysInYearMonth(BasicGJChronology.java:128)
	at org.joda.time.chrono.BasicMonthOfYearDateTimeField.set(BasicMonthOfYearDateTimeField.java:304)
	at org.joda.time.chrono.GJChronology$CutoverField.set(GJChronology.java:727)
	at org.joda.time.LocalDateTime.withMonthOfYear(LocalDateTime.java:1789)
	at org.joda.time.TestLocalDateTime_Basics.testWithers(TestLocalDateTime_Basics.java:756)

testPropertySetHour(org.joda.time.TestLocalDateTime_Properties)  Time elapsed: 0.001 sec  <<< FAILURE!
junit.framework.AssertionFailedError
	at junit.framework.Assert.fail(Assert.java:47)
	at junit.framework.Assert.fail(Assert.java:53)
	at org.joda.time.TestLocalDateTime_Properties.testPropertySetHour(TestLocalDateTime_Properties.java:639)

testPropertySetMinute(org.joda.time.TestLocalDateTime_Properties)  Time elapsed: 0.001 sec  <<< FAILURE!
junit.framework.AssertionFailedError
	at junit.framework.Assert.fail(Assert.java:47)
	at junit.framework.Assert.fail(Assert.java:53)
	at org.joda.time.TestLocalDateTime_Properties.testPropertySetMinute(TestLocalDateTime_Properties.java:784)

testPropertyAddToCopyYear(org.joda.time.TestLocalDateTime_Properties)  Time elapsed: 0.001 sec  <<< FAILURE!
junit.framework.AssertionFailedError
	at junit.framework.Assert.fail(Assert.java:47)
	at junit.framework.Assert.fail(Assert.java:53)
	at org.joda.time.TestLocalDateTime_Properties.testPropertyAddToCopyYear(TestLocalDateTime_Properties.java:128)

testPropertySetSecond(org.joda.time.TestLocalDateTime_Properties)  Time elapsed: 0 sec  <<< FAILURE!
junit.framework.AssertionFailedError
	at junit.framework.Assert.fail(Assert.java:47)
	at junit.framework.Assert.fail(Assert.java:53)
	at org.joda.time.TestLocalDateTime_Properties.testPropertySetSecond(TestLocalDateTime_Properties.java:912)

testPropertySetMilli(org.joda.time.TestLocalDateTime_Properties)  Time elapsed: 0.001 sec  <<< FAILURE!
junit.framework.AssertionFailedError
	at junit.framework.Assert.fail(Assert.java:47)
	at junit.framework.Assert.fail(Assert.java:53)
	at org.joda.time.TestLocalDateTime_Properties.testPropertySetMilli(TestLocalDateTime_Properties.java:1037)

testPropertySetCopyMonth(org.joda.time.TestLocalDateTime_Properties)  Time elapsed: 0 sec  <<< ERROR!
java.lang.ArrayIndexOutOfBoundsException: 12
	at org.joda.time.chrono.BasicGJChronology.getDaysInYearMonth(BasicGJChronology.java:126)
	at org.joda.time.chrono.BasicMonthOfYearDateTimeField.set(BasicMonthOfYearDateTimeField.java:304)
	at org.joda.time.LocalDateTime$Property.setCopy(LocalDateTime.java:2276)
	at org.joda.time.TestLocalDateTime_Properties.testPropertySetCopyMonth(TestLocalDateTime_Properties.java:295)

testPropertySetCopyDay(org.joda.time.TestLocalDateTime_Properties)  Time elapsed: 0.001 sec  <<< FAILURE!
junit.framework.AssertionFailedError
	at junit.framework.Assert.fail(Assert.java:47)
	at junit.framework.Assert.fail(Assert.java:53)
	at org.joda.time.TestLocalDateTime_Properties.testPropertySetCopyDay(TestLocalDateTime_Properties.java:445)

testWithers(org.joda.time.TestLocalDate_Basics)  Time elapsed: 0.001 sec  <<< ERROR!
java.lang.ArrayIndexOutOfBoundsException: -1
	at org.joda.time.chrono.BasicGJChronology.getDaysInYearMonth(BasicGJChronology.java:128)
	at org.joda.time.chrono.BasicMonthOfYearDateTimeField.set(BasicMonthOfYearDateTimeField.java:304)
	at org.joda.time.chrono.GJChronology$CutoverField.set(GJChronology.java:727)
	at org.joda.time.LocalDate.withMonthOfYear(LocalDate.java:1656)
	at org.joda.time.TestLocalDate_Basics.testWithers(TestLocalDate_Basics.java:653)

testPropertyAddToCopyYear(org.joda.time.TestLocalDate_Properties)  Time elapsed: 0.008 sec  <<< FAILURE!
junit.framework.AssertionFailedError
	at junit.framework.Assert.fail(Assert.java:47)
	at junit.framework.Assert.fail(Assert.java:53)
	at org.joda.time.TestLocalDate_Properties.testPropertyAddToCopyYear(TestLocalDate_Properties.java:123)

testPropertySetCopyMonth(org.joda.time.TestLocalDate_Properties)  Time elapsed: 0 sec  <<< ERROR!
java.lang.ArrayIndexOutOfBoundsException: 12
	at org.joda.time.chrono.BasicGJChronology.getDaysInYearMonth(BasicGJChronology.java:126)
	at org.joda.time.chrono.BasicMonthOfYearDateTimeField.set(BasicMonthOfYearDateTimeField.java:304)
	at org.joda.time.LocalDate$Property.setCopy(LocalDate.java:2007)
	at org.joda.time.TestLocalDate_Properties.testPropertySetCopyMonth(TestLocalDate_Properties.java:290)

testPropertySetCopyDay(org.joda.time.TestLocalDate_Properties)  Time elapsed: 0 sec  <<< FAILURE!
junit.framework.AssertionFailedError
	at junit.framework.Assert.fail(Assert.java:47)
	at junit.framework.Assert.fail(Assert.java:53)
	at org.joda.time.TestLocalDate_Properties.testPropertySetCopyDay(TestLocalDate_Properties.java:440)

testConstructor_int_int(org.joda.time.TestLocalTime_Constructors)  Time elapsed: 0.001 sec  <<< FAILURE!
junit.framework.AssertionFailedError
	at junit.framework.Assert.fail(Assert.java:47)
	at junit.framework.Assert.fail(Assert.java:53)
	at org.joda.time.TestLocalTime_Constructors.testConstructor_int_int(TestLocalTime_Constructors.java:620)

testConstructor_int_int_int_int(org.joda.time.TestLocalTime_Constructors)  Time elapsed: 0 sec  <<< FAILURE!
junit.framework.AssertionFailedError
	at junit.framework.Assert.fail(Assert.java:47)
	at junit.framework.Assert.fail(Assert.java:53)
	at org.joda.time.TestLocalTime_Constructors.testConstructor_int_int_int_int(TestLocalTime_Constructors.java:678)

testConstructor_int_int_int_int_Chronology(org.joda.time.TestLocalTime_Constructors)  Time elapsed: 0.001 sec  <<< FAILURE!
junit.framework.AssertionFailedError
	at junit.framework.Assert.fail(Assert.java:47)
	at junit.framework.Assert.fail(Assert.java:53)
	at org.joda.time.TestLocalTime_Constructors.testConstructor_int_int_int_int_Chronology(TestLocalTime_Constructors.java:719)

testConstructor_int_int_int(org.joda.time.TestLocalTime_Constructors)  Time elapsed: 0 sec  <<< FAILURE!
junit.framework.AssertionFailedError
	at junit.framework.Assert.fail(Assert.java:47)
	at junit.framework.Assert.fail(Assert.java:53)
	at org.joda.time.TestLocalTime_Constructors.testConstructor_int_int_int(TestLocalTime_Constructors.java:645)

testWithers(org.joda.time.TestLocalTime_Basics)  Time elapsed: 0.001 sec  <<< FAILURE!
junit.framework.AssertionFailedError
	at junit.framework.Assert.fail(Assert.java:47)
	at junit.framework.Assert.fail(Assert.java:53)
	at org.joda.time.TestLocalTime_Basics.testWithers(TestLocalTime_Basics.java:659)

testPropertySetHour(org.joda.time.TestLocalTime_Properties)  Time elapsed: 0 sec  <<< FAILURE!
junit.framework.AssertionFailedError
	at junit.framework.Assert.fail(Assert.java:47)
	at junit.framework.Assert.fail(Assert.java:53)
	at org.joda.time.TestLocalTime_Properties.testPropertySetHour(TestLocalTime_Properties.java:214)

testPropertySetMinute(org.joda.time.TestLocalTime_Properties)  Time elapsed: 0.001 sec  <<< FAILURE!
junit.framework.AssertionFailedError
	at junit.framework.Assert.fail(Assert.java:47)
	at junit.framework.Assert.fail(Assert.java:53)
	at org.joda.time.TestLocalTime_Properties.testPropertySetMinute(TestLocalTime_Properties.java:405)

testPropertySetSecond(org.joda.time.TestLocalTime_Properties)  Time elapsed: 0.001 sec  <<< FAILURE!
junit.framework.AssertionFailedError
	at junit.framework.Assert.fail(Assert.java:47)
	at junit.framework.Assert.fail(Assert.java:53)
	at org.joda.time.TestLocalTime_Properties.testPropertySetSecond(TestLocalTime_Properties.java:576)

testPropertySetMilli(org.joda.time.TestLocalTime_Properties)  Time elapsed: 0.001 sec  <<< FAILURE!
junit.framework.AssertionFailedError
	at junit.framework.Assert.fail(Assert.java:47)
	at junit.framework.Assert.fail(Assert.java:53)
	at org.joda.time.TestLocalTime_Properties.testPropertySetMilli(TestLocalTime_Properties.java:741)

testWithers(org.joda.time.TestTimeOfDay_Basics)  Time elapsed: 0 sec  <<< FAILURE!
junit.framework.AssertionFailedError
	at junit.framework.Assert.fail(Assert.java:47)
	at junit.framework.Assert.fail(Assert.java:53)
	at org.joda.time.TestTimeOfDay_Basics.testWithers(TestTimeOfDay_Basics.java:824)

testPropertySetHour(org.joda.time.TestTimeOfDay_Properties)  Time elapsed: 0 sec  <<< FAILURE!
junit.framework.AssertionFailedError
	at junit.framework.Assert.fail(Assert.java:47)
	at junit.framework.Assert.fail(Assert.java:53)
	at org.joda.time.TestTimeOfDay_Properties.testPropertySetHour(TestTimeOfDay_Properties.java:180)

testPropertySetMinute(org.joda.time.TestTimeOfDay_Properties)  Time elapsed: 0.001 sec  <<< FAILURE!
junit.framework.AssertionFailedError
	at junit.framework.Assert.fail(Assert.java:47)
	at junit.framework.Assert.fail(Assert.java:53)
	at org.joda.time.TestTimeOfDay_Properties.testPropertySetMinute(TestTimeOfDay_Properties.java:366)

testPropertySetSecond(org.joda.time.TestTimeOfDay_Properties)  Time elapsed: 0.001 sec  <<< FAILURE!
junit.framework.AssertionFailedError
	at junit.framework.Assert.fail(Assert.java:47)
	at junit.framework.Assert.fail(Assert.java:53)
	at org.joda.time.TestTimeOfDay_Properties.testPropertySetSecond(TestTimeOfDay_Properties.java:532)

testPropertySetMilli(org.joda.time.TestTimeOfDay_Properties)  Time elapsed: 0.001 sec  <<< FAILURE!
junit.framework.AssertionFailedError
	at junit.framework.Assert.fail(Assert.java:47)
	at junit.framework.Assert.fail(Assert.java:53)
	at org.joda.time.TestTimeOfDay_Properties.testPropertySetMilli(TestTimeOfDay_Properties.java:692)

testWithers(org.joda.time.TestYearMonthDay_Basics)  Time elapsed: 0.001 sec  <<< ERROR!
java.lang.ArrayIndexOutOfBoundsException

testPropertySetMonth(org.joda.time.TestYearMonthDay_Properties)  Time elapsed: 0 sec  <<< ERROR!
java.lang.ArrayIndexOutOfBoundsException

testPropertySetDay(org.joda.time.TestYearMonthDay_Properties)  Time elapsed: 0 sec  <<< FAILURE!
junit.framework.AssertionFailedError
	at junit.framework.Assert.fail(Assert.java:47)
	at junit.framework.Assert.fail(Assert.java:53)
	at org.joda.time.TestYearMonthDay_Properties.testPropertySetDay(TestYearMonthDay_Properties.java:444)

testWithers(org.joda.time.TestYearMonth_Basics)  Time elapsed: 0.001 sec  <<< FAILURE!
junit.framework.AssertionFailedError
	at junit.framework.Assert.fail(Assert.java:47)
	at junit.framework.Assert.fail(Assert.java:53)
	at org.joda.time.TestYearMonth_Basics.testWithers(TestYearMonth_Basics.java:576)

testPropertySetMonth(org.joda.time.TestYearMonth_Properties)  Time elapsed: 0 sec  <<< FAILURE!
junit.framework.AssertionFailedError
	at junit.framework.Assert.fail(Assert.java:47)
	at junit.framework.Assert.fail(Assert.java:53)
	at org.joda.time.TestYearMonth_Properties.testPropertySetMonth(TestYearMonth_Properties.java:261)

testWithers(org.joda.time.TestMonthDay_Basics)  Time elapsed: 0 sec  <<< ERROR!
java.lang.ArrayIndexOutOfBoundsException: -1
	at org.joda.time.chrono.BasicGJChronology.getDaysInMonthMax(BasicGJChronology.java:134)
	at org.joda.time.chrono.BasicDayOfMonthDateTimeField.getMaximumValue(BasicDayOfMonthDateTimeField.java:90)
	at org.joda.time.field.BaseDateTimeField.set(BaseDateTimeField.java:591)
	at org.joda.time.MonthDay.withMonthOfYear(MonthDay.java:722)
	at org.joda.time.TestMonthDay_Basics.testWithers(TestMonthDay_Basics.java:741)

testPropertySetDayOfMonth(org.joda.time.TestMonthDay_Properties)  Time elapsed: 0.001 sec  <<< FAILURE!
junit.framework.AssertionFailedError
	at junit.framework.Assert.fail(Assert.java:47)
	at junit.framework.Assert.fail(Assert.java:53)
	at org.joda.time.TestMonthDay_Properties.testPropertySetDayOfMonth(TestMonthDay_Properties.java:243)

testPropertySetHour(org.joda.time.TestPartial_Properties)  Time elapsed: 0.001 sec  <<< FAILURE!
junit.framework.AssertionFailedError
	at junit.framework.Assert.fail(Assert.java:47)
	at junit.framework.Assert.fail(Assert.java:53)
	at org.joda.time.TestPartial_Properties.testPropertySetHour(TestPartial_Properties.java:186)

testPropertySetMinute(org.joda.time.TestPartial_Properties)  Time elapsed: 0 sec  <<< FAILURE!
junit.framework.AssertionFailedError
	at junit.framework.Assert.fail(Assert.java:47)
	at junit.framework.Assert.fail(Assert.java:53)
	at org.joda.time.TestPartial_Properties.testPropertySetMinute(TestPartial_Properties.java:372)

testSetMethods(org.joda.time.TestBasePartial)  Time elapsed: 0.001 sec  <<< FAILURE!
junit.framework.AssertionFailedError
	at junit.framework.Assert.fail(Assert.java:47)
	at junit.framework.Assert.fail(Assert.java:53)
	at org.joda.time.TestBasePartial.testSetMethods(TestBasePartial.java:91)

testVerifyValueBounds(org.joda.time.TestIllegalFieldValueException)  Time elapsed: 0 sec  <<< FAILURE!
junit.framework.AssertionFailedError
	at junit.framework.Assert.fail(Assert.java:47)
	at junit.framework.Assert.fail(Assert.java:53)
	at org.joda.time.TestIllegalFieldValueException.testVerifyValueBounds(TestIllegalFieldValueException.java:48)

testEra(org.joda.time.chrono.TestBuddhistChronology)  Time elapsed: 0.001 sec  <<< ERROR!
java.lang.ArrayIndexOutOfBoundsException

testMaxYear(org.joda.time.chrono.TestISOChronology)  Time elapsed: 0.001 sec  <<< FAILURE!
junit.framework.AssertionFailedError
	at junit.framework.Assert.fail(Assert.java:47)
	at junit.framework.Assert.fail(Assert.java:53)
	at org.joda.time.chrono.TestISOChronology.testMaxYear(TestISOChronology.java:329)

testMinYear(org.joda.time.chrono.TestISOChronology)  Time elapsed: 0 sec  <<< FAILURE!
junit.framework.AssertionFailedError
	at junit.framework.Assert.fail(Assert.java:47)
	at junit.framework.Assert.fail(Assert.java:53)
	at org.joda.time.chrono.TestISOChronology.testMinYear(TestISOChronology.java:362)

test_set_RP_int_intarray_int(org.joda.time.field.TestBaseDateTimeField)  Time elapsed: 0 sec  <<< FAILURE!
junit.framework.AssertionFailedError
	at junit.framework.Assert.fail(Assert.java:47)
	at junit.framework.Assert.fail(Assert.java:53)
	at org.joda.time.field.TestBaseDateTimeField.test_set_RP_int_intarray_int(TestBaseDateTimeField.java:291)

test_set_RP_int_intarray_String_Locale(org.joda.time.field.TestBaseDateTimeField)  Time elapsed: 0.001 sec  <<< FAILURE!
junit.framework.AssertionFailedError
	at junit.framework.Assert.fail(Assert.java:47)
	at junit.framework.Assert.fail(Assert.java:53)
	at org.joda.time.field.TestBaseDateTimeField.test_set_RP_int_intarray_String_Locale(TestBaseDateTimeField.java:332)

test_set_RP_int_intarray_int(org.joda.time.field.TestOffsetDateTimeField)  Time elapsed: 0 sec  <<< FAILURE!
junit.framework.AssertionFailedError
	at junit.framework.Assert.fail(Assert.java:47)
	at junit.framework.Assert.fail(Assert.java:53)
	at org.joda.time.field.TestOffsetDateTimeField.test_set_RP_int_intarray_int(TestOffsetDateTimeField.java:324)

test_set_RP_int_intarray_String_Locale(org.joda.time.field.TestOffsetDateTimeField)  Time elapsed: 0.001 sec  <<< FAILURE!
junit.framework.AssertionFailedError
	at junit.framework.Assert.fail(Assert.java:47)
	at junit.framework.Assert.fail(Assert.java:53)
	at org.joda.time.field.TestOffsetDateTimeField.test_set_RP_int_intarray_String_Locale(TestOffsetDateTimeField.java:365)

test_set_RP_int_intarray_int(org.joda.time.field.TestPreciseDurationDateTimeField)  Time elapsed: 0.001 sec  <<< FAILURE!
junit.framework.AssertionFailedError
	at junit.framework.Assert.fail(Assert.java:47)
	at junit.framework.Assert.fail(Assert.java:53)
	at org.joda.time.field.TestPreciseDurationDateTimeField.test_set_RP_int_intarray_int(TestPreciseDurationDateTimeField.java:296)

test_set_RP_int_intarray_String_Locale(org.joda.time.field.TestPreciseDurationDateTimeField)  Time elapsed: 0.001 sec  <<< FAILURE!
junit.framework.AssertionFailedError
	at junit.framework.Assert.fail(Assert.java:47)
	at junit.framework.Assert.fail(Assert.java:53)
	at org.joda.time.field.TestPreciseDurationDateTimeField.test_set_RP_int_intarray_String_Locale(TestPreciseDurationDateTimeField.java:337)

test_set_RP_int_intarray_int(org.joda.time.field.TestPreciseDateTimeField)  Time elapsed: 0.001 sec  <<< FAILURE!
junit.framework.AssertionFailedError
	at junit.framework.Assert.fail(Assert.java:47)
	at junit.framework.Assert.fail(Assert.java:53)
	at org.joda.time.field.TestPreciseDateTimeField.test_set_RP_int_intarray_int(TestPreciseDateTimeField.java:325)

test_set_RP_int_intarray_String_Locale(org.joda.time.field.TestPreciseDateTimeField)  Time elapsed: 0 sec  <<< FAILURE!
junit.framework.AssertionFailedError
	at junit.framework.Assert.fail(Assert.java:47)
	at junit.framework.Assert.fail(Assert.java:53)
	at org.joda.time.field.TestPreciseDateTimeField.test_set_RP_int_intarray_String_Locale(TestPreciseDateTimeField.java:366)


Results :

Failed tests: 
  org.joda.time.TestBasePartial#testSetMethods AssertionFailedError
  org.joda.time.TestDateTime_Basics#testWithTime_LocalTime AssertionFailedError
  org.joda.time.TestDateTime_Constructors#testConstructor_long_max AssertionFailedError
  org.joda.time.TestDateTime_Constructors#testConstructor_long_min AssertionFailedError
  org.joda.time.TestDateTime_Properties#testPropertyAddYear AssertionFailedError
  org.joda.time.TestIllegalFieldValueException#testVerifyValueBounds AssertionFailedError
  org.joda.time.TestLocalDateTime_Properties#testPropertyAddToCopyYear AssertionFailedError
  org.joda.time.TestLocalDateTime_Properties#testPropertySetCopyDay AssertionFailedError
  org.joda.time.TestLocalDateTime_Properties#testPropertySetHour AssertionFailedError
  org.joda.time.TestLocalDateTime_Properties#testPropertySetMilli AssertionFailedError
  org.joda.time.TestLocalDateTime_Properties#testPropertySetMinute AssertionFailedError
  org.joda.time.TestLocalDateTime_Properties#testPropertySetSecond AssertionFailedError
  org.joda.time.TestLocalDate_Properties#testPropertyAddToCopyYear AssertionFailedError
  org.joda.time.TestLocalDate_Properties#testPropertySetCopyDay AssertionFailedError
  org.joda.time.TestLocalTime_Basics#testWithers AssertionFailedError
  org.joda.time.TestLocalTime_Constructors#testConstructor_int_int AssertionFailedError
  org.joda.time.TestLocalTime_Constructors#testConstructor_int_int_int AssertionFailedError
  org.joda.time.TestLocalTime_Constructors#testConstructor_int_int_int_int AssertionFailedError
  org.joda.time.TestLocalTime_Constructors#testConstructor_int_int_int_int_Chronology AssertionFailedError
  org.joda.time.TestLocalTime_Properties#testPropertySetHour AssertionFailedError
  org.joda.time.TestLocalTime_Properties#testPropertySetMilli AssertionFailedError
  org.joda.time.TestLocalTime_Properties#testPropertySetMinute AssertionFailedError
  org.joda.time.TestLocalTime_Properties#testPropertySetSecond AssertionFailedError
  org.joda.time.TestMonthDay_Properties#testPropertySetDayOfMonth AssertionFailedError
  org.joda.time.TestMutableDateTime_Sets#testSetTime_int_int_int2 AssertionFailedError
  org.joda.time.TestPartial_Properties#testPropertySetHour AssertionFailedError
  org.joda.time.TestPartial_Properties#testPropertySetMinute AssertionFailedError
  org.joda.time.TestTimeOfDay_Basics#testWithers AssertionFailedError
  org.joda.time.TestTimeOfDay_Properties#testPropertySetHour AssertionFailedError
  org.joda.time.TestTimeOfDay_Properties#testPropertySetMilli AssertionFailedError
  org.joda.time.TestTimeOfDay_Properties#testPropertySetMinute AssertionFailedError
  org.joda.time.TestTimeOfDay_Properties#testPropertySetSecond AssertionFailedError
  org.joda.time.TestYearMonthDay_Properties#testPropertySetDay AssertionFailedError
  org.joda.time.TestYearMonth_Basics#testWithers AssertionFailedError
  org.joda.time.TestYearMonth_Properties#testPropertySetMonth AssertionFailedError
  org.joda.time.chrono.TestISOChronology#testMaxYear AssertionFailedError
  org.joda.time.chrono.TestISOChronology#testMinYear AssertionFailedError
  org.joda.time.field.TestBaseDateTimeField#test_set_RP_int_intarray_String_Locale AssertionFailedError
  org.joda.time.field.TestBaseDateTimeField#test_set_RP_int_intarray_int AssertionFailedError
  org.joda.time.field.TestOffsetDateTimeField#test_set_RP_int_intarray_String_Locale AssertionFailedError
  org.joda.time.field.TestOffsetDateTimeField#test_set_RP_int_intarray_int AssertionFailedError
  org.joda.time.field.TestPreciseDateTimeField#test_set_RP_int_intarray_String_Locale AssertionFailedError
  org.joda.time.field.TestPreciseDateTimeField#test_set_RP_int_intarray_int AssertionFailedError
  org.joda.time.field.TestPreciseDurationDateTimeField#test_set_RP_int_intarray_String_Locale AssertionFailedError
  org.joda.time.field.TestPreciseDurationDateTimeField#test_set_RP_int_intarray_int AssertionFailedError
Tests in error: 
  org.joda.time.TestDateMidnight_Basics#testWithers ArrayIndexOutOfBoundsException
  org.joda.time.TestDateTime_Basics#testWithers ArrayIndexOutOfBoundsException -...
  org.joda.time.TestDateTime_Properties#testPropertySetMonthOfYear ArrayIndexOutOfBoundsException
  org.joda.time.TestLocalDateTime_Basics#testWithers ArrayIndexOutOfBoundsException
  org.joda.time.TestLocalDateTime_Properties#testPropertySetCopyMonth ArrayIndexOutOfBoundsException
  org.joda.time.TestLocalDate_Basics#testWithers ArrayIndexOutOfBoundsException ...
  org.joda.time.TestLocalDate_Properties#testPropertySetCopyMonth ArrayIndexOutOfBoundsException
  org.joda.time.TestMonthDay_Basics#testWithers ArrayIndexOutOfBoundsException -...
  org.joda.time.TestMutableDateTime_Sets#testSetMonthOfYear_int2 ArrayIndexOutOfBoundsException
  org.joda.time.TestMutableDateTime_Sets#testSet_DateTimeFieldType_int3 ArrayIndexOutOfBoundsException
  org.joda.time.TestYearMonthDay_Basics#testWithers ArrayIndexOutOfBoundsException
  org.joda.time.TestYearMonthDay_Properties#testPropertySetMonth ArrayIndexOutOfBoundsException
  org.joda.time.chrono.TestBuddhistChronology#testEra ArrayIndexOutOfBoundsException

Tests run: 4157, Failures: 45, Errors: 13, Skipped: 0

[INFO] ------------------------------------------------------------------------
[INFO] BUILD FAILURE
[INFO] ------------------------------------------------------------------------
[INFO] Total time: 15.560s
[INFO] Finished at: Thu Aug 06 04:49:14 BST 2015
[INFO] Final Memory: 8M/218M
[INFO] ------------------------------------------------------------------------
[ERROR] Failed to execute goal org.apache.maven.plugins:maven-surefire-plugin:2.18.1:test (default-test) on project joda-time: There are test failures.
[ERROR] 
[ERROR] Please refer to /home/perham/Study/LittleDarwin/Cases/joda-time-2.8.1/target/surefire-reports for the individual test results.
[ERROR] -> [Help 1]
[ERROR] 
[ERROR] To see the full stack trace of the errors, re-run Maven with the -e switch.
[ERROR] Re-run Maven using the -X switch to enable full debug logging.
[ERROR] 
[ERROR] For more information about the errors and possible solutions, please read the following articles:
[ERROR] [Help 1] http://cwiki.apache.org/confluence/display/MAVEN/MojoFailureException
