[INFO] Scanning for projects...
[INFO]                                                                         
[INFO] ------------------------------------------------------------------------
[INFO] Building Joda-Time 2.8.1
[INFO] ------------------------------------------------------------------------
[INFO] 
[INFO] --- maven-resources-plugin:2.7:resources (default-resources) @ joda-time ---
[INFO] Using 'UTF-8' encoding to copy filtered resources.
[INFO] Copying 2 resources to META-INF
[INFO] Copying 10 resources
[INFO] 
[INFO] --- maven-compiler-plugin:3.3:compile (default-compile) @ joda-time ---
[INFO] Changes detected - recompiling the module!
[INFO] Compiling 166 source files to /home/perham/Study/LittleDarwin/Cases/joda-time-2.8.1/target/classes
[INFO] 
[INFO] --- exec-maven-plugin:1.4.0:java (compile-tzdb) @ joda-time ---
Writing zoneinfo files
Writing ZoneInfoMap
[INFO] 
[INFO] --- maven-resources-plugin:2.7:testResources (default-testResources) @ joda-time ---
[INFO] Using 'UTF-8' encoding to copy filtered resources.
[INFO] Copying 34 resources
[INFO] 
[INFO] --- maven-compiler-plugin:3.3:testCompile (default-testCompile) @ joda-time ---
[INFO] Nothing to compile - all classes are up to date
[INFO] 
[INFO] --- maven-surefire-plugin:2.18.1:test (default-test) @ joda-time ---
[INFO] Surefire report directory: /home/perham/Study/LittleDarwin/Cases/joda-time-2.8.1/target/surefire-reports

-------------------------------------------------------
 T E S T S
-------------------------------------------------------
Running org.joda.time.TestAllPackages

TestBuddhistChronology.testCalendar

TestCopticChronology.testCalendar

TestEthiopicChronology.testCalendar

TestIslamicChronology.testCalendar

Testing Gregorian chronology over 1000 iterations
Failure on year.addWrapField
org.joda.time.chrono.gj.TestGJYearField
	vs. org.joda.time.chrono.BasicYearDateTimeField
Datetime: Sat 1960-03-26T03:29:34.468Z / 1960-W12-6
Millis from 1970: -308262625532
Sun -100000000-03-26T03:29:34.468Z / -100000000-W12-7 != Fri -292271229-03-26T03:29:34.468Z / -292271229-W12-5
-3155757359862625532 != -9223251304480225532
Original value as reported by first field: 1960
Original value as reported by second field: 1960
First new value as reported by first field: -100000000
First new value as reported by second field: -100000000
Second new value as reported by first field: -292271229
Second new value as reported by second field: -292271229
Failure index: 0
Test millis: -308262625532
Test value: -49
Test millis2: -46922557997542

Testing Julian chronology over 1000 iterations
Failure on year.addWrapField
org.joda.time.chrono.gj.TestJulianYearField
	vs. org.joda.time.field.SkipDateTimeField
Datetime: Sat 1960-03-13T03:29:34.468Z / 1960-W11-6
Millis from 1970: -308262625532
Sun -100000001-03-13T03:29:34.468Z / -100000001-W10-7 != Wed -292267951-03-13T03:29:34.468Z / -292267951-W11-3
-3155822161158625532 != -9223337220121825532
Original value as reported by first field: 1960
Original value as reported by second field: 1960
First new value as reported by first field: -100000001
First new value as reported by second field: -100000001
Second new value as reported by first field: -292267951
Second new value as reported by second field: -292267951
Failure index: 0
Test millis: -308262625532
Test value: -49
Test millis2: -46922557997542
Writing zoneinfo files
Writing ZoneInfoMap
Tests run: 4157, Failures: 10, Errors: 25, Skipped: 0, Time elapsed: 4.784 sec <<< FAILURE! - in org.joda.time.TestAllPackages
testPropertyAddWrapFieldDayOfWeek(org.joda.time.TestDateTime_Properties)  Time elapsed: 0.004 sec  <<< ERROR!
org.joda.time.IllegalFieldValueException: Value 8 for dayOfWeek must be in the range [1,7]
	at org.joda.time.field.FieldUtils.verifyValueBounds(FieldUtils.java:46)
	at org.joda.time.field.PreciseDurationDateTimeField.set(PreciseDurationDateTimeField.java:79)
	at org.joda.time.field.BaseDateTimeField.addWrapField(BaseDateTimeField.java:464)
	at org.joda.time.chrono.ZonedChronology$ZonedDateTimeField.addWrapField(ZonedChronology.java:475)
	at org.joda.time.DateTime$Property.addWrapFieldToCopy(DateTime.java:2203)
	at org.joda.time.TestDateTime_Properties.testPropertyAddWrapFieldDayOfWeek(TestDateTime_Properties.java:1027)

testPropertyAddWrapFieldDayOfMonth(org.joda.time.TestDateTime_Properties)  Time elapsed: 0.001 sec  <<< ERROR!
org.joda.time.IllegalFieldValueException: Value 31 for dayOfMonth must be in the range [1,30]
	at org.joda.time.field.FieldUtils.verifyValueBounds(FieldUtils.java:46)
	at org.joda.time.field.PreciseDurationDateTimeField.set(PreciseDurationDateTimeField.java:79)
	at org.joda.time.field.BaseDateTimeField.addWrapField(BaseDateTimeField.java:464)
	at org.joda.time.chrono.ZonedChronology$ZonedDateTimeField.addWrapField(ZonedChronology.java:475)
	at org.joda.time.DateTime$Property.addWrapFieldToCopy(DateTime.java:2203)
	at org.joda.time.TestDateTime_Properties.testPropertyAddWrapFieldDayOfMonth(TestDateTime_Properties.java:597)

testPropertyAddWrapFieldMonthOfYear(org.joda.time.TestDateTime_Properties)  Time elapsed: 0.001 sec  <<< ERROR!
org.joda.time.IllegalFieldValueException: Value 14 for monthOfYear must be in the range [1,12]
	at org.joda.time.field.FieldUtils.verifyValueBounds(FieldUtils.java:46)
	at org.joda.time.chrono.BasicMonthOfYearDateTimeField.set(BasicMonthOfYearDateTimeField.java:299)
	at org.joda.time.chrono.BasicMonthOfYearDateTimeField.addWrapField(BasicMonthOfYearDateTimeField.java:239)
	at org.joda.time.chrono.ZonedChronology$ZonedDateTimeField.addWrapField(ZonedChronology.java:475)
	at org.joda.time.DateTime$Property.addWrapFieldToCopy(DateTime.java:2203)
	at org.joda.time.TestDateTime_Properties.testPropertyAddWrapFieldMonthOfYear(TestDateTime_Properties.java:434)

testPropertyAddWrapFieldDayOfYear(org.joda.time.TestDateTime_Properties)  Time elapsed: 0.001 sec  <<< ERROR!
org.joda.time.IllegalFieldValueException: Value 367 for dayOfYear must be in the range [1,366]
	at org.joda.time.field.FieldUtils.verifyValueBounds(FieldUtils.java:46)
	at org.joda.time.field.PreciseDurationDateTimeField.set(PreciseDurationDateTimeField.java:79)
	at org.joda.time.field.BaseDateTimeField.addWrapField(BaseDateTimeField.java:464)
	at org.joda.time.chrono.ZonedChronology$ZonedDateTimeField.addWrapField(ZonedChronology.java:475)
	at org.joda.time.DateTime$Property.addWrapFieldToCopy(DateTime.java:2203)
	at org.joda.time.TestDateTime_Properties.testPropertyAddWrapFieldDayOfYear(TestDateTime_Properties.java:770)

testPropertyAddWrapFieldWeekOfWeekyear(org.joda.time.TestDateTime_Properties)  Time elapsed: 0 sec  <<< ERROR!
org.joda.time.IllegalFieldValueException: Value 54 for weekOfWeekyear must be in the range [1,53]
	at org.joda.time.field.FieldUtils.verifyValueBounds(FieldUtils.java:46)
	at org.joda.time.field.PreciseDurationDateTimeField.set(PreciseDurationDateTimeField.java:79)
	at org.joda.time.field.BaseDateTimeField.addWrapField(BaseDateTimeField.java:464)
	at org.joda.time.chrono.ZonedChronology$ZonedDateTimeField.addWrapField(ZonedChronology.java:475)
	at org.joda.time.DateTime$Property.addWrapFieldToCopy(DateTime.java:2203)
	at org.joda.time.TestDateTime_Properties.testPropertyAddWrapFieldWeekOfWeekyear(TestDateTime_Properties.java:899)

testPropertyAddWrapFieldYear(org.joda.time.TestDateTime_Properties)  Time elapsed: 0.001 sec  <<< FAILURE!
junit.framework.ComparisonFailure: expected:<[2013-06-09T00:00:00.000+01:00]> but was:<[-292271127-06-09T00:00:00.000-00:01:15]>
	at junit.framework.Assert.assertEquals(Assert.java:81)
	at junit.framework.Assert.assertEquals(Assert.java:87)
	at org.joda.time.TestDateTime_Properties.testPropertyAddWrapFieldYear(TestDateTime_Properties.java:273)

testPropertyAddWrapFieldDayOfWeek(org.joda.time.TestMutableDateTime_Properties)  Time elapsed: 0.001 sec  <<< ERROR!
org.joda.time.IllegalFieldValueException: Value 8 for dayOfWeek must be in the range [1,7]
	at org.joda.time.field.FieldUtils.verifyValueBounds(FieldUtils.java:46)
	at org.joda.time.field.PreciseDurationDateTimeField.set(PreciseDurationDateTimeField.java:79)
	at org.joda.time.field.BaseDateTimeField.addWrapField(BaseDateTimeField.java:464)
	at org.joda.time.chrono.ZonedChronology$ZonedDateTimeField.addWrapField(ZonedChronology.java:475)
	at org.joda.time.MutableDateTime$Property.addWrapField(MutableDateTime.java:1371)
	at org.joda.time.TestMutableDateTime_Properties.testPropertyAddWrapFieldDayOfWeek(TestMutableDateTime_Properties.java:481)

testPropertyAddWrapFieldDayOfMonth(org.joda.time.TestMutableDateTime_Properties)  Time elapsed: 0 sec  <<< ERROR!
org.joda.time.IllegalFieldValueException: Value 31 for dayOfMonth must be in the range [1,30]
	at org.joda.time.field.FieldUtils.verifyValueBounds(FieldUtils.java:46)
	at org.joda.time.field.PreciseDurationDateTimeField.set(PreciseDurationDateTimeField.java:79)
	at org.joda.time.field.BaseDateTimeField.addWrapField(BaseDateTimeField.java:464)
	at org.joda.time.chrono.ZonedChronology$ZonedDateTimeField.addWrapField(ZonedChronology.java:475)
	at org.joda.time.MutableDateTime$Property.addWrapField(MutableDateTime.java:1371)
	at org.joda.time.TestMutableDateTime_Properties.testPropertyAddWrapFieldDayOfMonth(TestMutableDateTime_Properties.java:323)

testPropertyAddWrapFieldMonthOfYear(org.joda.time.TestMutableDateTime_Properties)  Time elapsed: 0 sec  <<< ERROR!
org.joda.time.IllegalFieldValueException: Value 14 for monthOfYear must be in the range [1,12]
	at org.joda.time.field.FieldUtils.verifyValueBounds(FieldUtils.java:46)
	at org.joda.time.chrono.BasicMonthOfYearDateTimeField.set(BasicMonthOfYearDateTimeField.java:299)
	at org.joda.time.chrono.BasicMonthOfYearDateTimeField.addWrapField(BasicMonthOfYearDateTimeField.java:239)
	at org.joda.time.chrono.ZonedChronology$ZonedDateTimeField.addWrapField(ZonedChronology.java:475)
	at org.joda.time.MutableDateTime$Property.addWrapField(MutableDateTime.java:1371)
	at org.joda.time.TestMutableDateTime_Properties.testPropertyAddWrapFieldMonthOfYear(TestMutableDateTime_Properties.java:267)

testPropertyAddWrapFieldDayOfYear(org.joda.time.TestMutableDateTime_Properties)  Time elapsed: 0.001 sec  <<< ERROR!
org.joda.time.IllegalFieldValueException: Value 367 for dayOfYear must be in the range [1,366]
	at org.joda.time.field.FieldUtils.verifyValueBounds(FieldUtils.java:46)
	at org.joda.time.field.PreciseDurationDateTimeField.set(PreciseDurationDateTimeField.java:79)
	at org.joda.time.field.BaseDateTimeField.addWrapField(BaseDateTimeField.java:464)
	at org.joda.time.chrono.ZonedChronology$ZonedDateTimeField.addWrapField(ZonedChronology.java:475)
	at org.joda.time.MutableDateTime$Property.addWrapField(MutableDateTime.java:1371)
	at org.joda.time.TestMutableDateTime_Properties.testPropertyAddWrapFieldDayOfYear(TestMutableDateTime_Properties.java:368)

testPropertyAddWrapFieldWeekOfWeekyear(org.joda.time.TestMutableDateTime_Properties)  Time elapsed: 0 sec  <<< ERROR!
org.joda.time.IllegalFieldValueException: Value 54 for weekOfWeekyear must be in the range [1,53]
	at org.joda.time.field.FieldUtils.verifyValueBounds(FieldUtils.java:46)
	at org.joda.time.field.PreciseDurationDateTimeField.set(PreciseDurationDateTimeField.java:79)
	at org.joda.time.field.BaseDateTimeField.addWrapField(BaseDateTimeField.java:464)
	at org.joda.time.chrono.ZonedChronology$ZonedDateTimeField.addWrapField(ZonedChronology.java:475)
	at org.joda.time.MutableDateTime$Property.addWrapField(MutableDateTime.java:1371)
	at org.joda.time.TestMutableDateTime_Properties.testPropertyAddWrapFieldWeekOfWeekyear(TestMutableDateTime_Properties.java:425)

testPropertyAddWrapFieldYear(org.joda.time.TestMutableDateTime_Properties)  Time elapsed: 0 sec  <<< FAILURE!
junit.framework.ComparisonFailure: expected:<[2013-06-09T00:00:00.000+01:00]> but was:<[-292271127-06-09T00:00:00.000-00:01:15]>
	at junit.framework.Assert.assertEquals(Assert.java:81)
	at junit.framework.Assert.assertEquals(Assert.java:87)
	at org.joda.time.TestMutableDateTime_Properties.testPropertyAddWrapFieldYear(TestMutableDateTime_Properties.java:216)

testPropertyAddWrapFieldMonthOfYear(org.joda.time.TestDateMidnight_Properties)  Time elapsed: 0 sec  <<< ERROR!
org.joda.time.IllegalFieldValueException: Value 14 for monthOfYear must be in the range [1,12]
	at org.joda.time.field.FieldUtils.verifyValueBounds(FieldUtils.java:46)
	at org.joda.time.chrono.BasicMonthOfYearDateTimeField.set(BasicMonthOfYearDateTimeField.java:299)
	at org.joda.time.chrono.BasicMonthOfYearDateTimeField.addWrapField(BasicMonthOfYearDateTimeField.java:239)
	at org.joda.time.chrono.ZonedChronology$ZonedDateTimeField.addWrapField(ZonedChronology.java:475)
	at org.joda.time.DateMidnight$Property.addWrapFieldToCopy(DateMidnight.java:1344)
	at org.joda.time.TestDateMidnight_Properties.testPropertyAddWrapFieldMonthOfYear(TestDateMidnight_Properties.java:292)

testPropertyAddWrapFieldToCopyYear(org.joda.time.TestLocalDateTime_Properties)  Time elapsed: 0 sec  <<< FAILURE!
junit.framework.AssertionFailedError: expected:<1981> but was:<-292271159>
	at junit.framework.Assert.fail(Assert.java:47)
	at junit.framework.Assert.failNotEquals(Assert.java:280)
	at junit.framework.Assert.assertEquals(Assert.java:64)
	at junit.framework.Assert.assertEquals(Assert.java:198)
	at junit.framework.Assert.assertEquals(Assert.java:204)
	at org.joda.time.TestLocalDateTime_Properties.check(TestLocalDateTime_Properties.java:1076)
	at org.joda.time.TestLocalDateTime_Properties.testPropertyAddWrapFieldToCopyYear(TestLocalDateTime_Properties.java:149)

testPropertyAddWrapFieldToCopyDay(org.joda.time.TestLocalDateTime_Properties)  Time elapsed: 0.001 sec  <<< ERROR!
org.joda.time.IllegalFieldValueException: Value 31 for dayOfMonth must be in the range [1,30]
	at org.joda.time.field.FieldUtils.verifyValueBounds(FieldUtils.java:46)
	at org.joda.time.field.PreciseDurationDateTimeField.set(PreciseDurationDateTimeField.java:79)
	at org.joda.time.field.BaseDateTimeField.addWrapField(BaseDateTimeField.java:464)
	at org.joda.time.LocalDateTime$Property.addWrapFieldToCopy(LocalDateTime.java:2262)
	at org.joda.time.TestLocalDateTime_Properties.testPropertyAddWrapFieldToCopyDay(TestLocalDateTime_Properties.java:417)

testPropertyAddWrapFieldToCopyMonth(org.joda.time.TestLocalDateTime_Properties)  Time elapsed: 0.001 sec  <<< ERROR!
org.joda.time.IllegalFieldValueException: Value 14 for monthOfYear must be in the range [1,12]
	at org.joda.time.field.FieldUtils.verifyValueBounds(FieldUtils.java:46)
	at org.joda.time.chrono.BasicMonthOfYearDateTimeField.set(BasicMonthOfYearDateTimeField.java:299)
	at org.joda.time.chrono.BasicMonthOfYearDateTimeField.addWrapField(BasicMonthOfYearDateTimeField.java:239)
	at org.joda.time.LocalDateTime$Property.addWrapFieldToCopy(LocalDateTime.java:2262)
	at org.joda.time.TestLocalDateTime_Properties.testPropertyAddWrapFieldToCopyMonth(TestLocalDateTime_Properties.java:263)

testPropertyAddWrapFieldToCopyYear(org.joda.time.TestLocalDate_Properties)  Time elapsed: 0 sec  <<< FAILURE!
junit.framework.AssertionFailedError: expected:<1981> but was:<-292271159>
	at junit.framework.Assert.fail(Assert.java:47)
	at junit.framework.Assert.failNotEquals(Assert.java:280)
	at junit.framework.Assert.assertEquals(Assert.java:64)
	at junit.framework.Assert.assertEquals(Assert.java:198)
	at junit.framework.Assert.assertEquals(Assert.java:204)
	at org.joda.time.TestLocalDate_Properties.check(TestLocalDate_Properties.java:551)
	at org.joda.time.TestLocalDate_Properties.testPropertyAddWrapFieldToCopyYear(TestLocalDate_Properties.java:144)

testPropertyAddWrapFieldToCopyDay(org.joda.time.TestLocalDate_Properties)  Time elapsed: 0 sec  <<< ERROR!
org.joda.time.IllegalFieldValueException: Value 31 for dayOfMonth must be in the range [1,30]
	at org.joda.time.field.FieldUtils.verifyValueBounds(FieldUtils.java:46)
	at org.joda.time.field.PreciseDurationDateTimeField.set(PreciseDurationDateTimeField.java:79)
	at org.joda.time.field.BaseDateTimeField.addWrapField(BaseDateTimeField.java:464)
	at org.joda.time.LocalDate$Property.addWrapFieldToCopy(LocalDate.java:1993)
	at org.joda.time.TestLocalDate_Properties.testPropertyAddWrapFieldToCopyDay(TestLocalDate_Properties.java:412)

testPropertyAddWrapFieldToCopyMonth(org.joda.time.TestLocalDate_Properties)  Time elapsed: 0 sec  <<< ERROR!
org.joda.time.IllegalFieldValueException: Value 14 for monthOfYear must be in the range [1,12]
	at org.joda.time.field.FieldUtils.verifyValueBounds(FieldUtils.java:46)
	at org.joda.time.chrono.BasicMonthOfYearDateTimeField.set(BasicMonthOfYearDateTimeField.java:299)
	at org.joda.time.chrono.BasicMonthOfYearDateTimeField.addWrapField(BasicMonthOfYearDateTimeField.java:239)
	at org.joda.time.LocalDate$Property.addWrapFieldToCopy(LocalDate.java:1993)
	at org.joda.time.TestLocalDate_Properties.testPropertyAddWrapFieldToCopyMonth(TestLocalDate_Properties.java:258)

testPropertyAddWrapFieldMonth(org.joda.time.TestYearMonthDay_Properties)  Time elapsed: 0.001 sec  <<< ERROR!
org.joda.time.IllegalFieldValueException: Value 14 for monthOfYear must be in the range [1,12]
	at org.joda.time.field.FieldUtils.verifyValueBounds(FieldUtils.java:46)
	at org.joda.time.field.BaseDateTimeField.set(BaseDateTimeField.java:585)
	at org.joda.time.field.BaseDateTimeField.addWrapField(BaseDateTimeField.java:498)
	at org.joda.time.YearMonthDay$Property.addWrapFieldToCopy(YearMonthDay.java:1035)
	at org.joda.time.TestYearMonthDay_Properties.testPropertyAddWrapFieldMonth(TestYearMonthDay_Properties.java:261)

testPropertyAddWrapFieldDay(org.joda.time.TestYearMonthDay_Properties)  Time elapsed: 0.001 sec  <<< ERROR!
org.joda.time.IllegalFieldValueException: Value 31 for dayOfMonth must be in the range [1,30]
	at org.joda.time.field.FieldUtils.verifyValueBounds(FieldUtils.java:46)
	at org.joda.time.field.BaseDateTimeField.set(BaseDateTimeField.java:585)
	at org.joda.time.field.BaseDateTimeField.addWrapField(BaseDateTimeField.java:498)
	at org.joda.time.YearMonthDay$Property.addWrapFieldToCopy(YearMonthDay.java:1035)
	at org.joda.time.TestYearMonthDay_Properties.testPropertyAddWrapFieldDay(TestYearMonthDay_Properties.java:416)

testPropertyAddWrapFieldYear(org.joda.time.TestYearMonthDay_Properties)  Time elapsed: 0.001 sec  <<< FAILURE!
junit.framework.AssertionFailedError: expected:<1981> but was:<-292271159>
	at junit.framework.Assert.fail(Assert.java:47)
	at junit.framework.Assert.failNotEquals(Assert.java:280)
	at junit.framework.Assert.assertEquals(Assert.java:64)
	at junit.framework.Assert.assertEquals(Assert.java:198)
	at junit.framework.Assert.assertEquals(Assert.java:204)
	at org.joda.time.TestYearMonthDay_Properties.check(TestYearMonthDay_Properties.java:555)
	at org.joda.time.TestYearMonthDay_Properties.testPropertyAddWrapFieldYear(TestYearMonthDay_Properties.java:146)

testPropertyAddWrapFieldMonth(org.joda.time.TestYearMonth_Properties)  Time elapsed: 0.001 sec  <<< ERROR!
org.joda.time.IllegalFieldValueException: Value 14 for monthOfYear must be in the range [1,12]
	at org.joda.time.field.FieldUtils.verifyValueBounds(FieldUtils.java:46)
	at org.joda.time.field.BaseDateTimeField.set(BaseDateTimeField.java:585)
	at org.joda.time.field.BaseDateTimeField.addWrapField(BaseDateTimeField.java:498)
	at org.joda.time.YearMonth$Property.addWrapFieldToCopy(YearMonth.java:938)
	at org.joda.time.TestYearMonth_Properties.testPropertyAddWrapFieldMonth(TestYearMonth_Properties.java:246)

testPropertyAddWrapFieldYear(org.joda.time.TestYearMonth_Properties)  Time elapsed: 0.001 sec  <<< FAILURE!
junit.framework.AssertionFailedError: expected:<1981> but was:<-292271159>
	at junit.framework.Assert.fail(Assert.java:47)
	at junit.framework.Assert.failNotEquals(Assert.java:280)
	at junit.framework.Assert.assertEquals(Assert.java:64)
	at junit.framework.Assert.assertEquals(Assert.java:198)
	at junit.framework.Assert.assertEquals(Assert.java:204)
	at org.joda.time.TestYearMonth_Properties.check(TestYearMonth_Properties.java:363)
	at org.joda.time.TestYearMonth_Properties.testPropertyAddWrapFieldYear(TestYearMonth_Properties.java:145)

testPropertyAddWrapFieldDayOfMonth(org.joda.time.TestMonthDay_Properties)  Time elapsed: 0 sec  <<< FAILURE!
junit.framework.AssertionFailedError: expected:<28> but was:<30>
	at junit.framework.Assert.fail(Assert.java:47)
	at junit.framework.Assert.failNotEquals(Assert.java:280)
	at junit.framework.Assert.assertEquals(Assert.java:64)
	at junit.framework.Assert.assertEquals(Assert.java:198)
	at junit.framework.Assert.assertEquals(Assert.java:204)
	at org.joda.time.TestMonthDay_Properties.check(TestMonthDay_Properties.java:346)
	at org.joda.time.TestMonthDay_Properties.testPropertyAddWrapFieldDayOfMonth(TestMonthDay_Properties.java:232)

testPropertyAddWrapFieldMonthOfYear(org.joda.time.TestMonthDay_Properties)  Time elapsed: 0.001 sec  <<< FAILURE!
junit.framework.AssertionFailedError: expected:<11> but was:<1>
	at junit.framework.Assert.fail(Assert.java:47)
	at junit.framework.Assert.failNotEquals(Assert.java:280)
	at junit.framework.Assert.assertEquals(Assert.java:64)
	at junit.framework.Assert.assertEquals(Assert.java:198)
	at junit.framework.Assert.assertEquals(Assert.java:204)
	at org.joda.time.TestMonthDay_Properties.check(TestMonthDay_Properties.java:345)
	at org.joda.time.TestMonthDay_Properties.testPropertyAddWrapFieldMonthOfYear(TestMonthDay_Properties.java:133)

test_DateTime_addWrapFieldDay_Gaza(org.joda.time.TestDateTimeZoneCutover)  Time elapsed: 0.001 sec  <<< ERROR!
org.joda.time.IllegalFieldValueException: Value 31 for dayOfMonth must be in the range [1,30]
	at org.joda.time.field.FieldUtils.verifyValueBounds(FieldUtils.java:46)
	at org.joda.time.field.PreciseDurationDateTimeField.set(PreciseDurationDateTimeField.java:79)
	at org.joda.time.field.BaseDateTimeField.addWrapField(BaseDateTimeField.java:464)
	at org.joda.time.chrono.ZonedChronology$ZonedDateTimeField.addWrapField(ZonedChronology.java:475)
	at org.joda.time.DateTime$Property.addWrapFieldToCopy(DateTime.java:2203)
	at org.joda.time.TestDateTimeZoneCutover.test_DateTime_addWrapFieldDay_Gaza(TestDateTimeZoneCutover.java:192)

test_DateTime_addWrapFieldDay_Turk(org.joda.time.TestDateTimeZoneCutover)  Time elapsed: 0.001 sec  <<< ERROR!
org.joda.time.IllegalFieldValueException: Value 31 for dayOfMonth must be in the range [1,30]
	at org.joda.time.field.FieldUtils.verifyValueBounds(FieldUtils.java:46)
	at org.joda.time.field.PreciseDurationDateTimeField.set(PreciseDurationDateTimeField.java:79)
	at org.joda.time.field.BaseDateTimeField.addWrapField(BaseDateTimeField.java:464)
	at org.joda.time.chrono.ZonedChronology$ZonedDateTimeField.addWrapField(ZonedChronology.java:475)
	at org.joda.time.DateTime$Property.addWrapFieldToCopy(DateTime.java:2203)
	at org.joda.time.TestDateTimeZoneCutover.test_DateTime_addWrapFieldDay_Turk(TestDateTimeZoneCutover.java:409)

testSampleDate(org.joda.time.chrono.TestCopticChronology)  Time elapsed: 0 sec  <<< ERROR!
org.joda.time.IllegalFieldValueException: Value 14 for monthOfYear must be in the range [1,13]
	at org.joda.time.field.FieldUtils.verifyValueBounds(FieldUtils.java:46)
	at org.joda.time.chrono.BasicMonthOfYearDateTimeField.set(BasicMonthOfYearDateTimeField.java:299)
	at org.joda.time.chrono.BasicMonthOfYearDateTimeField.addWrapField(BasicMonthOfYearDateTimeField.java:239)
	at org.joda.time.chrono.LimitChronology$LimitDateTimeField.addWrapField(LimitChronology.java:492)
	at org.joda.time.DateTime$Property.addWrapFieldToCopy(DateTime.java:2203)
	at org.joda.time.chrono.TestCopticChronology.testSampleDate(TestCopticChronology.java:424)

testSampleDate(org.joda.time.chrono.TestEthiopicChronology)  Time elapsed: 0.001 sec  <<< ERROR!
org.joda.time.IllegalFieldValueException: Value 14 for monthOfYear must be in the range [1,13]
	at org.joda.time.field.FieldUtils.verifyValueBounds(FieldUtils.java:46)
	at org.joda.time.chrono.BasicMonthOfYearDateTimeField.set(BasicMonthOfYearDateTimeField.java:299)
	at org.joda.time.chrono.BasicMonthOfYearDateTimeField.addWrapField(BasicMonthOfYearDateTimeField.java:239)
	at org.joda.time.chrono.LimitChronology$LimitDateTimeField.addWrapField(LimitChronology.java:492)
	at org.joda.time.DateTime$Property.addWrapFieldToCopy(DateTime.java:2203)
	at org.joda.time.chrono.TestEthiopicChronology.testSampleDate(TestEthiopicChronology.java:424)

testSampleDate1(org.joda.time.chrono.TestIslamicChronology)  Time elapsed: 0.001 sec  <<< ERROR!
org.joda.time.IllegalFieldValueException: Value 13 for monthOfYear must be in the range [1,12]
	at org.joda.time.field.FieldUtils.verifyValueBounds(FieldUtils.java:46)
	at org.joda.time.chrono.BasicMonthOfYearDateTimeField.set(BasicMonthOfYearDateTimeField.java:299)
	at org.joda.time.chrono.BasicMonthOfYearDateTimeField.addWrapField(BasicMonthOfYearDateTimeField.java:239)
	at org.joda.time.chrono.LimitChronology$LimitDateTimeField.addWrapField(LimitChronology.java:492)
	at org.joda.time.DateTime$Property.addWrapFieldToCopy(DateTime.java:2203)
	at org.joda.time.chrono.TestIslamicChronology.testSampleDate1(TestIslamicChronology.java:438)

testChronology(org.joda.time.chrono.gj.MainTest)  Time elapsed: 0.003 sec  <<< FAILURE!
junit.framework.AssertionFailedError
	at junit.framework.Assert.fail(Assert.java:47)
	at org.joda.time.chrono.gj.MainTest.testChronology(MainTest.java:158)

testChronology(org.joda.time.chrono.gj.MainTest)  Time elapsed: 0.003 sec  <<< FAILURE!
junit.framework.AssertionFailedError
	at junit.framework.Assert.fail(Assert.java:47)
	at org.joda.time.chrono.gj.MainTest.testChronology(MainTest.java:158)

test_addWrapField_long_int(org.joda.time.field.TestOffsetDateTimeField)  Time elapsed: 0.001 sec  <<< ERROR!
org.joda.time.IllegalFieldValueException: Value 63 for secondOfMinute must be in the range [3,62]
	at org.joda.time.field.FieldUtils.verifyValueBounds(FieldUtils.java:46)
	at org.joda.time.field.OffsetDateTimeField.set(OffsetDateTimeField.java:153)
	at org.joda.time.field.OffsetDateTimeField.addWrapField(OffsetDateTimeField.java:141)
	at org.joda.time.field.TestOffsetDateTimeField.test_addWrapField_long_int(TestOffsetDateTimeField.java:268)

test_addWrapField_RP_int_intarray_int(org.joda.time.field.TestOffsetDateTimeField)  Time elapsed: 0.001 sec  <<< ERROR!
org.joda.time.IllegalFieldValueException: Value 63 for secondOfMinute must be in the range [3,62]
	at org.joda.time.field.FieldUtils.verifyValueBounds(FieldUtils.java:46)
	at org.joda.time.field.BaseDateTimeField.set(BaseDateTimeField.java:585)
	at org.joda.time.field.BaseDateTimeField.addWrapField(BaseDateTimeField.java:498)
	at org.joda.time.field.TestOffsetDateTimeField.test_addWrapField_RP_int_intarray_int(TestOffsetDateTimeField.java:285)


Results :

Failed tests: 
  org.joda.time.TestDateTime_Properties#testPropertyAddWrapFieldYear ComparisonFailure
  org.joda.time.TestLocalDateTime_Properties#testPropertyAddWrapFieldToCopyYear AssertionFailedError
  org.joda.time.TestLocalDate_Properties#testPropertyAddWrapFieldToCopyYear AssertionFailedError
  org.joda.time.TestMonthDay_Properties#testPropertyAddWrapFieldDayOfMonth AssertionFailedError
  org.joda.time.TestMonthDay_Properties#testPropertyAddWrapFieldMonthOfYear AssertionFailedError
  org.joda.time.TestMutableDateTime_Properties#testPropertyAddWrapFieldYear ComparisonFailure
  org.joda.time.TestYearMonthDay_Properties#testPropertyAddWrapFieldYear AssertionFailedError
  org.joda.time.TestYearMonth_Properties#testPropertyAddWrapFieldYear AssertionFailedError
org.joda.time.chrono.gj.MainTest.testChronology(org.joda.time.chrono.gj.MainTest)
  Run 1: org.joda.time.chrono.gj.MainTest#testChronology AssertionFailedError
  Run 2: org.joda.time.chrono.gj.MainTest#testChronology AssertionFailedError

Tests in error: 
  org.joda.time.TestDateMidnight_Properties#testPropertyAddWrapFieldMonthOfYear IllegalFieldValueException
  org.joda.time.TestDateTimeZoneCutover#test_DateTime_addWrapFieldDay_Gaza IllegalFieldValueException
  org.joda.time.TestDateTimeZoneCutover#test_DateTime_addWrapFieldDay_Turk IllegalFieldValueException
  org.joda.time.TestDateTime_Properties#testPropertyAddWrapFieldDayOfMonth IllegalFieldValueException
  org.joda.time.TestDateTime_Properties#testPropertyAddWrapFieldDayOfWeek IllegalFieldValueException
  org.joda.time.TestDateTime_Properties#testPropertyAddWrapFieldDayOfYear IllegalFieldValueException
  org.joda.time.TestDateTime_Properties#testPropertyAddWrapFieldMonthOfYear IllegalFieldValueException
  org.joda.time.TestDateTime_Properties#testPropertyAddWrapFieldWeekOfWeekyear IllegalFieldValueException
  org.joda.time.TestLocalDateTime_Properties#testPropertyAddWrapFieldToCopyDay IllegalFieldValueException
  org.joda.time.TestLocalDateTime_Properties#testPropertyAddWrapFieldToCopyMonth IllegalFieldValueException
  org.joda.time.TestLocalDate_Properties#testPropertyAddWrapFieldToCopyDay IllegalFieldValueException
  org.joda.time.TestLocalDate_Properties#testPropertyAddWrapFieldToCopyMonth IllegalFieldValueException
  org.joda.time.TestMutableDateTime_Properties#testPropertyAddWrapFieldDayOfMonth IllegalFieldValueException
  org.joda.time.TestMutableDateTime_Properties#testPropertyAddWrapFieldDayOfWeek IllegalFieldValueException
  org.joda.time.TestMutableDateTime_Properties#testPropertyAddWrapFieldDayOfYear IllegalFieldValueException
  org.joda.time.TestMutableDateTime_Properties#testPropertyAddWrapFieldMonthOfYear IllegalFieldValueException
  org.joda.time.TestMutableDateTime_Properties#testPropertyAddWrapFieldWeekOfWeekyear IllegalFieldValueException
  org.joda.time.TestYearMonthDay_Properties#testPropertyAddWrapFieldDay IllegalFieldValueException
  org.joda.time.TestYearMonthDay_Properties#testPropertyAddWrapFieldMonth IllegalFieldValueException
  org.joda.time.TestYearMonth_Properties#testPropertyAddWrapFieldMonth IllegalFieldValueException
  org.joda.time.chrono.TestCopticChronology#testSampleDate IllegalFieldValueException
  org.joda.time.chrono.TestEthiopicChronology#testSampleDate IllegalFieldValueException
  org.joda.time.chrono.TestIslamicChronology#testSampleDate1 IllegalFieldValueException
  org.joda.time.field.TestOffsetDateTimeField#test_addWrapField_RP_int_intarray_int IllegalFieldValueException
  org.joda.time.field.TestOffsetDateTimeField#test_addWrapField_long_int IllegalFieldValueException

Tests run: 4156, Failures: 9, Errors: 25, Skipped: 0

[INFO] ------------------------------------------------------------------------
[INFO] BUILD FAILURE
[INFO] ------------------------------------------------------------------------
[INFO] Total time: 14.847s
[INFO] Finished at: Thu Aug 06 04:34:38 BST 2015
[INFO] Final Memory: 8M/213M
[INFO] ------------------------------------------------------------------------
[ERROR] Failed to execute goal org.apache.maven.plugins:maven-surefire-plugin:2.18.1:test (default-test) on project joda-time: There are test failures.
[ERROR] 
[ERROR] Please refer to /home/perham/Study/LittleDarwin/Cases/joda-time-2.8.1/target/surefire-reports for the individual test results.
[ERROR] -> [Help 1]
[ERROR] 
[ERROR] To see the full stack trace of the errors, re-run Maven with the -e switch.
[ERROR] Re-run Maven using the -X switch to enable full debug logging.
[ERROR] 
[ERROR] For more information about the errors and possible solutions, please read the following articles:
[ERROR] [Help 1] http://cwiki.apache.org/confluence/display/MAVEN/MojoFailureException
