[INFO] Scanning for projects...
[INFO]                                                                         
[INFO] ------------------------------------------------------------------------
[INFO] Building Joda-Time 2.8.1
[INFO] ------------------------------------------------------------------------
[INFO] 
[INFO] --- maven-resources-plugin:2.7:resources (default-resources) @ joda-time ---
[INFO] Using 'UTF-8' encoding to copy filtered resources.
[INFO] Copying 2 resources to META-INF
[INFO] Copying 10 resources
[INFO] 
[INFO] --- maven-compiler-plugin:3.3:compile (default-compile) @ joda-time ---
[INFO] Changes detected - recompiling the module!
[INFO] Compiling 166 source files to /home/perham/Study/LittleDarwin/Cases/joda-time-2.8.1/target/classes
[INFO] 
[INFO] --- exec-maven-plugin:1.4.0:java (compile-tzdb) @ joda-time ---
Writing zoneinfo files
Writing ZoneInfoMap
[INFO] 
[INFO] --- maven-resources-plugin:2.7:testResources (default-testResources) @ joda-time ---
[INFO] Using 'UTF-8' encoding to copy filtered resources.
[INFO] Copying 34 resources
[INFO] 
[INFO] --- maven-compiler-plugin:3.3:testCompile (default-testCompile) @ joda-time ---
[INFO] Nothing to compile - all classes are up to date
[INFO] 
[INFO] --- maven-surefire-plugin:2.18.1:test (default-test) @ joda-time ---
[INFO] Surefire report directory: /home/perham/Study/LittleDarwin/Cases/joda-time-2.8.1/target/surefire-reports

-------------------------------------------------------
 T E S T S
-------------------------------------------------------
Running org.joda.time.TestAllPackages

TestBuddhistChronology.testCalendar

TestCopticChronology.testCalendar

TestEthiopicChronology.testCalendar

TestIslamicChronology.testCalendar

Testing Gregorian chronology over 1000 iterations
100% complete (i=1000)

Testing Julian chronology over 1000 iterations
100% complete (i=1000)
Writing zoneinfo files
Writing ZoneInfoMap
Tests run: 4157, Failures: 0, Errors: 49, Skipped: 0, Time elapsed: 5.231 sec <<< FAILURE! - in org.joda.time.TestAllPackages
testNegated(org.joda.time.TestYears)  Time elapsed: 0.003 sec  <<< ERROR!
java.lang.ArithmeticException: Integer.MIN_VALUE cannot be negated
	at org.joda.time.field.FieldUtils.safeNegate(FieldUtils.java:13)
	at org.joda.time.Years.negated(Years.java:318)
	at org.joda.time.TestYears.testNegated(TestYears.java:302)

testMinus_Years(org.joda.time.TestYears)  Time elapsed: 0.001 sec  <<< ERROR!
java.lang.ArithmeticException: Integer.MIN_VALUE cannot be negated
	at org.joda.time.field.FieldUtils.safeNegate(FieldUtils.java:13)
	at org.joda.time.Years.minus(Years.java:260)
	at org.joda.time.Years.minus(Years.java:276)
	at org.joda.time.TestYears.testMinus_Years(TestYears.java:250)

testMinus_int(org.joda.time.TestYears)  Time elapsed: 0.001 sec  <<< ERROR!
java.lang.ArithmeticException: Integer.MIN_VALUE cannot be negated
	at org.joda.time.field.FieldUtils.safeNegate(FieldUtils.java:13)
	at org.joda.time.Years.minus(Years.java:260)
	at org.joda.time.TestYears.testMinus_int(TestYears.java:233)

testNegated(org.joda.time.TestMonths)  Time elapsed: 0.001 sec  <<< ERROR!
java.lang.ArithmeticException: Integer.MIN_VALUE cannot be negated
	at org.joda.time.field.FieldUtils.safeNegate(FieldUtils.java:13)
	at org.joda.time.Months.negated(Months.java:354)
	at org.joda.time.TestMonths.testNegated(TestMonths.java:347)

testMinus_Months(org.joda.time.TestMonths)  Time elapsed: 0.001 sec  <<< ERROR!
java.lang.ArithmeticException: Integer.MIN_VALUE cannot be negated
	at org.joda.time.field.FieldUtils.safeNegate(FieldUtils.java:13)
	at org.joda.time.Months.minus(Months.java:296)
	at org.joda.time.Months.minus(Months.java:312)
	at org.joda.time.TestMonths.testMinus_Months(TestMonths.java:295)

testMinus_int(org.joda.time.TestMonths)  Time elapsed: 0 sec  <<< ERROR!
java.lang.ArithmeticException: Integer.MIN_VALUE cannot be negated
	at org.joda.time.field.FieldUtils.safeNegate(FieldUtils.java:13)
	at org.joda.time.Months.minus(Months.java:296)
	at org.joda.time.TestMonths.testMinus_int(TestMonths.java:278)

testNegated(org.joda.time.TestWeeks)  Time elapsed: 0 sec  <<< ERROR!
java.lang.ArithmeticException: Integer.MIN_VALUE cannot be negated
	at org.joda.time.field.FieldUtils.safeNegate(FieldUtils.java:13)
	at org.joda.time.Weeks.negated(Weeks.java:434)
	at org.joda.time.TestWeeks.testNegated(TestWeeks.java:381)

testMinus_Weeks(org.joda.time.TestWeeks)  Time elapsed: 0.001 sec  <<< ERROR!
java.lang.ArithmeticException: Integer.MIN_VALUE cannot be negated
	at org.joda.time.field.FieldUtils.safeNegate(FieldUtils.java:13)
	at org.joda.time.Weeks.minus(Weeks.java:376)
	at org.joda.time.Weeks.minus(Weeks.java:392)
	at org.joda.time.TestWeeks.testMinus_Weeks(TestWeeks.java:329)

testMinus_int(org.joda.time.TestWeeks)  Time elapsed: 0.001 sec  <<< ERROR!
java.lang.ArithmeticException: Integer.MIN_VALUE cannot be negated
	at org.joda.time.field.FieldUtils.safeNegate(FieldUtils.java:13)
	at org.joda.time.Weeks.minus(Weeks.java:376)
	at org.joda.time.TestWeeks.testMinus_int(TestWeeks.java:312)

testNegated(org.joda.time.TestDays)  Time elapsed: 0 sec  <<< ERROR!
java.lang.ArithmeticException: Integer.MIN_VALUE cannot be negated
	at org.joda.time.field.FieldUtils.safeNegate(FieldUtils.java:13)
	at org.joda.time.Days.negated(Days.java:448)
	at org.joda.time.TestDays.testNegated(TestDays.java:416)

testMinus_Days(org.joda.time.TestDays)  Time elapsed: 0.001 sec  <<< ERROR!
java.lang.ArithmeticException: Integer.MIN_VALUE cannot be negated
	at org.joda.time.field.FieldUtils.safeNegate(FieldUtils.java:13)
	at org.joda.time.Days.minus(Days.java:390)
	at org.joda.time.Days.minus(Days.java:406)
	at org.joda.time.TestDays.testMinus_Days(TestDays.java:364)

testMinus_int(org.joda.time.TestDays)  Time elapsed: 0.001 sec  <<< ERROR!
java.lang.ArithmeticException: Integer.MIN_VALUE cannot be negated
	at org.joda.time.field.FieldUtils.safeNegate(FieldUtils.java:13)
	at org.joda.time.Days.minus(Days.java:390)
	at org.joda.time.TestDays.testMinus_int(TestDays.java:347)

testNegated(org.joda.time.TestHours)  Time elapsed: 0.001 sec  <<< ERROR!
java.lang.ArithmeticException: Integer.MIN_VALUE cannot be negated
	at org.joda.time.field.FieldUtils.safeNegate(FieldUtils.java:13)
	at org.joda.time.Hours.negated(Hours.java:447)
	at org.joda.time.TestHours.testNegated(TestHours.java:378)

testMinus_Hours(org.joda.time.TestHours)  Time elapsed: 0.001 sec  <<< ERROR!
java.lang.ArithmeticException: Integer.MIN_VALUE cannot be negated
	at org.joda.time.field.FieldUtils.safeNegate(FieldUtils.java:13)
	at org.joda.time.Hours.minus(Hours.java:389)
	at org.joda.time.Hours.minus(Hours.java:405)
	at org.joda.time.TestHours.testMinus_Hours(TestHours.java:326)

testMinus_int(org.joda.time.TestHours)  Time elapsed: 0 sec  <<< ERROR!
java.lang.ArithmeticException: Integer.MIN_VALUE cannot be negated
	at org.joda.time.field.FieldUtils.safeNegate(FieldUtils.java:13)
	at org.joda.time.Hours.minus(Hours.java:389)
	at org.joda.time.TestHours.testMinus_int(TestHours.java:309)

testNegated(org.joda.time.TestMinutes)  Time elapsed: 0 sec  <<< ERROR!
java.lang.ArithmeticException: Integer.MIN_VALUE cannot be negated
	at org.joda.time.field.FieldUtils.safeNegate(FieldUtils.java:13)
	at org.joda.time.Minutes.negated(Minutes.java:428)
	at org.joda.time.TestMinutes.testNegated(TestMinutes.java:361)

testMinus_Minutes(org.joda.time.TestMinutes)  Time elapsed: 0.001 sec  <<< ERROR!
java.lang.ArithmeticException: Integer.MIN_VALUE cannot be negated
	at org.joda.time.field.FieldUtils.safeNegate(FieldUtils.java:13)
	at org.joda.time.Minutes.minus(Minutes.java:370)
	at org.joda.time.Minutes.minus(Minutes.java:386)
	at org.joda.time.TestMinutes.testMinus_Minutes(TestMinutes.java:309)

testMinus_int(org.joda.time.TestMinutes)  Time elapsed: 0.001 sec  <<< ERROR!
java.lang.ArithmeticException: Integer.MIN_VALUE cannot be negated
	at org.joda.time.field.FieldUtils.safeNegate(FieldUtils.java:13)
	at org.joda.time.Minutes.minus(Minutes.java:370)
	at org.joda.time.TestMinutes.testMinus_int(TestMinutes.java:292)

testNegated(org.joda.time.TestSeconds)  Time elapsed: 0 sec  <<< ERROR!
java.lang.ArithmeticException: Integer.MIN_VALUE cannot be negated
	at org.joda.time.field.FieldUtils.safeNegate(FieldUtils.java:13)
	at org.joda.time.Seconds.negated(Seconds.java:428)
	at org.joda.time.TestSeconds.testNegated(TestSeconds.java:351)

testMinus_Seconds(org.joda.time.TestSeconds)  Time elapsed: 0.001 sec  <<< ERROR!
java.lang.ArithmeticException: Integer.MIN_VALUE cannot be negated
	at org.joda.time.field.FieldUtils.safeNegate(FieldUtils.java:13)
	at org.joda.time.Seconds.minus(Seconds.java:370)
	at org.joda.time.Seconds.minus(Seconds.java:386)
	at org.joda.time.TestSeconds.testMinus_Seconds(TestSeconds.java:299)

testMinus_int(org.joda.time.TestSeconds)  Time elapsed: 0 sec  <<< ERROR!
java.lang.ArithmeticException: Integer.MIN_VALUE cannot be negated
	at org.joda.time.field.FieldUtils.safeNegate(FieldUtils.java:13)
	at org.joda.time.Seconds.minus(Seconds.java:370)
	at org.joda.time.TestSeconds.testMinus_int(TestSeconds.java:282)

testMinusHours_int(org.joda.time.TestTimeOfDay_Basics)  Time elapsed: 0.001 sec  <<< ERROR!
java.lang.ArithmeticException: Integer.MIN_VALUE cannot be negated
	at org.joda.time.field.FieldUtils.safeNegate(FieldUtils.java:13)
	at org.joda.time.TimeOfDay.minusHours(TimeOfDay.java:732)
	at org.joda.time.TestTimeOfDay_Basics.testMinusHours_int(TestTimeOfDay_Basics.java:550)

testMinusMinutes_int(org.joda.time.TestTimeOfDay_Basics)  Time elapsed: 0 sec  <<< ERROR!
java.lang.ArithmeticException: Integer.MIN_VALUE cannot be negated
	at org.joda.time.field.FieldUtils.safeNegate(FieldUtils.java:13)
	at org.joda.time.TimeOfDay.minusMinutes(TimeOfDay.java:752)
	at org.joda.time.TestTimeOfDay_Basics.testMinusMinutes_int(TestTimeOfDay_Basics.java:560)

testMinusSeconds_int(org.joda.time.TestTimeOfDay_Basics)  Time elapsed: 0.001 sec  <<< ERROR!
java.lang.ArithmeticException: Integer.MIN_VALUE cannot be negated
	at org.joda.time.field.FieldUtils.safeNegate(FieldUtils.java:13)
	at org.joda.time.TimeOfDay.minusSeconds(TimeOfDay.java:772)
	at org.joda.time.TestTimeOfDay_Basics.testMinusSeconds_int(TestTimeOfDay_Basics.java:570)

testMinusMillis_int(org.joda.time.TestTimeOfDay_Basics)  Time elapsed: 0.001 sec  <<< ERROR!
java.lang.ArithmeticException: Integer.MIN_VALUE cannot be negated
	at org.joda.time.field.FieldUtils.safeNegate(FieldUtils.java:13)
	at org.joda.time.TimeOfDay.minusMillis(TimeOfDay.java:792)
	at org.joda.time.TestTimeOfDay_Basics.testMinusMillis_int(TestTimeOfDay_Basics.java:580)

testMinusYears_int(org.joda.time.TestYearMonthDay_Basics)  Time elapsed: 0 sec  <<< ERROR!
java.lang.ArithmeticException: Integer.MIN_VALUE cannot be negated
	at org.joda.time.field.FieldUtils.safeNegate(FieldUtils.java:13)
	at org.joda.time.YearMonthDay.minusYears(YearMonthDay.java:595)
	at org.joda.time.TestYearMonthDay_Basics.testMinusYears_int(TestYearMonthDay_Basics.java:498)

testMinusMonths_int(org.joda.time.TestYearMonthDay_Basics)  Time elapsed: 0.001 sec  <<< ERROR!
java.lang.ArithmeticException: Integer.MIN_VALUE cannot be negated
	at org.joda.time.field.FieldUtils.safeNegate(FieldUtils.java:13)
	at org.joda.time.YearMonthDay.minusMonths(YearMonthDay.java:615)
	at org.joda.time.TestYearMonthDay_Basics.testMinusMonths_int(TestYearMonthDay_Basics.java:508)

testMinusDays_int(org.joda.time.TestYearMonthDay_Basics)  Time elapsed: 0.001 sec  <<< ERROR!
java.lang.ArithmeticException: Integer.MIN_VALUE cannot be negated
	at org.joda.time.field.FieldUtils.safeNegate(FieldUtils.java:13)
	at org.joda.time.YearMonthDay.minusDays(YearMonthDay.java:635)
	at org.joda.time.TestYearMonthDay_Basics.testMinusDays_int(TestYearMonthDay_Basics.java:518)

testMinusYears_int(org.joda.time.TestYearMonth_Basics)  Time elapsed: 0 sec  <<< ERROR!
java.lang.ArithmeticException: Integer.MIN_VALUE cannot be negated
	at org.joda.time.field.FieldUtils.safeNegate(FieldUtils.java:13)
	at org.joda.time.YearMonth.minusYears(YearMonth.java:639)
	at org.joda.time.TestYearMonth_Basics.testMinusYears_int(TestYearMonth_Basics.java:482)

testMinusMonths_int(org.joda.time.TestYearMonth_Basics)  Time elapsed: 0 sec  <<< ERROR!
java.lang.ArithmeticException: Integer.MIN_VALUE cannot be negated
	at org.joda.time.field.FieldUtils.safeNegate(FieldUtils.java:13)
	at org.joda.time.YearMonth.minusMonths(YearMonth.java:658)
	at org.joda.time.TestYearMonth_Basics.testMinusMonths_int(TestYearMonth_Basics.java:492)

testMinusMonths_int(org.joda.time.TestMonthDay_Basics)  Time elapsed: 0.001 sec  <<< ERROR!
java.lang.ArithmeticException: Integer.MIN_VALUE cannot be negated
	at org.joda.time.field.FieldUtils.safeNegate(FieldUtils.java:13)
	at org.joda.time.MonthDay.minusMonths(MonthDay.java:655)
	at org.joda.time.TestMonthDay_Basics.testMinusMonths_int(TestMonthDay_Basics.java:582)

testMinusDays_int(org.joda.time.TestMonthDay_Basics)  Time elapsed: 0 sec  <<< ERROR!
java.lang.ArithmeticException: Integer.MIN_VALUE cannot be negated
	at org.joda.time.field.FieldUtils.safeNegate(FieldUtils.java:13)
	at org.joda.time.MonthDay.minusDays(MonthDay.java:675)
	at org.joda.time.TestMonthDay_Basics.testMinusDays_int(TestMonthDay_Basics.java:638)

testMinusMonths_int_fromLeap(org.joda.time.TestMonthDay_Basics)  Time elapsed: 0.001 sec  <<< ERROR!
java.lang.ArithmeticException: Integer.MIN_VALUE cannot be negated
	at org.joda.time.field.FieldUtils.safeNegate(FieldUtils.java:13)
	at org.joda.time.MonthDay.minusMonths(MonthDay.java:655)
	at org.joda.time.TestMonthDay_Basics.testMinusMonths_int_fromLeap(TestMonthDay_Basics.java:589)

testMinusMonths_int_negativeFromLeap(org.joda.time.TestMonthDay_Basics)  Time elapsed: 0.001 sec  <<< ERROR!
java.lang.ArithmeticException: Integer.MIN_VALUE cannot be negated
	at org.joda.time.field.FieldUtils.safeNegate(FieldUtils.java:13)
	at org.joda.time.MonthDay.minusMonths(MonthDay.java:655)
	at org.joda.time.TestMonthDay_Basics.testMinusMonths_int_negativeFromLeap(TestMonthDay_Basics.java:596)

testMinusMonths_int_endOfMonthAdjust(org.joda.time.TestMonthDay_Basics)  Time elapsed: 0 sec  <<< ERROR!
java.lang.ArithmeticException: Integer.MIN_VALUE cannot be negated
	at org.joda.time.field.FieldUtils.safeNegate(FieldUtils.java:13)
	at org.joda.time.MonthDay.minusMonths(MonthDay.java:655)
	at org.joda.time.TestMonthDay_Basics.testMinusMonths_int_endOfMonthAdjust(TestMonthDay_Basics.java:603)

testMinusMonths_int_negativeEndOfMonthAdjust(org.joda.time.TestMonthDay_Basics)  Time elapsed: 0.001 sec  <<< ERROR!
java.lang.ArithmeticException: Integer.MIN_VALUE cannot be negated
	at org.joda.time.field.FieldUtils.safeNegate(FieldUtils.java:13)
	at org.joda.time.MonthDay.minusMonths(MonthDay.java:655)
	at org.joda.time.TestMonthDay_Basics.testMinusMonths_int_negativeEndOfMonthAdjust(TestMonthDay_Basics.java:610)

testMinusMonths_int_same(org.joda.time.TestMonthDay_Basics)  Time elapsed: 0.001 sec  <<< ERROR!
java.lang.ArithmeticException: Integer.MIN_VALUE cannot be negated
	at org.joda.time.field.FieldUtils.safeNegate(FieldUtils.java:13)
	at org.joda.time.MonthDay.minusMonths(MonthDay.java:655)
	at org.joda.time.TestMonthDay_Basics.testMinusMonths_int_same(TestMonthDay_Basics.java:617)

testMinusMonths_int_wrap(org.joda.time.TestMonthDay_Basics)  Time elapsed: 0 sec  <<< ERROR!
java.lang.ArithmeticException: Integer.MIN_VALUE cannot be negated
	at org.joda.time.field.FieldUtils.safeNegate(FieldUtils.java:13)
	at org.joda.time.MonthDay.minusMonths(MonthDay.java:655)
	at org.joda.time.TestMonthDay_Basics.testMinusMonths_int_wrap(TestMonthDay_Basics.java:623)

testMinusMonths_int_adjust(org.joda.time.TestMonthDay_Basics)  Time elapsed: 0.001 sec  <<< ERROR!
java.lang.ArithmeticException: Integer.MIN_VALUE cannot be negated
	at org.joda.time.field.FieldUtils.safeNegate(FieldUtils.java:13)
	at org.joda.time.MonthDay.minusMonths(MonthDay.java:655)
	at org.joda.time.TestMonthDay_Basics.testMinusMonths_int_adjust(TestMonthDay_Basics.java:630)

testMinusDays_int_wrapMonth(org.joda.time.TestMonthDay_Basics)  Time elapsed: 0 sec  <<< ERROR!
java.lang.ArithmeticException: Integer.MIN_VALUE cannot be negated
	at org.joda.time.field.FieldUtils.safeNegate(FieldUtils.java:13)
	at org.joda.time.MonthDay.minusDays(MonthDay.java:675)
	at org.joda.time.TestMonthDay_Basics.testMinusDays_int_wrapMonth(TestMonthDay_Basics.java:645)

testMinusDays_int_wrapMonthTwice(org.joda.time.TestMonthDay_Basics)  Time elapsed: 0.001 sec  <<< ERROR!
java.lang.ArithmeticException: Integer.MIN_VALUE cannot be negated
	at org.joda.time.field.FieldUtils.safeNegate(FieldUtils.java:13)
	at org.joda.time.MonthDay.minusDays(MonthDay.java:675)
	at org.joda.time.TestMonthDay_Basics.testMinusDays_int_wrapMonthTwice(TestMonthDay_Basics.java:652)

testMinusDays_int_wrapMonthIntoLastYear(org.joda.time.TestMonthDay_Basics)  Time elapsed: 0 sec  <<< ERROR!
java.lang.ArithmeticException: Integer.MIN_VALUE cannot be negated
	at org.joda.time.field.FieldUtils.safeNegate(FieldUtils.java:13)
	at org.joda.time.MonthDay.minusDays(MonthDay.java:675)
	at org.joda.time.TestMonthDay_Basics.testMinusDays_int_wrapMonthIntoLastYear(TestMonthDay_Basics.java:659)

testMinusDays_int_wrapMonthTwiceIntoLastYear(org.joda.time.TestMonthDay_Basics)  Time elapsed: 0.001 sec  <<< ERROR!
java.lang.ArithmeticException: Integer.MIN_VALUE cannot be negated
	at org.joda.time.field.FieldUtils.safeNegate(FieldUtils.java:13)
	at org.joda.time.MonthDay.minusDays(MonthDay.java:675)
	at org.joda.time.TestMonthDay_Basics.testMinusDays_int_wrapMonthTwiceIntoLastYear(TestMonthDay_Basics.java:666)

testMinusDays_int_toLeap(org.joda.time.TestMonthDay_Basics)  Time elapsed: 0.001 sec  <<< ERROR!
java.lang.ArithmeticException: Integer.MIN_VALUE cannot be negated
	at org.joda.time.field.FieldUtils.safeNegate(FieldUtils.java:13)
	at org.joda.time.MonthDay.minusDays(MonthDay.java:675)
	at org.joda.time.TestMonthDay_Basics.testMinusDays_int_toLeap(TestMonthDay_Basics.java:673)

testMinusDays_int_fromLeap(org.joda.time.TestMonthDay_Basics)  Time elapsed: 0 sec  <<< ERROR!
java.lang.ArithmeticException: Integer.MIN_VALUE cannot be negated
	at org.joda.time.field.FieldUtils.safeNegate(FieldUtils.java:13)
	at org.joda.time.MonthDay.minusDays(MonthDay.java:675)
	at org.joda.time.TestMonthDay_Basics.testMinusDays_int_fromLeap(TestMonthDay_Basics.java:680)

testMinusDays_int_negativeFromLeap(org.joda.time.TestMonthDay_Basics)  Time elapsed: 0.001 sec  <<< ERROR!
java.lang.ArithmeticException: Integer.MIN_VALUE cannot be negated
	at org.joda.time.field.FieldUtils.safeNegate(FieldUtils.java:13)
	at org.joda.time.MonthDay.minusDays(MonthDay.java:675)
	at org.joda.time.TestMonthDay_Basics.testMinusDays_int_negativeFromLeap(TestMonthDay_Basics.java:687)

testMinusDays_same(org.joda.time.TestMonthDay_Basics)  Time elapsed: 0.001 sec  <<< ERROR!
java.lang.ArithmeticException: Integer.MIN_VALUE cannot be negated
	at org.joda.time.field.FieldUtils.safeNegate(FieldUtils.java:13)
	at org.joda.time.MonthDay.minusDays(MonthDay.java:675)
	at org.joda.time.TestMonthDay_Basics.testMinusDays_same(TestMonthDay_Basics.java:694)

testTimeOfDayAdd(org.joda.time.chrono.TestGJChronology)  Time elapsed: 0.001 sec  <<< ERROR!
java.lang.ArithmeticException: Integer.MIN_VALUE cannot be negated
	at org.joda.time.field.FieldUtils.safeNegate(FieldUtils.java:13)
	at org.joda.time.TimeOfDay.minusHours(TimeOfDay.java:732)
	at org.joda.time.chrono.TestGJChronology.testTimeOfDayAdd(TestGJChronology.java:505)

testTimeOfDayAdd(org.joda.time.chrono.TestISOChronology)  Time elapsed: 0.001 sec  <<< ERROR!
java.lang.ArithmeticException: Integer.MIN_VALUE cannot be negated
	at org.joda.time.field.FieldUtils.safeNegate(FieldUtils.java:13)
	at org.joda.time.TimeOfDay.minusHours(TimeOfDay.java:732)
	at org.joda.time.chrono.TestISOChronology.testTimeOfDayAdd(TestISOChronology.java:434)


Results :

Tests in error: 
  org.joda.time.TestDays#testMinus_Days ArithmeticException Integer.MIN_VALUE ca...
  org.joda.time.TestDays#testMinus_int ArithmeticException Integer.MIN_VALUE can...
  org.joda.time.TestDays#testNegated ArithmeticException Integer.MIN_VALUE canno...
  org.joda.time.TestHours#testMinus_Hours ArithmeticException Integer.MIN_VALUE ...
  org.joda.time.TestHours#testMinus_int ArithmeticException Integer.MIN_VALUE ca...
  org.joda.time.TestHours#testNegated ArithmeticException Integer.MIN_VALUE cann...
  org.joda.time.TestMinutes#testMinus_Minutes ArithmeticException Integer.MIN_VA...
  org.joda.time.TestMinutes#testMinus_int ArithmeticException Integer.MIN_VALUE ...
  org.joda.time.TestMinutes#testNegated ArithmeticException Integer.MIN_VALUE ca...
  org.joda.time.TestMonthDay_Basics#testMinusDays_int ArithmeticException Intege...
  org.joda.time.TestMonthDay_Basics#testMinusDays_int_fromLeap ArithmeticException
  org.joda.time.TestMonthDay_Basics#testMinusDays_int_negativeFromLeap ArithmeticException
  org.joda.time.TestMonthDay_Basics#testMinusDays_int_toLeap ArithmeticException
  org.joda.time.TestMonthDay_Basics#testMinusDays_int_wrapMonth ArithmeticException
  org.joda.time.TestMonthDay_Basics#testMinusDays_int_wrapMonthIntoLastYear ArithmeticException
  org.joda.time.TestMonthDay_Basics#testMinusDays_int_wrapMonthTwice ArithmeticException
  org.joda.time.TestMonthDay_Basics#testMinusDays_int_wrapMonthTwiceIntoLastYear ArithmeticException
  org.joda.time.TestMonthDay_Basics#testMinusDays_same ArithmeticException Integ...
  org.joda.time.TestMonthDay_Basics#testMinusMonths_int ArithmeticException Inte...
  org.joda.time.TestMonthDay_Basics#testMinusMonths_int_adjust ArithmeticException
  org.joda.time.TestMonthDay_Basics#testMinusMonths_int_endOfMonthAdjust ArithmeticException
  org.joda.time.TestMonthDay_Basics#testMinusMonths_int_fromLeap ArithmeticException
  org.joda.time.TestMonthDay_Basics#testMinusMonths_int_negativeEndOfMonthAdjust ArithmeticException
  org.joda.time.TestMonthDay_Basics#testMinusMonths_int_negativeFromLeap ArithmeticException
  org.joda.time.TestMonthDay_Basics#testMinusMonths_int_same ArithmeticException
  org.joda.time.TestMonthDay_Basics#testMinusMonths_int_wrap ArithmeticException
  org.joda.time.TestMonths#testMinus_Months ArithmeticException Integer.MIN_VALU...
  org.joda.time.TestMonths#testMinus_int ArithmeticException Integer.MIN_VALUE c...
  org.joda.time.TestMonths#testNegated ArithmeticException Integer.MIN_VALUE can...
  org.joda.time.TestSeconds#testMinus_Seconds ArithmeticException Integer.MIN_VA...
  org.joda.time.TestSeconds#testMinus_int ArithmeticException Integer.MIN_VALUE ...
  org.joda.time.TestSeconds#testNegated ArithmeticException Integer.MIN_VALUE ca...
  org.joda.time.TestTimeOfDay_Basics#testMinusHours_int ArithmeticException Inte...
  org.joda.time.TestTimeOfDay_Basics#testMinusMillis_int ArithmeticException Int...
  org.joda.time.TestTimeOfDay_Basics#testMinusMinutes_int ArithmeticException In...
  org.joda.time.TestTimeOfDay_Basics#testMinusSeconds_int ArithmeticException In...
  org.joda.time.TestWeeks#testMinus_Weeks ArithmeticException Integer.MIN_VALUE ...
  org.joda.time.TestWeeks#testMinus_int ArithmeticException Integer.MIN_VALUE ca...
  org.joda.time.TestWeeks#testNegated ArithmeticException Integer.MIN_VALUE cann...
  org.joda.time.TestYearMonthDay_Basics#testMinusDays_int ArithmeticException In...
  org.joda.time.TestYearMonthDay_Basics#testMinusMonths_int ArithmeticException ...
  org.joda.time.TestYearMonthDay_Basics#testMinusYears_int ArithmeticException I...
  org.joda.time.TestYearMonth_Basics#testMinusMonths_int ArithmeticException Int...
  org.joda.time.TestYearMonth_Basics#testMinusYears_int ArithmeticException Inte...
  org.joda.time.TestYears#testMinus_Years ArithmeticException Integer.MIN_VALUE ...
  org.joda.time.TestYears#testMinus_int ArithmeticException Integer.MIN_VALUE ca...
  org.joda.time.TestYears#testNegated ArithmeticException Integer.MIN_VALUE cann...
  org.joda.time.chrono.TestGJChronology#testTimeOfDayAdd ArithmeticException Int...
  org.joda.time.chrono.TestISOChronology#testTimeOfDayAdd ArithmeticException In...

Tests run: 4157, Failures: 0, Errors: 49, Skipped: 0

[INFO] ------------------------------------------------------------------------
[INFO] BUILD FAILURE
[INFO] ------------------------------------------------------------------------
[INFO] Total time: 15.136s
[INFO] Finished at: Thu Aug 06 04:48:04 BST 2015
[INFO] Final Memory: 8M/213M
[INFO] ------------------------------------------------------------------------
[ERROR] Failed to execute goal org.apache.maven.plugins:maven-surefire-plugin:2.18.1:test (default-test) on project joda-time: There are test failures.
[ERROR] 
[ERROR] Please refer to /home/perham/Study/LittleDarwin/Cases/joda-time-2.8.1/target/surefire-reports for the individual test results.
[ERROR] -> [Help 1]
[ERROR] 
[ERROR] To see the full stack trace of the errors, re-run Maven with the -e switch.
[ERROR] Re-run Maven using the -X switch to enable full debug logging.
[ERROR] 
[ERROR] For more information about the errors and possible solutions, please read the following articles:
[ERROR] [Help 1] http://cwiki.apache.org/confluence/display/MAVEN/MojoFailureException
