[INFO] Scanning for projects...
[INFO]                                                                         
[INFO] ------------------------------------------------------------------------
[INFO] Building Joda-Time 2.8.1
[INFO] ------------------------------------------------------------------------
[INFO] 
[INFO] --- maven-resources-plugin:2.7:resources (default-resources) @ joda-time ---
[INFO] Using 'UTF-8' encoding to copy filtered resources.
[INFO] Copying 2 resources to META-INF
[INFO] Copying 10 resources
[INFO] 
[INFO] --- maven-compiler-plugin:3.3:compile (default-compile) @ joda-time ---
[INFO] Changes detected - recompiling the module!
[INFO] Compiling 166 source files to /home/perham/Study/LittleDarwin/Cases/joda-time-2.8.1/target/classes
[INFO] 
[INFO] --- exec-maven-plugin:1.4.0:java (compile-tzdb) @ joda-time ---
Writing zoneinfo files
[WARNING] 
java.lang.reflect.InvocationTargetException
	at sun.reflect.NativeMethodAccessorImpl.invoke0(Native Method)
	at sun.reflect.NativeMethodAccessorImpl.invoke(NativeMethodAccessorImpl.java:57)
	at sun.reflect.DelegatingMethodAccessorImpl.invoke(DelegatingMethodAccessorImpl.java:43)
	at java.lang.reflect.Method.invoke(Method.java:606)
	at org.codehaus.mojo.exec.ExecJavaMojo$1.run(ExecJavaMojo.java:293)
	at java.lang.Thread.run(Thread.java:745)
Caused by: java.lang.ArithmeticException: The calculation caused an overflow: 1915 + 1
	at org.joda.time.field.FieldUtils.safeAdd(FieldUtils.java:16)
	at org.joda.time.chrono.BasicYearDateTimeField.add(BasicYearDateTimeField.java:63)
	at org.joda.time.tz.DateTimeZoneBuilder$OfYear.next(DateTimeZoneBuilder.java:569)
	at org.joda.time.tz.DateTimeZoneBuilder$Recurrence.next(DateTimeZoneBuilder.java:761)
	at org.joda.time.tz.DateTimeZoneBuilder$Rule.next(DateTimeZoneBuilder.java:865)
	at org.joda.time.tz.DateTimeZoneBuilder$RuleSet.nextTransition(DateTimeZoneBuilder.java:1094)
	at org.joda.time.tz.DateTimeZoneBuilder$RuleSet.firstTransition(DateTimeZoneBuilder.java:1032)
	at org.joda.time.tz.DateTimeZoneBuilder.toDateTimeZone(DateTimeZoneBuilder.java:351)
	at org.joda.time.tz.ZoneInfoCompiler.compile(ZoneInfoCompiler.java:386)
	at org.joda.time.tz.ZoneInfoCompiler.main(ZoneInfoCompiler.java:123)
	... 6 more
[INFO] ------------------------------------------------------------------------
[INFO] BUILD FAILURE
[INFO] ------------------------------------------------------------------------
[INFO] Total time: 7.773s
[INFO] Finished at: Thu Aug 06 04:47:47 BST 2015
[INFO] Final Memory: 8M/151M
[INFO] ------------------------------------------------------------------------
[ERROR] Failed to execute goal org.codehaus.mojo:exec-maven-plugin:1.4.0:java (compile-tzdb) on project joda-time: An exception occured while executing the Java class. null: InvocationTargetException: The calculation caused an overflow: 1915 + 1 -> [Help 1]
[ERROR] 
[ERROR] To see the full stack trace of the errors, re-run Maven with the -e switch.
[ERROR] Re-run Maven using the -X switch to enable full debug logging.
[ERROR] 
[ERROR] For more information about the errors and possible solutions, please read the following articles:
[ERROR] [Help 1] http://cwiki.apache.org/confluence/display/MAVEN/MojoExecutionException
