[INFO] Scanning for projects...
[INFO]                                                                         
[INFO] ------------------------------------------------------------------------
[INFO] Building Joda-Time 2.8.1
[INFO] ------------------------------------------------------------------------
[INFO] 
[INFO] --- maven-resources-plugin:2.7:resources (default-resources) @ joda-time ---
[INFO] Using 'UTF-8' encoding to copy filtered resources.
[INFO] Copying 2 resources to META-INF
[INFO] Copying 10 resources
[INFO] 
[INFO] --- maven-compiler-plugin:3.3:compile (default-compile) @ joda-time ---
[INFO] Changes detected - recompiling the module!
[INFO] Compiling 166 source files to /home/perham/Study/LittleDarwin/Cases/joda-time-2.8.1/target/classes
[INFO] 
[INFO] --- exec-maven-plugin:1.4.0:java (compile-tzdb) @ joda-time ---
[WARNING] 
java.lang.reflect.InvocationTargetException
	at sun.reflect.NativeMethodAccessorImpl.invoke0(Native Method)
	at sun.reflect.NativeMethodAccessorImpl.invoke(NativeMethodAccessorImpl.java:57)
	at sun.reflect.DelegatingMethodAccessorImpl.invoke(DelegatingMethodAccessorImpl.java:43)
	at java.lang.reflect.Method.invoke(Method.java:606)
	at org.codehaus.mojo.exec.ExecJavaMojo$1.run(ExecJavaMojo.java:293)
	at java.lang.Thread.run(Thread.java:745)
Caused by: java.lang.ArithmeticException: The calculation caused an overflow: 0 + 82800000
	at org.joda.time.field.FieldUtils.safeAdd(FieldUtils.java:19)
	at org.joda.time.field.PreciseDurationField.add(PreciseDurationField.java:110)
	at org.joda.time.field.BaseDateTimeField.add(BaseDateTimeField.java:267)
	at org.joda.time.field.LenientDateTimeField.set(LenientDateTimeField.java:74)
	at org.joda.time.format.DateTimeParserBucket$SavedField.set(DateTimeParserBucket.java:568)
	at org.joda.time.format.DateTimeParserBucket.computeMillis(DateTimeParserBucket.java:447)
	at org.joda.time.format.DateTimeParserBucket.computeMillis(DateTimeParserBucket.java:411)
	at org.joda.time.format.DateTimeFormatter.parseInto(DateTimeFormatter.java:749)
	at org.joda.time.tz.ZoneInfoCompiler.parseTime(ZoneInfoCompiler.java:227)
	at org.joda.time.tz.ZoneInfoCompiler$DateTimeOfYear.<init>(ZoneInfoCompiler.java:633)
	at org.joda.time.tz.ZoneInfoCompiler$Rule.<init>(ZoneInfoCompiler.java:704)
	at org.joda.time.tz.ZoneInfoCompiler.parseDataFile(ZoneInfoCompiler.java:522)
	at org.joda.time.tz.ZoneInfoCompiler.compile(ZoneInfoCompiler.java:361)
	at org.joda.time.tz.ZoneInfoCompiler.main(ZoneInfoCompiler.java:123)
	... 6 more
[INFO] ------------------------------------------------------------------------
[INFO] BUILD FAILURE
[INFO] ------------------------------------------------------------------------
[INFO] Total time: 8.251s
[INFO] Finished at: Thu Aug 06 04:47:33 BST 2015
[INFO] Final Memory: 8M/151M
[INFO] ------------------------------------------------------------------------
[ERROR] Failed to execute goal org.codehaus.mojo:exec-maven-plugin:1.4.0:java (compile-tzdb) on project joda-time: An exception occured while executing the Java class. null: InvocationTargetException: The calculation caused an overflow: 0 + 82800000 -> [Help 1]
[ERROR] 
[ERROR] To see the full stack trace of the errors, re-run Maven with the -e switch.
[ERROR] Re-run Maven using the -X switch to enable full debug logging.
[ERROR] 
[ERROR] For more information about the errors and possible solutions, please read the following articles:
[ERROR] [Help 1] http://cwiki.apache.org/confluence/display/MAVEN/MojoExecutionException
