[INFO] Scanning for projects...
[INFO]                                                                         
[INFO] ------------------------------------------------------------------------
[INFO] Building Joda-Time 2.8.1
[INFO] ------------------------------------------------------------------------
[INFO] 
[INFO] --- maven-resources-plugin:2.7:resources (default-resources) @ joda-time ---
[INFO] Using 'UTF-8' encoding to copy filtered resources.
[INFO] Copying 2 resources to META-INF
[INFO] Copying 10 resources
[INFO] 
[INFO] --- maven-compiler-plugin:3.3:compile (default-compile) @ joda-time ---
[INFO] Changes detected - recompiling the module!
[INFO] Compiling 166 source files to /home/perham/Study/LittleDarwin/Cases/joda-time-2.8.1/target/classes
[INFO] 
[INFO] --- exec-maven-plugin:1.4.0:java (compile-tzdb) @ joda-time ---
Writing zoneinfo files
Writing ZoneInfoMap
[INFO] 
[INFO] --- maven-resources-plugin:2.7:testResources (default-testResources) @ joda-time ---
[INFO] Using 'UTF-8' encoding to copy filtered resources.
[INFO] Copying 34 resources
[INFO] 
[INFO] --- maven-compiler-plugin:3.3:testCompile (default-testCompile) @ joda-time ---
[INFO] Nothing to compile - all classes are up to date
[INFO] 
[INFO] --- maven-surefire-plugin:2.18.1:test (default-test) @ joda-time ---
[INFO] Surefire report directory: /home/perham/Study/LittleDarwin/Cases/joda-time-2.8.1/target/surefire-reports

-------------------------------------------------------
 T E S T S
-------------------------------------------------------
Running org.joda.time.TestAllPackages

TestBuddhistChronology.testCalendar

TestCopticChronology.testCalendar

TestEthiopicChronology.testCalendar

TestIslamicChronology.testCalendar

Testing Gregorian chronology over 1000 iterations
100% complete (i=1000)

Testing Julian chronology over 1000 iterations
100% complete (i=1000)
Writing zoneinfo files
Writing ZoneInfoMap
Tests run: 4157, Failures: 0, Errors: 13, Skipped: 0, Time elapsed: 5.272 sec <<< FAILURE! - in org.joda.time.TestAllPackages
testMinus_long(org.joda.time.TestInstant_Basics)  Time elapsed: 0.004 sec  <<< ERROR!
java.lang.ArithmeticException: Multiplication overflows a long: 123456789 * -1
	at org.joda.time.field.FieldUtils.safeMultiply(FieldUtils.java:27)
	at org.joda.time.chrono.BaseChronology.add(BaseChronology.java:327)
	at org.joda.time.Instant.withDurationAdded(Instant.java:174)
	at org.joda.time.Instant.minus(Instant.java:233)
	at org.joda.time.TestInstant_Basics.testMinus_long(TestInstant_Basics.java:573)

testMinus_RD(org.joda.time.TestInstant_Basics)  Time elapsed: 0 sec  <<< ERROR!
java.lang.ArithmeticException: Multiplication overflows a long: 123456789 * -1
	at org.joda.time.field.FieldUtils.safeMultiply(FieldUtils.java:27)
	at org.joda.time.chrono.BaseChronology.add(BaseChronology.java:327)
	at org.joda.time.Instant.withDurationAdded(Instant.java:174)
	at org.joda.time.Instant.withDurationAdded(Instant.java:192)
	at org.joda.time.Instant.minus(Instant.java:246)
	at org.joda.time.TestInstant_Basics.testMinus_RD(TestInstant_Basics.java:580)

testMinus_long(org.joda.time.TestDateTime_Basics)  Time elapsed: 0.001 sec  <<< ERROR!
java.lang.ArithmeticException: Multiplication overflows a long: 123456789 * -1
	at org.joda.time.field.FieldUtils.safeMultiply(FieldUtils.java:27)
	at org.joda.time.chrono.BaseChronology.add(BaseChronology.java:327)
	at org.joda.time.DateTime.withDurationAdded(DateTime.java:901)
	at org.joda.time.DateTime.minus(DateTime.java:1245)
	at org.joda.time.TestDateTime_Basics.testMinus_long(TestDateTime_Basics.java:1148)

testMinus_RD(org.joda.time.TestDateTime_Basics)  Time elapsed: 0.001 sec  <<< ERROR!
java.lang.ArithmeticException: Multiplication overflows a long: 123456789 * -1
	at org.joda.time.field.FieldUtils.safeMultiply(FieldUtils.java:27)
	at org.joda.time.chrono.BaseChronology.add(BaseChronology.java:327)
	at org.joda.time.DateTime.withDurationAdded(DateTime.java:901)
	at org.joda.time.DateTime.withDurationAdded(DateTime.java:919)
	at org.joda.time.DateTime.minus(DateTime.java:1259)
	at org.joda.time.TestDateTime_Basics.testMinus_RD(TestDateTime_Basics.java:1155)

testMinus_long(org.joda.time.TestDateMidnight_Basics)  Time elapsed: 0 sec  <<< ERROR!
java.lang.ArithmeticException: Multiplication overflows a long: 123456789 * -1
	at org.joda.time.field.FieldUtils.safeMultiply(FieldUtils.java:27)
	at org.joda.time.chrono.BaseChronology.add(BaseChronology.java:327)
	at org.joda.time.DateMidnight.withDurationAdded(DateMidnight.java:516)
	at org.joda.time.DateMidnight.minus(DateMidnight.java:712)
	at org.joda.time.TestDateMidnight_Basics.testMinus_long(TestDateMidnight_Basics.java:921)

testMinus_RD(org.joda.time.TestDateMidnight_Basics)  Time elapsed: 0 sec  <<< ERROR!
java.lang.ArithmeticException: Multiplication overflows a long: 123456789 * -1
	at org.joda.time.field.FieldUtils.safeMultiply(FieldUtils.java:27)
	at org.joda.time.chrono.BaseChronology.add(BaseChronology.java:327)
	at org.joda.time.DateMidnight.withDurationAdded(DateMidnight.java:516)
	at org.joda.time.DateMidnight.withDurationAdded(DateMidnight.java:534)
	at org.joda.time.DateMidnight.minus(DateMidnight.java:725)
	at org.joda.time.TestDateMidnight_Basics.testMinus_RD(TestDateMidnight_Basics.java:928)

testWithDurationAdded_RD_int3(org.joda.time.TestDuration_Basics)  Time elapsed: 0 sec  <<< ERROR!
java.lang.ArithmeticException: Multiplication overflows a long: 8000 * -1
	at org.joda.time.field.FieldUtils.safeMultiply(FieldUtils.java:27)
	at org.joda.time.Duration.withDurationAdded(Duration.java:393)
	at org.joda.time.Duration.withDurationAdded(Duration.java:412)
	at org.joda.time.TestDuration_Basics.testWithDurationAdded_RD_int3(TestDuration_Basics.java:745)

testMinus_RD1(org.joda.time.TestDuration_Basics)  Time elapsed: 0 sec  <<< ERROR!
java.lang.ArithmeticException: Multiplication overflows a long: 8000 * -1
	at org.joda.time.field.FieldUtils.safeMultiply(FieldUtils.java:27)
	at org.joda.time.Duration.withDurationAdded(Duration.java:393)
	at org.joda.time.Duration.minus(Duration.java:471)
	at org.joda.time.TestDuration_Basics.testMinus_RD1(TestDuration_Basics.java:789)

testWithDurationAdded_long_int3(org.joda.time.TestDuration_Basics)  Time elapsed: 0.001 sec  <<< ERROR!
java.lang.ArithmeticException: Multiplication overflows a long: 8000 * -1
	at org.joda.time.field.FieldUtils.safeMultiply(FieldUtils.java:27)
	at org.joda.time.Duration.withDurationAdded(Duration.java:393)
	at org.joda.time.TestDuration_Basics.testWithDurationAdded_long_int3(TestDuration_Basics.java:639)

testMinus_long1(org.joda.time.TestDuration_Basics)  Time elapsed: 0 sec  <<< ERROR!
java.lang.ArithmeticException: Multiplication overflows a long: 8000 * -1
	at org.joda.time.field.FieldUtils.safeMultiply(FieldUtils.java:27)
	at org.joda.time.Duration.withDurationAdded(Duration.java:393)
	at org.joda.time.Duration.minus(Duration.java:455)
	at org.joda.time.TestDuration_Basics.testMinus_long1(TestDuration_Basics.java:671)

testWithDurationBeforeEnd1(org.joda.time.TestInterval_Basics)  Time elapsed: 0 sec  <<< ERROR!
java.lang.ArithmeticException: Multiplication overflows a long: 5571360000 * -1
	at org.joda.time.field.FieldUtils.safeMultiply(FieldUtils.java:27)
	at org.joda.time.chrono.BaseChronology.add(BaseChronology.java:327)
	at org.joda.time.Interval.withDurationBeforeEnd(Interval.java:446)
	at org.joda.time.TestInterval_Basics.testWithDurationBeforeEnd1(TestInterval_Basics.java:1195)

testWithDurationBeforeEnd3(org.joda.time.TestInterval_Basics)  Time elapsed: 0.001 sec  <<< ERROR!
java.lang.ArithmeticException: Multiplication overflows a long: -1 * -1
	at org.joda.time.field.FieldUtils.safeMultiply(FieldUtils.java:27)
	at org.joda.time.chrono.BaseChronology.add(BaseChronology.java:327)
	at org.joda.time.Interval.withDurationBeforeEnd(Interval.java:446)
	at org.joda.time.TestInterval_Basics.testWithDurationBeforeEnd3(TestInterval_Basics.java:1211)

testSafeMultiplyLongInt(org.joda.time.field.TestFieldUtils)  Time elapsed: 0 sec  <<< ERROR!
java.lang.ArithmeticException: Multiplication overflows a long: 9223372036854775807 * -1
	at org.joda.time.field.FieldUtils.safeMultiply(FieldUtils.java:27)
	at org.joda.time.field.TestFieldUtils.testSafeMultiplyLongInt(TestFieldUtils.java:257)


Results :

Tests in error: 
  org.joda.time.TestDateMidnight_Basics#testMinus_RD ArithmeticException Multipl...
  org.joda.time.TestDateMidnight_Basics#testMinus_long ArithmeticException Multi...
  org.joda.time.TestDateTime_Basics#testMinus_RD ArithmeticException Multiplicat...
  org.joda.time.TestDateTime_Basics#testMinus_long ArithmeticException Multiplic...
  org.joda.time.TestDuration_Basics#testMinus_RD1 ArithmeticException Multiplica...
  org.joda.time.TestDuration_Basics#testMinus_long1 ArithmeticException Multipli...
  org.joda.time.TestDuration_Basics#testWithDurationAdded_RD_int3 ArithmeticException
  org.joda.time.TestDuration_Basics#testWithDurationAdded_long_int3 ArithmeticException
  org.joda.time.TestInstant_Basics#testMinus_RD ArithmeticException Multiplicati...
  org.joda.time.TestInstant_Basics#testMinus_long ArithmeticException Multiplica...
  org.joda.time.TestInterval_Basics#testWithDurationBeforeEnd1 ArithmeticException
  org.joda.time.TestInterval_Basics#testWithDurationBeforeEnd3 ArithmeticException
  org.joda.time.field.TestFieldUtils#testSafeMultiplyLongInt ArithmeticException

Tests run: 4157, Failures: 0, Errors: 13, Skipped: 0

[INFO] ------------------------------------------------------------------------
[INFO] BUILD FAILURE
[INFO] ------------------------------------------------------------------------
[INFO] Total time: 15.340s
[INFO] Finished at: Thu Aug 06 04:46:27 BST 2015
[INFO] Final Memory: 8M/213M
[INFO] ------------------------------------------------------------------------
[ERROR] Failed to execute goal org.apache.maven.plugins:maven-surefire-plugin:2.18.1:test (default-test) on project joda-time: There are test failures.
[ERROR] 
[ERROR] Please refer to /home/perham/Study/LittleDarwin/Cases/joda-time-2.8.1/target/surefire-reports for the individual test results.
[ERROR] -> [Help 1]
[ERROR] 
[ERROR] To see the full stack trace of the errors, re-run Maven with the -e switch.
[ERROR] Re-run Maven using the -X switch to enable full debug logging.
[ERROR] 
[ERROR] For more information about the errors and possible solutions, please read the following articles:
[ERROR] [Help 1] http://cwiki.apache.org/confluence/display/MAVEN/MojoFailureException
