[INFO] Scanning for projects...
[INFO]                                                                         
[INFO] ------------------------------------------------------------------------
[INFO] Building Joda-Time 2.8.1
[INFO] ------------------------------------------------------------------------
[INFO] 
[INFO] --- maven-resources-plugin:2.7:resources (default-resources) @ joda-time ---
[INFO] Using 'UTF-8' encoding to copy filtered resources.
[INFO] Copying 2 resources to META-INF
[INFO] Copying 10 resources
[INFO] 
[INFO] --- maven-compiler-plugin:3.3:compile (default-compile) @ joda-time ---
[INFO] Changes detected - recompiling the module!
[INFO] Compiling 166 source files to /home/perham/Study/LittleDarwin/Cases/joda-time-2.8.1/target/classes
[INFO] 
[INFO] --- exec-maven-plugin:1.4.0:java (compile-tzdb) @ joda-time ---
Writing zoneinfo files
Writing ZoneInfoMap
[INFO] 
[INFO] --- maven-resources-plugin:2.7:testResources (default-testResources) @ joda-time ---
[INFO] Using 'UTF-8' encoding to copy filtered resources.
[INFO] Copying 34 resources
[INFO] 
[INFO] --- maven-compiler-plugin:3.3:testCompile (default-testCompile) @ joda-time ---
[INFO] Nothing to compile - all classes are up to date
[INFO] 
[INFO] --- maven-surefire-plugin:2.18.1:test (default-test) @ joda-time ---
[INFO] Surefire report directory: /home/perham/Study/LittleDarwin/Cases/joda-time-2.8.1/target/surefire-reports

-------------------------------------------------------
 T E S T S
-------------------------------------------------------
Running org.joda.time.TestAllPackages

TestBuddhistChronology.testCalendar

TestCopticChronology.testCalendar

TestEthiopicChronology.testCalendar

TestIslamicChronology.testCalendar

Testing Gregorian chronology over 1000 iterations
Failure index: 0
Test millis: -308262625532
Test value: -49
Test millis2: -46922557997542

Testing Julian chronology over 1000 iterations
Failure index: 0
Test millis: -308262625532
Test value: -49
Test millis2: -46922557997542
Writing zoneinfo files
Writing ZoneInfoMap
Tests run: 4157, Failures: 2, Errors: 53, Skipped: 0, Time elapsed: 4.832 sec <<< FAILURE! - in org.joda.time.TestAllPackages
testPropertyAddWrapFieldYear(org.joda.time.TestDateTime_Properties)  Time elapsed: 0.004 sec  <<< ERROR!
java.lang.IllegalArgumentException: MIN > MAX
	at org.joda.time.field.FieldUtils.getWrappedValue(FieldUtils.java:50)
	at org.joda.time.field.FieldUtils.getWrappedValue(FieldUtils.java:49)
	at org.joda.time.chrono.BasicYearDateTimeField.addWrapField(BasicYearDateTimeField.java:77)
	at org.joda.time.chrono.ZonedChronology$ZonedDateTimeField.addWrapField(ZonedChronology.java:475)
	at org.joda.time.DateTime$Property.addWrapFieldToCopy(DateTime.java:2203)
	at org.joda.time.TestDateTime_Properties.testPropertyAddWrapFieldYear(TestDateTime_Properties.java:271)

testPropertyAddWrapFieldDayOfYear(org.joda.time.TestDateTime_Properties)  Time elapsed: 0 sec  <<< ERROR!
java.lang.IllegalArgumentException: MIN > MAX
	at org.joda.time.field.FieldUtils.getWrappedValue(FieldUtils.java:50)
	at org.joda.time.field.FieldUtils.getWrappedValue(FieldUtils.java:49)
	at org.joda.time.field.BaseDateTimeField.addWrapField(BaseDateTimeField.java:462)
	at org.joda.time.chrono.ZonedChronology$ZonedDateTimeField.addWrapField(ZonedChronology.java:475)
	at org.joda.time.DateTime$Property.addWrapFieldToCopy(DateTime.java:2203)
	at org.joda.time.TestDateTime_Properties.testPropertyAddWrapFieldDayOfYear(TestDateTime_Properties.java:757)

testPropertyAddWrapFieldWeekOfWeekyear(org.joda.time.TestDateTime_Properties)  Time elapsed: 0.001 sec  <<< ERROR!
java.lang.IllegalArgumentException: MIN > MAX
	at org.joda.time.field.FieldUtils.getWrappedValue(FieldUtils.java:50)
	at org.joda.time.field.FieldUtils.getWrappedValue(FieldUtils.java:49)
	at org.joda.time.field.BaseDateTimeField.addWrapField(BaseDateTimeField.java:462)
	at org.joda.time.chrono.ZonedChronology$ZonedDateTimeField.addWrapField(ZonedChronology.java:475)
	at org.joda.time.DateTime$Property.addWrapFieldToCopy(DateTime.java:2203)
	at org.joda.time.TestDateTime_Properties.testPropertyAddWrapFieldWeekOfWeekyear(TestDateTime_Properties.java:892)

testPropertyAddWrapFieldDayOfWeek(org.joda.time.TestDateTime_Properties)  Time elapsed: 0.001 sec  <<< ERROR!
java.lang.IllegalArgumentException: MIN > MAX
	at org.joda.time.field.FieldUtils.getWrappedValue(FieldUtils.java:50)
	at org.joda.time.field.FieldUtils.getWrappedValue(FieldUtils.java:49)
	at org.joda.time.field.BaseDateTimeField.addWrapField(BaseDateTimeField.java:462)
	at org.joda.time.chrono.ZonedChronology$ZonedDateTimeField.addWrapField(ZonedChronology.java:475)
	at org.joda.time.DateTime$Property.addWrapFieldToCopy(DateTime.java:2203)
	at org.joda.time.TestDateTime_Properties.testPropertyAddWrapFieldDayOfWeek(TestDateTime_Properties.java:1023)

testPropertyAddWrapFieldMonthOfYear(org.joda.time.TestDateTime_Properties)  Time elapsed: 0 sec  <<< ERROR!
java.lang.IllegalArgumentException: MIN > MAX
	at org.joda.time.field.FieldUtils.getWrappedValue(FieldUtils.java:50)
	at org.joda.time.field.FieldUtils.getWrappedValue(FieldUtils.java:49)
	at org.joda.time.chrono.BasicMonthOfYearDateTimeField.addWrapField(BasicMonthOfYearDateTimeField.java:239)
	at org.joda.time.chrono.ZonedChronology$ZonedDateTimeField.addWrapField(ZonedChronology.java:475)
	at org.joda.time.DateTime$Property.addWrapFieldToCopy(DateTime.java:2203)
	at org.joda.time.TestDateTime_Properties.testPropertyAddWrapFieldMonthOfYear(TestDateTime_Properties.java:430)

testPropertyAddWrapFieldDayOfMonth(org.joda.time.TestDateTime_Properties)  Time elapsed: 0.001 sec  <<< ERROR!
java.lang.IllegalArgumentException: MIN > MAX
	at org.joda.time.field.FieldUtils.getWrappedValue(FieldUtils.java:50)
	at org.joda.time.field.FieldUtils.getWrappedValue(FieldUtils.java:49)
	at org.joda.time.field.BaseDateTimeField.addWrapField(BaseDateTimeField.java:462)
	at org.joda.time.chrono.ZonedChronology$ZonedDateTimeField.addWrapField(ZonedChronology.java:475)
	at org.joda.time.DateTime$Property.addWrapFieldToCopy(DateTime.java:2203)
	at org.joda.time.TestDateTime_Properties.testPropertyAddWrapFieldDayOfMonth(TestDateTime_Properties.java:593)

testPropertyAddWrapFieldYear(org.joda.time.TestMutableDateTime_Properties)  Time elapsed: 0 sec  <<< ERROR!
java.lang.IllegalArgumentException: MIN > MAX
	at org.joda.time.field.FieldUtils.getWrappedValue(FieldUtils.java:50)
	at org.joda.time.field.FieldUtils.getWrappedValue(FieldUtils.java:49)
	at org.joda.time.chrono.BasicYearDateTimeField.addWrapField(BasicYearDateTimeField.java:77)
	at org.joda.time.chrono.ZonedChronology$ZonedDateTimeField.addWrapField(ZonedChronology.java:475)
	at org.joda.time.MutableDateTime$Property.addWrapField(MutableDateTime.java:1371)
	at org.joda.time.TestMutableDateTime_Properties.testPropertyAddWrapFieldYear(TestMutableDateTime_Properties.java:215)

testPropertyAddWrapFieldDayOfYear(org.joda.time.TestMutableDateTime_Properties)  Time elapsed: 0 sec  <<< ERROR!
java.lang.IllegalArgumentException: MIN > MAX
	at org.joda.time.field.FieldUtils.getWrappedValue(FieldUtils.java:50)
	at org.joda.time.field.FieldUtils.getWrappedValue(FieldUtils.java:49)
	at org.joda.time.field.BaseDateTimeField.addWrapField(BaseDateTimeField.java:462)
	at org.joda.time.chrono.ZonedChronology$ZonedDateTimeField.addWrapField(ZonedChronology.java:475)
	at org.joda.time.MutableDateTime$Property.addWrapField(MutableDateTime.java:1371)
	at org.joda.time.TestMutableDateTime_Properties.testPropertyAddWrapFieldDayOfYear(TestMutableDateTime_Properties.java:368)

testPropertyAddWrapFieldWeekOfWeekyear(org.joda.time.TestMutableDateTime_Properties)  Time elapsed: 0.001 sec  <<< ERROR!
java.lang.IllegalArgumentException: MIN > MAX
	at org.joda.time.field.FieldUtils.getWrappedValue(FieldUtils.java:50)
	at org.joda.time.field.FieldUtils.getWrappedValue(FieldUtils.java:49)
	at org.joda.time.field.BaseDateTimeField.addWrapField(BaseDateTimeField.java:462)
	at org.joda.time.chrono.ZonedChronology$ZonedDateTimeField.addWrapField(ZonedChronology.java:475)
	at org.joda.time.MutableDateTime$Property.addWrapField(MutableDateTime.java:1371)
	at org.joda.time.TestMutableDateTime_Properties.testPropertyAddWrapFieldWeekOfWeekyear(TestMutableDateTime_Properties.java:425)

testPropertyAddWrapFieldDayOfWeek(org.joda.time.TestMutableDateTime_Properties)  Time elapsed: 0 sec  <<< ERROR!
java.lang.IllegalArgumentException: MIN > MAX
	at org.joda.time.field.FieldUtils.getWrappedValue(FieldUtils.java:50)
	at org.joda.time.field.FieldUtils.getWrappedValue(FieldUtils.java:49)
	at org.joda.time.field.BaseDateTimeField.addWrapField(BaseDateTimeField.java:462)
	at org.joda.time.chrono.ZonedChronology$ZonedDateTimeField.addWrapField(ZonedChronology.java:475)
	at org.joda.time.MutableDateTime$Property.addWrapField(MutableDateTime.java:1371)
	at org.joda.time.TestMutableDateTime_Properties.testPropertyAddWrapFieldDayOfWeek(TestMutableDateTime_Properties.java:481)

testPropertyAddWrapFieldMonthOfYear(org.joda.time.TestMutableDateTime_Properties)  Time elapsed: 0.001 sec  <<< ERROR!
java.lang.IllegalArgumentException: MIN > MAX
	at org.joda.time.field.FieldUtils.getWrappedValue(FieldUtils.java:50)
	at org.joda.time.field.FieldUtils.getWrappedValue(FieldUtils.java:49)
	at org.joda.time.chrono.BasicMonthOfYearDateTimeField.addWrapField(BasicMonthOfYearDateTimeField.java:239)
	at org.joda.time.chrono.ZonedChronology$ZonedDateTimeField.addWrapField(ZonedChronology.java:475)
	at org.joda.time.MutableDateTime$Property.addWrapField(MutableDateTime.java:1371)
	at org.joda.time.TestMutableDateTime_Properties.testPropertyAddWrapFieldMonthOfYear(TestMutableDateTime_Properties.java:267)

testPropertyAddWrapFieldDayOfMonth(org.joda.time.TestMutableDateTime_Properties)  Time elapsed: 0 sec  <<< ERROR!
java.lang.IllegalArgumentException: MIN > MAX
	at org.joda.time.field.FieldUtils.getWrappedValue(FieldUtils.java:50)
	at org.joda.time.field.FieldUtils.getWrappedValue(FieldUtils.java:49)
	at org.joda.time.field.BaseDateTimeField.addWrapField(BaseDateTimeField.java:462)
	at org.joda.time.chrono.ZonedChronology$ZonedDateTimeField.addWrapField(ZonedChronology.java:475)
	at org.joda.time.MutableDateTime$Property.addWrapField(MutableDateTime.java:1371)
	at org.joda.time.TestMutableDateTime_Properties.testPropertyAddWrapFieldDayOfMonth(TestMutableDateTime_Properties.java:323)

testPropertyAddWrapFieldMonthOfYear(org.joda.time.TestDateMidnight_Properties)  Time elapsed: 0 sec  <<< ERROR!
java.lang.IllegalArgumentException: MIN > MAX
	at org.joda.time.field.FieldUtils.getWrappedValue(FieldUtils.java:50)
	at org.joda.time.field.FieldUtils.getWrappedValue(FieldUtils.java:49)
	at org.joda.time.chrono.BasicMonthOfYearDateTimeField.addWrapField(BasicMonthOfYearDateTimeField.java:239)
	at org.joda.time.chrono.ZonedChronology$ZonedDateTimeField.addWrapField(ZonedChronology.java:475)
	at org.joda.time.DateMidnight$Property.addWrapFieldToCopy(DateMidnight.java:1344)
	at org.joda.time.TestDateMidnight_Properties.testPropertyAddWrapFieldMonthOfYear(TestDateMidnight_Properties.java:292)

testPropertyAddWrapFieldToCopyMinute(org.joda.time.TestLocalDateTime_Properties)  Time elapsed: 0.001 sec  <<< ERROR!
java.lang.IllegalArgumentException: MIN > MAX
	at org.joda.time.field.FieldUtils.getWrappedValue(FieldUtils.java:50)
	at org.joda.time.field.FieldUtils.getWrappedValue(FieldUtils.java:49)
	at org.joda.time.field.PreciseDateTimeField.addWrapField(PreciseDateTimeField.java:97)
	at org.joda.time.LocalDateTime$Property.addWrapFieldToCopy(LocalDateTime.java:2262)
	at org.joda.time.TestLocalDateTime_Properties.testPropertyAddWrapFieldToCopyMinute(TestLocalDateTime_Properties.java:765)

testPropertyAddWrapFieldToCopySecond(org.joda.time.TestLocalDateTime_Properties)  Time elapsed: 0.001 sec  <<< ERROR!
java.lang.IllegalArgumentException: MIN > MAX
	at org.joda.time.field.FieldUtils.getWrappedValue(FieldUtils.java:50)
	at org.joda.time.field.FieldUtils.getWrappedValue(FieldUtils.java:49)
	at org.joda.time.field.PreciseDateTimeField.addWrapField(PreciseDateTimeField.java:97)
	at org.joda.time.LocalDateTime$Property.addWrapFieldToCopy(LocalDateTime.java:2262)
	at org.joda.time.TestLocalDateTime_Properties.testPropertyAddWrapFieldToCopySecond(TestLocalDateTime_Properties.java:893)

testPropertyAddWrapFieldToCopyMilli(org.joda.time.TestLocalDateTime_Properties)  Time elapsed: 0.001 sec  <<< ERROR!
java.lang.IllegalArgumentException: MIN > MAX
	at org.joda.time.field.FieldUtils.getWrappedValue(FieldUtils.java:50)
	at org.joda.time.field.FieldUtils.getWrappedValue(FieldUtils.java:49)
	at org.joda.time.field.PreciseDateTimeField.addWrapField(PreciseDateTimeField.java:97)
	at org.joda.time.LocalDateTime$Property.addWrapFieldToCopy(LocalDateTime.java:2262)
	at org.joda.time.TestLocalDateTime_Properties.testPropertyAddWrapFieldToCopyMilli(TestLocalDateTime_Properties.java:1018)

testPropertyAddWrapFieldToCopyYear(org.joda.time.TestLocalDateTime_Properties)  Time elapsed: 0 sec  <<< ERROR!
java.lang.IllegalArgumentException: MIN > MAX
	at org.joda.time.field.FieldUtils.getWrappedValue(FieldUtils.java:50)
	at org.joda.time.field.FieldUtils.getWrappedValue(FieldUtils.java:49)
	at org.joda.time.chrono.BasicYearDateTimeField.addWrapField(BasicYearDateTimeField.java:77)
	at org.joda.time.LocalDateTime$Property.addWrapFieldToCopy(LocalDateTime.java:2262)
	at org.joda.time.TestLocalDateTime_Properties.testPropertyAddWrapFieldToCopyYear(TestLocalDateTime_Properties.java:147)

testPropertyAddWrapFieldToCopyMonth(org.joda.time.TestLocalDateTime_Properties)  Time elapsed: 0.001 sec  <<< ERROR!
java.lang.IllegalArgumentException: MIN > MAX
	at org.joda.time.field.FieldUtils.getWrappedValue(FieldUtils.java:50)
	at org.joda.time.field.FieldUtils.getWrappedValue(FieldUtils.java:49)
	at org.joda.time.chrono.BasicMonthOfYearDateTimeField.addWrapField(BasicMonthOfYearDateTimeField.java:239)
	at org.joda.time.LocalDateTime$Property.addWrapFieldToCopy(LocalDateTime.java:2262)
	at org.joda.time.TestLocalDateTime_Properties.testPropertyAddWrapFieldToCopyMonth(TestLocalDateTime_Properties.java:259)

testPropertyAddWrapFieldToCopyDay(org.joda.time.TestLocalDateTime_Properties)  Time elapsed: 0.001 sec  <<< ERROR!
java.lang.IllegalArgumentException: MIN > MAX
	at org.joda.time.field.FieldUtils.getWrappedValue(FieldUtils.java:50)
	at org.joda.time.field.FieldUtils.getWrappedValue(FieldUtils.java:49)
	at org.joda.time.field.BaseDateTimeField.addWrapField(BaseDateTimeField.java:462)
	at org.joda.time.LocalDateTime$Property.addWrapFieldToCopy(LocalDateTime.java:2262)
	at org.joda.time.TestLocalDateTime_Properties.testPropertyAddWrapFieldToCopyDay(TestLocalDateTime_Properties.java:413)

testPropertyAddWrapFieldToCopyHour(org.joda.time.TestLocalDateTime_Properties)  Time elapsed: 0.001 sec  <<< ERROR!
java.lang.IllegalArgumentException: MIN > MAX
	at org.joda.time.field.FieldUtils.getWrappedValue(FieldUtils.java:50)
	at org.joda.time.field.FieldUtils.getWrappedValue(FieldUtils.java:49)
	at org.joda.time.field.PreciseDateTimeField.addWrapField(PreciseDateTimeField.java:97)
	at org.joda.time.LocalDateTime$Property.addWrapFieldToCopy(LocalDateTime.java:2262)
	at org.joda.time.TestLocalDateTime_Properties.testPropertyAddWrapFieldToCopyHour(TestLocalDateTime_Properties.java:617)

testPropertyAddWrapFieldToCopyYear(org.joda.time.TestLocalDate_Properties)  Time elapsed: 0 sec  <<< ERROR!
java.lang.IllegalArgumentException: MIN > MAX
	at org.joda.time.field.FieldUtils.getWrappedValue(FieldUtils.java:50)
	at org.joda.time.field.FieldUtils.getWrappedValue(FieldUtils.java:49)
	at org.joda.time.chrono.BasicYearDateTimeField.addWrapField(BasicYearDateTimeField.java:77)
	at org.joda.time.LocalDate$Property.addWrapFieldToCopy(LocalDate.java:1993)
	at org.joda.time.TestLocalDate_Properties.testPropertyAddWrapFieldToCopyYear(TestLocalDate_Properties.java:142)

testPropertyAddWrapFieldToCopyMonth(org.joda.time.TestLocalDate_Properties)  Time elapsed: 0 sec  <<< ERROR!
java.lang.IllegalArgumentException: MIN > MAX
	at org.joda.time.field.FieldUtils.getWrappedValue(FieldUtils.java:50)
	at org.joda.time.field.FieldUtils.getWrappedValue(FieldUtils.java:49)
	at org.joda.time.chrono.BasicMonthOfYearDateTimeField.addWrapField(BasicMonthOfYearDateTimeField.java:239)
	at org.joda.time.LocalDate$Property.addWrapFieldToCopy(LocalDate.java:1993)
	at org.joda.time.TestLocalDate_Properties.testPropertyAddWrapFieldToCopyMonth(TestLocalDate_Properties.java:254)

testPropertyAddWrapFieldToCopyDay(org.joda.time.TestLocalDate_Properties)  Time elapsed: 0.001 sec  <<< ERROR!
java.lang.IllegalArgumentException: MIN > MAX
	at org.joda.time.field.FieldUtils.getWrappedValue(FieldUtils.java:50)
	at org.joda.time.field.FieldUtils.getWrappedValue(FieldUtils.java:49)
	at org.joda.time.field.BaseDateTimeField.addWrapField(BaseDateTimeField.java:462)
	at org.joda.time.LocalDate$Property.addWrapFieldToCopy(LocalDate.java:1993)
	at org.joda.time.TestLocalDate_Properties.testPropertyAddWrapFieldToCopyDay(TestLocalDate_Properties.java:408)

testPropertyPlusWrapFieldHour(org.joda.time.TestLocalTime_Properties)  Time elapsed: 0 sec  <<< ERROR!
java.lang.IllegalArgumentException: MIN > MAX
	at org.joda.time.field.FieldUtils.getWrappedValue(FieldUtils.java:50)
	at org.joda.time.field.FieldUtils.getWrappedValue(FieldUtils.java:49)
	at org.joda.time.field.PreciseDateTimeField.addWrapField(PreciseDateTimeField.java:97)
	at org.joda.time.LocalTime$Property.addWrapFieldToCopy(LocalTime.java:1493)
	at org.joda.time.TestLocalTime_Properties.testPropertyPlusWrapFieldHour(TestLocalTime_Properties.java:192)

testPropertyPlusWrapFieldSecond(org.joda.time.TestLocalTime_Properties)  Time elapsed: 0 sec  <<< ERROR!
java.lang.IllegalArgumentException: MIN > MAX
	at org.joda.time.field.FieldUtils.getWrappedValue(FieldUtils.java:50)
	at org.joda.time.field.FieldUtils.getWrappedValue(FieldUtils.java:49)
	at org.joda.time.field.PreciseDateTimeField.addWrapField(PreciseDateTimeField.java:97)
	at org.joda.time.LocalTime$Property.addWrapFieldToCopy(LocalTime.java:1493)
	at org.joda.time.TestLocalTime_Properties.testPropertyPlusWrapFieldSecond(TestLocalTime_Properties.java:557)

testPropertyPlusWrapFieldMilli(org.joda.time.TestLocalTime_Properties)  Time elapsed: 0 sec  <<< ERROR!
java.lang.IllegalArgumentException: MIN > MAX
	at org.joda.time.field.FieldUtils.getWrappedValue(FieldUtils.java:50)
	at org.joda.time.field.FieldUtils.getWrappedValue(FieldUtils.java:49)
	at org.joda.time.field.PreciseDateTimeField.addWrapField(PreciseDateTimeField.java:97)
	at org.joda.time.LocalTime$Property.addWrapFieldToCopy(LocalTime.java:1493)
	at org.joda.time.TestLocalTime_Properties.testPropertyPlusWrapFieldMilli(TestLocalTime_Properties.java:722)

testPropertyPlusWrapFieldMinute(org.joda.time.TestLocalTime_Properties)  Time elapsed: 0.001 sec  <<< ERROR!
java.lang.IllegalArgumentException: MIN > MAX
	at org.joda.time.field.FieldUtils.getWrappedValue(FieldUtils.java:50)
	at org.joda.time.field.FieldUtils.getWrappedValue(FieldUtils.java:49)
	at org.joda.time.field.PreciseDateTimeField.addWrapField(PreciseDateTimeField.java:97)
	at org.joda.time.LocalTime$Property.addWrapFieldToCopy(LocalTime.java:1493)
	at org.joda.time.TestLocalTime_Properties.testPropertyPlusWrapFieldMinute(TestLocalTime_Properties.java:386)

testPropertyAddWrapFieldHour(org.joda.time.TestTimeOfDay_Properties)  Time elapsed: 0 sec  <<< ERROR!
java.lang.IllegalArgumentException: MIN > MAX
	at org.joda.time.field.FieldUtils.getWrappedValue(FieldUtils.java:50)
	at org.joda.time.field.FieldUtils.getWrappedValue(FieldUtils.java:49)
	at org.joda.time.field.BaseDateTimeField.addWrapField(BaseDateTimeField.java:496)
	at org.joda.time.TimeOfDay$Property.addWrapFieldToCopy(TimeOfDay.java:1148)
	at org.joda.time.TestTimeOfDay_Properties.testPropertyAddWrapFieldHour(TestTimeOfDay_Properties.java:158)

testPropertyAddWrapFieldMinute(org.joda.time.TestTimeOfDay_Properties)  Time elapsed: 0.001 sec  <<< ERROR!
java.lang.IllegalArgumentException: MIN > MAX
	at org.joda.time.field.FieldUtils.getWrappedValue(FieldUtils.java:50)
	at org.joda.time.field.FieldUtils.getWrappedValue(FieldUtils.java:49)
	at org.joda.time.field.BaseDateTimeField.addWrapField(BaseDateTimeField.java:496)
	at org.joda.time.TimeOfDay$Property.addWrapFieldToCopy(TimeOfDay.java:1148)
	at org.joda.time.TestTimeOfDay_Properties.testPropertyAddWrapFieldMinute(TestTimeOfDay_Properties.java:347)

testPropertyAddWrapFieldSecond(org.joda.time.TestTimeOfDay_Properties)  Time elapsed: 0 sec  <<< ERROR!
java.lang.IllegalArgumentException: MIN > MAX
	at org.joda.time.field.FieldUtils.getWrappedValue(FieldUtils.java:50)
	at org.joda.time.field.FieldUtils.getWrappedValue(FieldUtils.java:49)
	at org.joda.time.field.BaseDateTimeField.addWrapField(BaseDateTimeField.java:496)
	at org.joda.time.TimeOfDay$Property.addWrapFieldToCopy(TimeOfDay.java:1148)
	at org.joda.time.TestTimeOfDay_Properties.testPropertyAddWrapFieldSecond(TestTimeOfDay_Properties.java:513)

testPropertyAddWrapFieldMilli(org.joda.time.TestTimeOfDay_Properties)  Time elapsed: 0 sec  <<< ERROR!
java.lang.IllegalArgumentException: MIN > MAX
	at org.joda.time.field.FieldUtils.getWrappedValue(FieldUtils.java:50)
	at org.joda.time.field.FieldUtils.getWrappedValue(FieldUtils.java:49)
	at org.joda.time.field.BaseDateTimeField.addWrapField(BaseDateTimeField.java:496)
	at org.joda.time.TimeOfDay$Property.addWrapFieldToCopy(TimeOfDay.java:1148)
	at org.joda.time.TestTimeOfDay_Properties.testPropertyAddWrapFieldMilli(TestTimeOfDay_Properties.java:673)

testPropertyAddWrapFieldYear(org.joda.time.TestYearMonthDay_Properties)  Time elapsed: 0.001 sec  <<< ERROR!
java.lang.IllegalArgumentException: MIN > MAX
	at org.joda.time.field.FieldUtils.getWrappedValue(FieldUtils.java:50)
	at org.joda.time.field.FieldUtils.getWrappedValue(FieldUtils.java:49)
	at org.joda.time.field.BaseDateTimeField.addWrapField(BaseDateTimeField.java:496)
	at org.joda.time.YearMonthDay$Property.addWrapFieldToCopy(YearMonthDay.java:1035)
	at org.joda.time.TestYearMonthDay_Properties.testPropertyAddWrapFieldYear(TestYearMonthDay_Properties.java:144)

testPropertyAddWrapFieldMonth(org.joda.time.TestYearMonthDay_Properties)  Time elapsed: 0 sec  <<< ERROR!
java.lang.IllegalArgumentException: MIN > MAX
	at org.joda.time.field.FieldUtils.getWrappedValue(FieldUtils.java:50)
	at org.joda.time.field.FieldUtils.getWrappedValue(FieldUtils.java:49)
	at org.joda.time.field.BaseDateTimeField.addWrapField(BaseDateTimeField.java:496)
	at org.joda.time.YearMonthDay$Property.addWrapFieldToCopy(YearMonthDay.java:1035)
	at org.joda.time.TestYearMonthDay_Properties.testPropertyAddWrapFieldMonth(TestYearMonthDay_Properties.java:257)

testPropertyAddWrapFieldDay(org.joda.time.TestYearMonthDay_Properties)  Time elapsed: 0.001 sec  <<< ERROR!
java.lang.IllegalArgumentException: MIN > MAX
	at org.joda.time.field.FieldUtils.getWrappedValue(FieldUtils.java:50)
	at org.joda.time.field.FieldUtils.getWrappedValue(FieldUtils.java:49)
	at org.joda.time.field.BaseDateTimeField.addWrapField(BaseDateTimeField.java:496)
	at org.joda.time.YearMonthDay$Property.addWrapFieldToCopy(YearMonthDay.java:1035)
	at org.joda.time.TestYearMonthDay_Properties.testPropertyAddWrapFieldDay(TestYearMonthDay_Properties.java:412)

testPropertyAddWrapFieldYear(org.joda.time.TestYearMonth_Properties)  Time elapsed: 0.001 sec  <<< ERROR!
java.lang.IllegalArgumentException: MIN > MAX
	at org.joda.time.field.FieldUtils.getWrappedValue(FieldUtils.java:50)
	at org.joda.time.field.FieldUtils.getWrappedValue(FieldUtils.java:49)
	at org.joda.time.field.BaseDateTimeField.addWrapField(BaseDateTimeField.java:496)
	at org.joda.time.YearMonth$Property.addWrapFieldToCopy(YearMonth.java:938)
	at org.joda.time.TestYearMonth_Properties.testPropertyAddWrapFieldYear(TestYearMonth_Properties.java:143)

testPropertyAddWrapFieldMonth(org.joda.time.TestYearMonth_Properties)  Time elapsed: 0.001 sec  <<< ERROR!
java.lang.IllegalArgumentException: MIN > MAX
	at org.joda.time.field.FieldUtils.getWrappedValue(FieldUtils.java:50)
	at org.joda.time.field.FieldUtils.getWrappedValue(FieldUtils.java:49)
	at org.joda.time.field.BaseDateTimeField.addWrapField(BaseDateTimeField.java:496)
	at org.joda.time.YearMonth$Property.addWrapFieldToCopy(YearMonth.java:938)
	at org.joda.time.TestYearMonth_Properties.testPropertyAddWrapFieldMonth(TestYearMonth_Properties.java:242)

testPropertyAddWrapFieldMonthOfYear(org.joda.time.TestMonthDay_Properties)  Time elapsed: 0.001 sec  <<< ERROR!
java.lang.IllegalArgumentException: MIN > MAX
	at org.joda.time.field.FieldUtils.getWrappedValue(FieldUtils.java:50)
	at org.joda.time.field.FieldUtils.getWrappedValue(FieldUtils.java:49)
	at org.joda.time.field.BaseDateTimeField.addWrapField(BaseDateTimeField.java:496)
	at org.joda.time.MonthDay$Property.addWrapFieldToCopy(MonthDay.java:924)
	at org.joda.time.TestMonthDay_Properties.testPropertyAddWrapFieldMonthOfYear(TestMonthDay_Properties.java:125)

testPropertyAddWrapFieldDayOfMonth(org.joda.time.TestMonthDay_Properties)  Time elapsed: 0 sec  <<< ERROR!
java.lang.IllegalArgumentException: MIN > MAX
	at org.joda.time.field.FieldUtils.getWrappedValue(FieldUtils.java:50)
	at org.joda.time.field.FieldUtils.getWrappedValue(FieldUtils.java:49)
	at org.joda.time.field.BaseDateTimeField.addWrapField(BaseDateTimeField.java:496)
	at org.joda.time.MonthDay$Property.addWrapFieldToCopy(MonthDay.java:924)
	at org.joda.time.TestMonthDay_Properties.testPropertyAddWrapFieldDayOfMonth(TestMonthDay_Properties.java:224)

testPropertyAddWrapFieldHour(org.joda.time.TestPartial_Properties)  Time elapsed: 0 sec  <<< ERROR!
java.lang.IllegalArgumentException: MIN > MAX
	at org.joda.time.field.FieldUtils.getWrappedValue(FieldUtils.java:50)
	at org.joda.time.field.FieldUtils.getWrappedValue(FieldUtils.java:49)
	at org.joda.time.field.BaseDateTimeField.addWrapField(BaseDateTimeField.java:496)
	at org.joda.time.Partial$Property.addWrapFieldToCopy(Partial.java:949)
	at org.joda.time.TestPartial_Properties.testPropertyAddWrapFieldHour(TestPartial_Properties.java:164)

testPropertyAddWrapFieldMinute(org.joda.time.TestPartial_Properties)  Time elapsed: 0 sec  <<< ERROR!
java.lang.IllegalArgumentException: MIN > MAX
	at org.joda.time.field.FieldUtils.getWrappedValue(FieldUtils.java:50)
	at org.joda.time.field.FieldUtils.getWrappedValue(FieldUtils.java:49)
	at org.joda.time.field.BaseDateTimeField.addWrapField(BaseDateTimeField.java:496)
	at org.joda.time.Partial$Property.addWrapFieldToCopy(Partial.java:949)
	at org.joda.time.TestPartial_Properties.testPropertyAddWrapFieldMinute(TestPartial_Properties.java:353)

test_DateTime_addWrapFieldDay_Gaza(org.joda.time.TestDateTimeZoneCutover)  Time elapsed: 0.001 sec  <<< ERROR!
java.lang.IllegalArgumentException: MIN > MAX
	at org.joda.time.field.FieldUtils.getWrappedValue(FieldUtils.java:50)
	at org.joda.time.field.FieldUtils.getWrappedValue(FieldUtils.java:49)
	at org.joda.time.field.BaseDateTimeField.addWrapField(BaseDateTimeField.java:462)
	at org.joda.time.chrono.ZonedChronology$ZonedDateTimeField.addWrapField(ZonedChronology.java:475)
	at org.joda.time.DateTime$Property.addWrapFieldToCopy(DateTime.java:2203)
	at org.joda.time.TestDateTimeZoneCutover.test_DateTime_addWrapFieldDay_Gaza(TestDateTimeZoneCutover.java:192)

test_DateTime_addWrapFieldDay_Turk(org.joda.time.TestDateTimeZoneCutover)  Time elapsed: 0.001 sec  <<< ERROR!
java.lang.IllegalArgumentException: MIN > MAX
	at org.joda.time.field.FieldUtils.getWrappedValue(FieldUtils.java:50)
	at org.joda.time.field.FieldUtils.getWrappedValue(FieldUtils.java:49)
	at org.joda.time.field.BaseDateTimeField.addWrapField(BaseDateTimeField.java:462)
	at org.joda.time.chrono.ZonedChronology$ZonedDateTimeField.addWrapField(ZonedChronology.java:475)
	at org.joda.time.DateTime$Property.addWrapFieldToCopy(DateTime.java:2203)
	at org.joda.time.TestDateTimeZoneCutover.test_DateTime_addWrapFieldDay_Turk(TestDateTimeZoneCutover.java:409)

testSampleDate(org.joda.time.chrono.TestCopticChronology)  Time elapsed: 0 sec  <<< ERROR!
java.lang.IllegalArgumentException: MIN > MAX
	at org.joda.time.field.FieldUtils.getWrappedValue(FieldUtils.java:50)
	at org.joda.time.field.FieldUtils.getWrappedValue(FieldUtils.java:49)
	at org.joda.time.chrono.BasicMonthOfYearDateTimeField.addWrapField(BasicMonthOfYearDateTimeField.java:239)
	at org.joda.time.chrono.LimitChronology$LimitDateTimeField.addWrapField(LimitChronology.java:492)
	at org.joda.time.DateTime$Property.addWrapFieldToCopy(DateTime.java:2203)
	at org.joda.time.chrono.TestCopticChronology.testSampleDate(TestCopticChronology.java:424)

testSampleDate(org.joda.time.chrono.TestEthiopicChronology)  Time elapsed: 0 sec  <<< ERROR!
java.lang.IllegalArgumentException: MIN > MAX
	at org.joda.time.field.FieldUtils.getWrappedValue(FieldUtils.java:50)
	at org.joda.time.field.FieldUtils.getWrappedValue(FieldUtils.java:49)
	at org.joda.time.chrono.BasicMonthOfYearDateTimeField.addWrapField(BasicMonthOfYearDateTimeField.java:239)
	at org.joda.time.chrono.LimitChronology$LimitDateTimeField.addWrapField(LimitChronology.java:492)
	at org.joda.time.DateTime$Property.addWrapFieldToCopy(DateTime.java:2203)
	at org.joda.time.chrono.TestEthiopicChronology.testSampleDate(TestEthiopicChronology.java:424)

testSampleDate1(org.joda.time.chrono.TestIslamicChronology)  Time elapsed: 0 sec  <<< ERROR!
java.lang.IllegalArgumentException: MIN > MAX
	at org.joda.time.field.FieldUtils.getWrappedValue(FieldUtils.java:50)
	at org.joda.time.field.FieldUtils.getWrappedValue(FieldUtils.java:49)
	at org.joda.time.chrono.BasicMonthOfYearDateTimeField.addWrapField(BasicMonthOfYearDateTimeField.java:239)
	at org.joda.time.chrono.LimitChronology$LimitDateTimeField.addWrapField(LimitChronology.java:492)
	at org.joda.time.DateTime$Property.addWrapFieldToCopy(DateTime.java:2203)
	at org.joda.time.chrono.TestIslamicChronology.testSampleDate1(TestIslamicChronology.java:438)

testChronology(org.joda.time.chrono.gj.MainTest)  Time elapsed: 0.002 sec  <<< FAILURE!
junit.framework.AssertionFailedError: MIN > MAX
	at junit.framework.Assert.fail(Assert.java:47)
	at org.joda.time.chrono.gj.MainTest.testChronology(MainTest.java:158)

testChronology(org.joda.time.chrono.gj.MainTest)  Time elapsed: 0.001 sec  <<< FAILURE!
junit.framework.AssertionFailedError: MIN > MAX
	at junit.framework.Assert.fail(Assert.java:47)
	at org.joda.time.chrono.gj.MainTest.testChronology(MainTest.java:158)

test_addWrapField_long_int(org.joda.time.field.TestBaseDateTimeField)  Time elapsed: 0 sec  <<< ERROR!
java.lang.IllegalArgumentException: MIN > MAX
	at org.joda.time.field.FieldUtils.getWrappedValue(FieldUtils.java:50)
	at org.joda.time.field.FieldUtils.getWrappedValue(FieldUtils.java:49)
	at org.joda.time.field.BaseDateTimeField.addWrapField(BaseDateTimeField.java:462)
	at org.joda.time.field.TestBaseDateTimeField.test_addWrapField_long_int(TestBaseDateTimeField.java:225)

test_addWrapField_RP_int_intarray_int(org.joda.time.field.TestBaseDateTimeField)  Time elapsed: 0.001 sec  <<< ERROR!
java.lang.IllegalArgumentException: MIN > MAX
	at org.joda.time.field.FieldUtils.getWrappedValue(FieldUtils.java:50)
	at org.joda.time.field.FieldUtils.getWrappedValue(FieldUtils.java:49)
	at org.joda.time.field.BaseDateTimeField.addWrapField(BaseDateTimeField.java:496)
	at org.joda.time.field.TestBaseDateTimeField.test_addWrapField_RP_int_intarray_int(TestBaseDateTimeField.java:234)

test_addWrapField_long_int(org.joda.time.field.TestOffsetDateTimeField)  Time elapsed: 0.001 sec  <<< ERROR!
java.lang.IllegalArgumentException: MIN > MAX
	at org.joda.time.field.FieldUtils.getWrappedValue(FieldUtils.java:50)
	at org.joda.time.field.FieldUtils.getWrappedValue(FieldUtils.java:49)
	at org.joda.time.field.OffsetDateTimeField.addWrapField(OffsetDateTimeField.java:141)
	at org.joda.time.field.TestOffsetDateTimeField.test_addWrapField_long_int(TestOffsetDateTimeField.java:266)

test_addWrapField_RP_int_intarray_int(org.joda.time.field.TestOffsetDateTimeField)  Time elapsed: 0 sec  <<< ERROR!
java.lang.IllegalArgumentException: MIN > MAX
	at org.joda.time.field.FieldUtils.getWrappedValue(FieldUtils.java:50)
	at org.joda.time.field.FieldUtils.getWrappedValue(FieldUtils.java:49)
	at org.joda.time.field.BaseDateTimeField.addWrapField(BaseDateTimeField.java:496)
	at org.joda.time.field.TestOffsetDateTimeField.test_addWrapField_RP_int_intarray_int(TestOffsetDateTimeField.java:275)

test_addWrapField_long_int(org.joda.time.field.TestPreciseDurationDateTimeField)  Time elapsed: 0 sec  <<< ERROR!
java.lang.IllegalArgumentException: MIN > MAX
	at org.joda.time.field.FieldUtils.getWrappedValue(FieldUtils.java:50)
	at org.joda.time.field.FieldUtils.getWrappedValue(FieldUtils.java:49)
	at org.joda.time.field.BaseDateTimeField.addWrapField(BaseDateTimeField.java:462)
	at org.joda.time.field.TestPreciseDurationDateTimeField.test_addWrapField_long_int(TestPreciseDurationDateTimeField.java:230)

test_addWrapField_RP_int_intarray_int(org.joda.time.field.TestPreciseDurationDateTimeField)  Time elapsed: 0.001 sec  <<< ERROR!
java.lang.IllegalArgumentException: MIN > MAX
	at org.joda.time.field.FieldUtils.getWrappedValue(FieldUtils.java:50)
	at org.joda.time.field.FieldUtils.getWrappedValue(FieldUtils.java:49)
	at org.joda.time.field.BaseDateTimeField.addWrapField(BaseDateTimeField.java:496)
	at org.joda.time.field.TestPreciseDurationDateTimeField.test_addWrapField_RP_int_intarray_int(TestPreciseDurationDateTimeField.java:239)

test_addWrapField_long_int(org.joda.time.field.TestPreciseDateTimeField)  Time elapsed: 0.001 sec  <<< ERROR!
java.lang.IllegalArgumentException: MIN > MAX
	at org.joda.time.field.FieldUtils.getWrappedValue(FieldUtils.java:50)
	at org.joda.time.field.FieldUtils.getWrappedValue(FieldUtils.java:49)
	at org.joda.time.field.PreciseDateTimeField.addWrapField(PreciseDateTimeField.java:97)
	at org.joda.time.field.TestPreciseDateTimeField.test_addWrapField_long_int(TestPreciseDateTimeField.java:259)

test_addWrapField_RP_int_intarray_int(org.joda.time.field.TestPreciseDateTimeField)  Time elapsed: 0 sec  <<< ERROR!
java.lang.IllegalArgumentException: MIN > MAX
	at org.joda.time.field.FieldUtils.getWrappedValue(FieldUtils.java:50)
	at org.joda.time.field.FieldUtils.getWrappedValue(FieldUtils.java:49)
	at org.joda.time.field.BaseDateTimeField.addWrapField(BaseDateTimeField.java:496)
	at org.joda.time.field.TestPreciseDateTimeField.test_addWrapField_RP_int_intarray_int(TestPreciseDateTimeField.java:268)


Results :

Failed tests: 
org.joda.time.chrono.gj.MainTest.testChronology(org.joda.time.chrono.gj.MainTest)
  Run 1: org.joda.time.chrono.gj.MainTest#testChronology AssertionFailedError MIN > MAX
  Run 2: org.joda.time.chrono.gj.MainTest#testChronology AssertionFailedError MIN > MAX

Tests in error: 
  org.joda.time.TestDateMidnight_Properties#testPropertyAddWrapFieldMonthOfYear IllegalArgumentException
  org.joda.time.TestDateTimeZoneCutover#test_DateTime_addWrapFieldDay_Gaza IllegalArgumentException
  org.joda.time.TestDateTimeZoneCutover#test_DateTime_addWrapFieldDay_Turk IllegalArgumentException
  org.joda.time.TestDateTime_Properties#testPropertyAddWrapFieldDayOfMonth IllegalArgumentException
  org.joda.time.TestDateTime_Properties#testPropertyAddWrapFieldDayOfWeek IllegalArgumentException
  org.joda.time.TestDateTime_Properties#testPropertyAddWrapFieldDayOfYear IllegalArgumentException
  org.joda.time.TestDateTime_Properties#testPropertyAddWrapFieldMonthOfYear IllegalArgumentException
  org.joda.time.TestDateTime_Properties#testPropertyAddWrapFieldWeekOfWeekyear IllegalArgumentException
  org.joda.time.TestDateTime_Properties#testPropertyAddWrapFieldYear IllegalArgumentException
  org.joda.time.TestLocalDateTime_Properties#testPropertyAddWrapFieldToCopyDay IllegalArgumentException
  org.joda.time.TestLocalDateTime_Properties#testPropertyAddWrapFieldToCopyHour IllegalArgumentException
  org.joda.time.TestLocalDateTime_Properties#testPropertyAddWrapFieldToCopyMilli IllegalArgumentException
  org.joda.time.TestLocalDateTime_Properties#testPropertyAddWrapFieldToCopyMinute IllegalArgumentException
  org.joda.time.TestLocalDateTime_Properties#testPropertyAddWrapFieldToCopyMonth IllegalArgumentException
  org.joda.time.TestLocalDateTime_Properties#testPropertyAddWrapFieldToCopySecond IllegalArgumentException
  org.joda.time.TestLocalDateTime_Properties#testPropertyAddWrapFieldToCopyYear IllegalArgumentException
  org.joda.time.TestLocalDate_Properties#testPropertyAddWrapFieldToCopyDay IllegalArgumentException
  org.joda.time.TestLocalDate_Properties#testPropertyAddWrapFieldToCopyMonth IllegalArgumentException
  org.joda.time.TestLocalDate_Properties#testPropertyAddWrapFieldToCopyYear IllegalArgumentException
  org.joda.time.TestLocalTime_Properties#testPropertyPlusWrapFieldHour IllegalArgumentException
  org.joda.time.TestLocalTime_Properties#testPropertyPlusWrapFieldMilli IllegalArgumentException
  org.joda.time.TestLocalTime_Properties#testPropertyPlusWrapFieldMinute IllegalArgumentException
  org.joda.time.TestLocalTime_Properties#testPropertyPlusWrapFieldSecond IllegalArgumentException
  org.joda.time.TestMonthDay_Properties#testPropertyAddWrapFieldDayOfMonth IllegalArgumentException
  org.joda.time.TestMonthDay_Properties#testPropertyAddWrapFieldMonthOfYear IllegalArgumentException
  org.joda.time.TestMutableDateTime_Properties#testPropertyAddWrapFieldDayOfMonth IllegalArgumentException
  org.joda.time.TestMutableDateTime_Properties#testPropertyAddWrapFieldDayOfWeek IllegalArgumentException
  org.joda.time.TestMutableDateTime_Properties#testPropertyAddWrapFieldDayOfYear IllegalArgumentException
  org.joda.time.TestMutableDateTime_Properties#testPropertyAddWrapFieldMonthOfYear IllegalArgumentException
  org.joda.time.TestMutableDateTime_Properties#testPropertyAddWrapFieldWeekOfWeekyear IllegalArgumentException
  org.joda.time.TestMutableDateTime_Properties#testPropertyAddWrapFieldYear IllegalArgumentException
  org.joda.time.TestPartial_Properties#testPropertyAddWrapFieldHour IllegalArgumentException
  org.joda.time.TestPartial_Properties#testPropertyAddWrapFieldMinute IllegalArgumentException
  org.joda.time.TestTimeOfDay_Properties#testPropertyAddWrapFieldHour IllegalArgumentException
  org.joda.time.TestTimeOfDay_Properties#testPropertyAddWrapFieldMilli IllegalArgumentException
  org.joda.time.TestTimeOfDay_Properties#testPropertyAddWrapFieldMinute IllegalArgumentException
  org.joda.time.TestTimeOfDay_Properties#testPropertyAddWrapFieldSecond IllegalArgumentException
  org.joda.time.TestYearMonthDay_Properties#testPropertyAddWrapFieldDay IllegalArgumentException
  org.joda.time.TestYearMonthDay_Properties#testPropertyAddWrapFieldMonth IllegalArgumentException
  org.joda.time.TestYearMonthDay_Properties#testPropertyAddWrapFieldYear IllegalArgumentException
  org.joda.time.TestYearMonth_Properties#testPropertyAddWrapFieldMonth IllegalArgumentException
  org.joda.time.TestYearMonth_Properties#testPropertyAddWrapFieldYear IllegalArgumentException
  org.joda.time.chrono.TestCopticChronology#testSampleDate IllegalArgumentException
  org.joda.time.chrono.TestEthiopicChronology#testSampleDate IllegalArgumentException
  org.joda.time.chrono.TestIslamicChronology#testSampleDate1 IllegalArgumentException
  org.joda.time.field.TestBaseDateTimeField#test_addWrapField_RP_int_intarray_int IllegalArgumentException
  org.joda.time.field.TestBaseDateTimeField#test_addWrapField_long_int IllegalArgumentException
  org.joda.time.field.TestOffsetDateTimeField#test_addWrapField_RP_int_intarray_int IllegalArgumentException
  org.joda.time.field.TestOffsetDateTimeField#test_addWrapField_long_int IllegalArgumentException
  org.joda.time.field.TestPreciseDateTimeField#test_addWrapField_RP_int_intarray_int IllegalArgumentException
  org.joda.time.field.TestPreciseDateTimeField#test_addWrapField_long_int IllegalArgumentException
  org.joda.time.field.TestPreciseDurationDateTimeField#test_addWrapField_RP_int_intarray_int IllegalArgumentException
  org.joda.time.field.TestPreciseDurationDateTimeField#test_addWrapField_long_int IllegalArgumentException

Tests run: 4156, Failures: 1, Errors: 53, Skipped: 0

[INFO] ------------------------------------------------------------------------
[INFO] BUILD FAILURE
[INFO] ------------------------------------------------------------------------
[INFO] Total time: 15.030s
[INFO] Finished at: Thu Aug 06 04:41:44 BST 2015
[INFO] Final Memory: 10M/345M
[INFO] ------------------------------------------------------------------------
[ERROR] Failed to execute goal org.apache.maven.plugins:maven-surefire-plugin:2.18.1:test (default-test) on project joda-time: There are test failures.
[ERROR] 
[ERROR] Please refer to /home/perham/Study/LittleDarwin/Cases/joda-time-2.8.1/target/surefire-reports for the individual test results.
[ERROR] -> [Help 1]
[ERROR] 
[ERROR] To see the full stack trace of the errors, re-run Maven with the -e switch.
[ERROR] Re-run Maven using the -X switch to enable full debug logging.
[ERROR] 
[ERROR] For more information about the errors and possible solutions, please read the following articles:
[ERROR] [Help 1] http://cwiki.apache.org/confluence/display/MAVEN/MojoFailureException
