[INFO] Scanning for projects...
[INFO]                                                                         
[INFO] ------------------------------------------------------------------------
[INFO] Building Joda-Time 2.8.1
[INFO] ------------------------------------------------------------------------
[INFO] 
[INFO] --- maven-resources-plugin:2.7:resources (default-resources) @ joda-time ---
[INFO] Using 'UTF-8' encoding to copy filtered resources.
[INFO] Copying 2 resources to META-INF
[INFO] Copying 10 resources
[INFO] 
[INFO] --- maven-compiler-plugin:3.3:compile (default-compile) @ joda-time ---
[INFO] Changes detected - recompiling the module!
[INFO] Compiling 166 source files to /home/perham/Study/LittleDarwin/Cases/joda-time-2.8.1/target/classes
[INFO] 
[INFO] --- exec-maven-plugin:1.4.0:java (compile-tzdb) @ joda-time ---
Writing zoneinfo files
Writing ZoneInfoMap
[INFO] 
[INFO] --- maven-resources-plugin:2.7:testResources (default-testResources) @ joda-time ---
[INFO] Using 'UTF-8' encoding to copy filtered resources.
[INFO] Copying 34 resources
[INFO] 
[INFO] --- maven-compiler-plugin:3.3:testCompile (default-testCompile) @ joda-time ---
[INFO] Nothing to compile - all classes are up to date
[INFO] 
[INFO] --- maven-surefire-plugin:2.18.1:test (default-test) @ joda-time ---
[INFO] Surefire report directory: /home/perham/Study/LittleDarwin/Cases/joda-time-2.8.1/target/surefire-reports

-------------------------------------------------------
 T E S T S
-------------------------------------------------------
Running org.joda.time.TestAllPackages

TestBuddhistChronology.testCalendar

TestCopticChronology.testCalendar

TestEthiopicChronology.testCalendar

TestIslamicChronology.testCalendar

Testing Gregorian chronology over 1000 iterations
100% complete (i=1000)

Testing Julian chronology over 1000 iterations
100% complete (i=1000)
Writing zoneinfo files
Writing ZoneInfoMap
Tests run: 4157, Failures: 12, Errors: 1, Skipped: 0, Time elapsed: 5.149 sec <<< FAILURE! - in org.joda.time.TestAllPackages
testMinus_long(org.joda.time.TestInstant_Basics)  Time elapsed: 0.004 sec  <<< FAILURE!
junit.framework.AssertionFailedError: expected:<2002-04-04T02:06:23.211Z> but was:<2002-04-06T22:41:36.789Z>
	at junit.framework.Assert.fail(Assert.java:47)
	at junit.framework.Assert.failNotEquals(Assert.java:280)
	at junit.framework.Assert.assertEquals(Assert.java:64)
	at junit.framework.Assert.assertEquals(Assert.java:71)
	at org.joda.time.TestInstant_Basics.testMinus_long(TestInstant_Basics.java:575)

testMinus_RD(org.joda.time.TestInstant_Basics)  Time elapsed: 0.001 sec  <<< FAILURE!
junit.framework.AssertionFailedError: expected:<2002-04-04T02:06:23.211Z> but was:<2002-04-06T22:41:36.789Z>
	at junit.framework.Assert.fail(Assert.java:47)
	at junit.framework.Assert.failNotEquals(Assert.java:280)
	at junit.framework.Assert.assertEquals(Assert.java:64)
	at junit.framework.Assert.assertEquals(Assert.java:71)
	at org.joda.time.TestInstant_Basics.testMinus_RD(TestInstant_Basics.java:582)

testMinus_long(org.joda.time.TestDateTime_Basics)  Time elapsed: 0.001 sec  <<< FAILURE!
junit.framework.AssertionFailedError: expected:<2545-04-04T03:06:23.211+01:00> but was:<2545-04-06T23:41:36.789+01:00>
	at junit.framework.Assert.fail(Assert.java:47)
	at junit.framework.Assert.failNotEquals(Assert.java:280)
	at junit.framework.Assert.assertEquals(Assert.java:64)
	at junit.framework.Assert.assertEquals(Assert.java:71)
	at org.joda.time.TestDateTime_Basics.testMinus_long(TestDateTime_Basics.java:1150)

testMinus_RD(org.joda.time.TestDateTime_Basics)  Time elapsed: 0.001 sec  <<< FAILURE!
junit.framework.AssertionFailedError: expected:<2545-04-04T03:06:23.211+01:00> but was:<2545-04-06T23:41:36.789+01:00>
	at junit.framework.Assert.fail(Assert.java:47)
	at junit.framework.Assert.failNotEquals(Assert.java:280)
	at junit.framework.Assert.assertEquals(Assert.java:64)
	at junit.framework.Assert.assertEquals(Assert.java:71)
	at org.joda.time.TestDateTime_Basics.testMinus_RD(TestDateTime_Basics.java:1157)

testMinus_long(org.joda.time.TestDateMidnight_Basics)  Time elapsed: 0.001 sec  <<< FAILURE!
junit.framework.AssertionFailedError: expected:<2545-04-03T00:00:00.000+01:00> but was:<2545-04-06T00:00:00.000+01:00>
	at junit.framework.Assert.fail(Assert.java:47)
	at junit.framework.Assert.failNotEquals(Assert.java:280)
	at junit.framework.Assert.assertEquals(Assert.java:64)
	at junit.framework.Assert.assertEquals(Assert.java:71)
	at org.joda.time.TestDateMidnight_Basics.testMinus_long(TestDateMidnight_Basics.java:923)

testMinus_RD(org.joda.time.TestDateMidnight_Basics)  Time elapsed: 0.001 sec  <<< FAILURE!
junit.framework.AssertionFailedError: expected:<2545-04-03T00:00:00.000+01:00> but was:<2545-04-06T00:00:00.000+01:00>
	at junit.framework.Assert.fail(Assert.java:47)
	at junit.framework.Assert.failNotEquals(Assert.java:280)
	at junit.framework.Assert.assertEquals(Assert.java:64)
	at junit.framework.Assert.assertEquals(Assert.java:71)
	at org.joda.time.TestDateMidnight_Basics.testMinus_RD(TestDateMidnight_Basics.java:930)

testWithDurationAdded_long_int3(org.joda.time.TestDuration_Basics)  Time elapsed: 0 sec  <<< FAILURE!
junit.framework.AssertionFailedError: expected:<-7877> but was:<8123>
	at junit.framework.Assert.fail(Assert.java:47)
	at junit.framework.Assert.failNotEquals(Assert.java:280)
	at junit.framework.Assert.assertEquals(Assert.java:64)
	at junit.framework.Assert.assertEquals(Assert.java:133)
	at junit.framework.Assert.assertEquals(Assert.java:139)
	at org.joda.time.TestDuration_Basics.testWithDurationAdded_long_int3(TestDuration_Basics.java:640)

testMinus_long1(org.joda.time.TestDuration_Basics)  Time elapsed: 0.001 sec  <<< FAILURE!
junit.framework.AssertionFailedError: expected:<-7877> but was:<8123>
	at junit.framework.Assert.fail(Assert.java:47)
	at junit.framework.Assert.failNotEquals(Assert.java:280)
	at junit.framework.Assert.assertEquals(Assert.java:64)
	at junit.framework.Assert.assertEquals(Assert.java:133)
	at junit.framework.Assert.assertEquals(Assert.java:139)
	at org.joda.time.TestDuration_Basics.testMinus_long1(TestDuration_Basics.java:672)

testWithDurationAdded_RD_int3(org.joda.time.TestDuration_Basics)  Time elapsed: 0 sec  <<< FAILURE!
junit.framework.AssertionFailedError: expected:<-7877> but was:<8123>
	at junit.framework.Assert.fail(Assert.java:47)
	at junit.framework.Assert.failNotEquals(Assert.java:280)
	at junit.framework.Assert.assertEquals(Assert.java:64)
	at junit.framework.Assert.assertEquals(Assert.java:133)
	at junit.framework.Assert.assertEquals(Assert.java:139)
	at org.joda.time.TestDuration_Basics.testWithDurationAdded_RD_int3(TestDuration_Basics.java:746)

testMinus_RD1(org.joda.time.TestDuration_Basics)  Time elapsed: 0.001 sec  <<< FAILURE!
junit.framework.AssertionFailedError: expected:<-7877> but was:<8123>
	at junit.framework.Assert.fail(Assert.java:47)
	at junit.framework.Assert.failNotEquals(Assert.java:280)
	at junit.framework.Assert.assertEquals(Assert.java:64)
	at junit.framework.Assert.assertEquals(Assert.java:133)
	at junit.framework.Assert.assertEquals(Assert.java:139)
	at org.joda.time.TestDuration_Basics.testMinus_RD1(TestDuration_Basics.java:790)

testWithDurationBeforeEnd1(org.joda.time.TestInterval_Basics)  Time elapsed: 0 sec  <<< ERROR!
java.lang.IllegalArgumentException: The end instant must be greater or equal to the start
	at org.joda.time.base.AbstractInterval.checkInterval(AbstractInterval.java:63)
	at org.joda.time.base.BaseInterval.<init>(BaseInterval.java:73)
	at org.joda.time.Interval.<init>(Interval.java:109)
	at org.joda.time.Interval.withDurationBeforeEnd(Interval.java:447)
	at org.joda.time.TestInterval_Basics.testWithDurationBeforeEnd1(TestInterval_Basics.java:1195)

testWithDurationBeforeEnd3(org.joda.time.TestInterval_Basics)  Time elapsed: 0.001 sec  <<< FAILURE!
junit.framework.AssertionFailedError
	at junit.framework.Assert.fail(Assert.java:47)
	at junit.framework.Assert.fail(Assert.java:53)
	at org.joda.time.TestInterval_Basics.testWithDurationBeforeEnd3(TestInterval_Basics.java:1212)

testSafeMultiplyLongInt(org.joda.time.field.TestFieldUtils)  Time elapsed: 0 sec  <<< FAILURE!
junit.framework.AssertionFailedError: expected:<-9223372036854775807> but was:<9223372036854775807>
	at junit.framework.Assert.fail(Assert.java:47)
	at junit.framework.Assert.failNotEquals(Assert.java:280)
	at junit.framework.Assert.assertEquals(Assert.java:64)
	at junit.framework.Assert.assertEquals(Assert.java:133)
	at junit.framework.Assert.assertEquals(Assert.java:139)
	at org.joda.time.field.TestFieldUtils.testSafeMultiplyLongInt(TestFieldUtils.java:257)


Results :

Failed tests: 
  org.joda.time.TestDateMidnight_Basics#testMinus_RD AssertionFailedError expect...
  org.joda.time.TestDateMidnight_Basics#testMinus_long AssertionFailedError expe...
  org.joda.time.TestDateTime_Basics#testMinus_RD AssertionFailedError expected:<...
  org.joda.time.TestDateTime_Basics#testMinus_long AssertionFailedError expected...
  org.joda.time.TestDuration_Basics#testMinus_RD1 AssertionFailedError expected:...
  org.joda.time.TestDuration_Basics#testMinus_long1 AssertionFailedError expecte...
  org.joda.time.TestDuration_Basics#testWithDurationAdded_RD_int3 AssertionFailedError
  org.joda.time.TestDuration_Basics#testWithDurationAdded_long_int3 AssertionFailedError
  org.joda.time.TestInstant_Basics#testMinus_RD AssertionFailedError expected:<2...
  org.joda.time.TestInstant_Basics#testMinus_long AssertionFailedError expected:...
  org.joda.time.TestInterval_Basics#testWithDurationBeforeEnd3 AssertionFailedError
  org.joda.time.field.TestFieldUtils#testSafeMultiplyLongInt AssertionFailedError
Tests in error: 
  org.joda.time.TestInterval_Basics#testWithDurationBeforeEnd1 IllegalArgumentException

Tests run: 4157, Failures: 12, Errors: 1, Skipped: 0

[INFO] ------------------------------------------------------------------------
[INFO] BUILD FAILURE
[INFO] ------------------------------------------------------------------------
[INFO] Total time: 15.321s
[INFO] Finished at: Thu Aug 06 04:38:19 BST 2015
[INFO] Final Memory: 9M/213M
[INFO] ------------------------------------------------------------------------
[ERROR] Failed to execute goal org.apache.maven.plugins:maven-surefire-plugin:2.18.1:test (default-test) on project joda-time: There are test failures.
[ERROR] 
[ERROR] Please refer to /home/perham/Study/LittleDarwin/Cases/joda-time-2.8.1/target/surefire-reports for the individual test results.
[ERROR] -> [Help 1]
[ERROR] 
[ERROR] To see the full stack trace of the errors, re-run Maven with the -e switch.
[ERROR] Re-run Maven using the -X switch to enable full debug logging.
[ERROR] 
[ERROR] For more information about the errors and possible solutions, please read the following articles:
[ERROR] [Help 1] http://cwiki.apache.org/confluence/display/MAVEN/MojoFailureException
