[INFO] Scanning for projects...
[INFO]                                                                         
[INFO] ------------------------------------------------------------------------
[INFO] Building Joda-Time 2.8.1
[INFO] ------------------------------------------------------------------------
[INFO] 
[INFO] --- maven-resources-plugin:2.7:resources (default-resources) @ joda-time ---
[INFO] Using 'UTF-8' encoding to copy filtered resources.
[INFO] Copying 2 resources to META-INF
[INFO] Copying 10 resources
[INFO] 
[INFO] --- maven-compiler-plugin:3.3:compile (default-compile) @ joda-time ---
[INFO] Changes detected - recompiling the module!
[INFO] Compiling 166 source files to /home/perham/Study/LittleDarwin/Cases/joda-time-2.8.1/target/classes
[INFO] 
[INFO] --- exec-maven-plugin:1.4.0:java (compile-tzdb) @ joda-time ---
Writing zoneinfo files
Writing ZoneInfoMap
[INFO] 
[INFO] --- maven-resources-plugin:2.7:testResources (default-testResources) @ joda-time ---
[INFO] Using 'UTF-8' encoding to copy filtered resources.
[INFO] Copying 34 resources
[INFO] 
[INFO] --- maven-compiler-plugin:3.3:testCompile (default-testCompile) @ joda-time ---
[INFO] Nothing to compile - all classes are up to date
[INFO] 
[INFO] --- maven-surefire-plugin:2.18.1:test (default-test) @ joda-time ---
[INFO] Surefire report directory: /home/perham/Study/LittleDarwin/Cases/joda-time-2.8.1/target/surefire-reports

-------------------------------------------------------
 T E S T S
-------------------------------------------------------
Running org.joda.time.TestAllPackages

TestBuddhistChronology.testCalendar

TestCopticChronology.testCalendar

TestEthiopicChronology.testCalendar

TestIslamicChronology.testCalendar

Testing Gregorian chronology over 1000 iterations
Failure index: 0
Test millis: -308262625532
Test value: -49
Test millis2: -46922557997542

Testing Julian chronology over 1000 iterations
Failure index: 0
Test millis: -308262625532
Test value: -49
Test millis2: -46922557997542
Writing zoneinfo files
Writing ZoneInfoMap
Tests run: 4157, Failures: 15, Errors: 5, Skipped: 0, Time elapsed: 4.994 sec <<< FAILURE! - in org.joda.time.TestAllPackages
testPropertyAddWrapFieldDayOfWeek(org.joda.time.TestDateTime_Properties)  Time elapsed: 0.005 sec  <<< FAILURE!
junit.framework.ComparisonFailure: expected:<2004-06-1[3]T00:00:00.000+01:00> but was:<2004-06-1[1]T00:00:00.000+01:00>
	at junit.framework.Assert.assertEquals(Assert.java:81)
	at junit.framework.Assert.assertEquals(Assert.java:87)
	at org.joda.time.TestDateTime_Properties.testPropertyAddWrapFieldDayOfWeek(TestDateTime_Properties.java:1031)

testPropertyAddWrapFieldMonthOfYear(org.joda.time.TestDateTime_Properties)  Time elapsed: 0.001 sec  <<< FAILURE!
junit.framework.ComparisonFailure: expected:<2004-[10]-09T00:00:00.000+01:...> but was:<2004-[08]-09T00:00:00.000+01:...>
	at junit.framework.Assert.assertEquals(Assert.java:81)
	at junit.framework.Assert.assertEquals(Assert.java:87)
	at org.joda.time.TestDateTime_Properties.testPropertyAddWrapFieldMonthOfYear(TestDateTime_Properties.java:438)

testPropertyAddWrapFieldYear(org.joda.time.TestDateTime_Properties)  Time elapsed: 0.001 sec  <<< ERROR!
org.joda.time.IllegalFieldValueException: Value 876829101 for year must be in the range [-292275054,292278993]
	at org.joda.time.field.FieldUtils.verifyValueBounds(FieldUtils.java:46)
	at org.joda.time.chrono.BasicYearDateTimeField.set(BasicYearDateTimeField.java:83)
	at org.joda.time.chrono.BasicYearDateTimeField.addWrapField(BasicYearDateTimeField.java:79)
	at org.joda.time.chrono.ZonedChronology$ZonedDateTimeField.addWrapField(ZonedChronology.java:475)
	at org.joda.time.DateTime$Property.addWrapFieldToCopy(DateTime.java:2203)
	at org.joda.time.TestDateTime_Properties.testPropertyAddWrapFieldYear(TestDateTime_Properties.java:281)

testPropertyAddWrapFieldDayOfMonth(org.joda.time.TestDateTime_Properties)  Time elapsed: 0.001 sec  <<< FAILURE!
junit.framework.ComparisonFailure: expected:<2004-06-2[7]T00:00:00.000+01:00> but was:<2004-06-2[5]T00:00:00.000+01:00>
	at junit.framework.Assert.assertEquals(Assert.java:81)
	at junit.framework.Assert.assertEquals(Assert.java:87)
	at org.joda.time.TestDateTime_Properties.testPropertyAddWrapFieldDayOfMonth(TestDateTime_Properties.java:601)

testPropertyAddWrapFieldDayOfYear(org.joda.time.TestDateTime_Properties)  Time elapsed: 0.001 sec  <<< FAILURE!
junit.framework.ComparisonFailure: expected:<2004-12-[31]T00:00:00.000Z> but was:<2004-12-[29]T00:00:00.000Z>
	at junit.framework.Assert.assertEquals(Assert.java:81)
	at junit.framework.Assert.assertEquals(Assert.java:87)
	at org.joda.time.TestDateTime_Properties.testPropertyAddWrapFieldDayOfYear(TestDateTime_Properties.java:777)

testPropertyAddWrapFieldToCopyMonth(org.joda.time.TestLocalDateTime_Properties)  Time elapsed: 0.001 sec  <<< FAILURE!
junit.framework.AssertionFailedError: expected:<10> but was:<8>
	at junit.framework.Assert.fail(Assert.java:47)
	at junit.framework.Assert.failNotEquals(Assert.java:280)
	at junit.framework.Assert.assertEquals(Assert.java:64)
	at junit.framework.Assert.assertEquals(Assert.java:198)
	at junit.framework.Assert.assertEquals(Assert.java:204)
	at org.joda.time.TestLocalDateTime_Properties.check(TestLocalDateTime_Properties.java:1077)
	at org.joda.time.TestLocalDateTime_Properties.testPropertyAddWrapFieldToCopyMonth(TestLocalDateTime_Properties.java:267)

testPropertyAddWrapFieldToCopyDay(org.joda.time.TestLocalDateTime_Properties)  Time elapsed: 0 sec  <<< FAILURE!
junit.framework.AssertionFailedError: expected:<27> but was:<25>
	at junit.framework.Assert.fail(Assert.java:47)
	at junit.framework.Assert.failNotEquals(Assert.java:280)
	at junit.framework.Assert.assertEquals(Assert.java:64)
	at junit.framework.Assert.assertEquals(Assert.java:198)
	at junit.framework.Assert.assertEquals(Assert.java:204)
	at org.joda.time.TestLocalDateTime_Properties.check(TestLocalDateTime_Properties.java:1078)
	at org.joda.time.TestLocalDateTime_Properties.testPropertyAddWrapFieldToCopyDay(TestLocalDateTime_Properties.java:421)

testPropertyAddWrapFieldToCopyYear(org.joda.time.TestLocalDateTime_Properties)  Time elapsed: 0.001 sec  <<< ERROR!
org.joda.time.IllegalFieldValueException: Value 876829101 for year must be in the range [-292275054,292278993]
	at org.joda.time.field.FieldUtils.verifyValueBounds(FieldUtils.java:46)
	at org.joda.time.chrono.BasicYearDateTimeField.set(BasicYearDateTimeField.java:83)
	at org.joda.time.chrono.BasicYearDateTimeField.addWrapField(BasicYearDateTimeField.java:79)
	at org.joda.time.LocalDateTime$Property.addWrapFieldToCopy(LocalDateTime.java:2262)
	at org.joda.time.TestLocalDateTime_Properties.testPropertyAddWrapFieldToCopyYear(TestLocalDateTime_Properties.java:157)

testPropertyAddWrapFieldToCopyMonth(org.joda.time.TestLocalDate_Properties)  Time elapsed: 0 sec  <<< FAILURE!
junit.framework.AssertionFailedError: expected:<10> but was:<8>
	at junit.framework.Assert.fail(Assert.java:47)
	at junit.framework.Assert.failNotEquals(Assert.java:280)
	at junit.framework.Assert.assertEquals(Assert.java:64)
	at junit.framework.Assert.assertEquals(Assert.java:198)
	at junit.framework.Assert.assertEquals(Assert.java:204)
	at org.joda.time.TestLocalDate_Properties.check(TestLocalDate_Properties.java:552)
	at org.joda.time.TestLocalDate_Properties.testPropertyAddWrapFieldToCopyMonth(TestLocalDate_Properties.java:262)

testPropertyAddWrapFieldToCopyDay(org.joda.time.TestLocalDate_Properties)  Time elapsed: 0 sec  <<< FAILURE!
junit.framework.AssertionFailedError: expected:<27> but was:<25>
	at junit.framework.Assert.fail(Assert.java:47)
	at junit.framework.Assert.failNotEquals(Assert.java:280)
	at junit.framework.Assert.assertEquals(Assert.java:64)
	at junit.framework.Assert.assertEquals(Assert.java:198)
	at junit.framework.Assert.assertEquals(Assert.java:204)
	at org.joda.time.TestLocalDate_Properties.check(TestLocalDate_Properties.java:553)
	at org.joda.time.TestLocalDate_Properties.testPropertyAddWrapFieldToCopyDay(TestLocalDate_Properties.java:416)

testPropertyAddWrapFieldToCopyYear(org.joda.time.TestLocalDate_Properties)  Time elapsed: 0.001 sec  <<< ERROR!
org.joda.time.IllegalFieldValueException: Value 876829101 for year must be in the range [-292275054,292278993]
	at org.joda.time.field.FieldUtils.verifyValueBounds(FieldUtils.java:46)
	at org.joda.time.chrono.BasicYearDateTimeField.set(BasicYearDateTimeField.java:83)
	at org.joda.time.chrono.BasicYearDateTimeField.addWrapField(BasicYearDateTimeField.java:79)
	at org.joda.time.LocalDate$Property.addWrapFieldToCopy(LocalDate.java:1993)
	at org.joda.time.TestLocalDate_Properties.testPropertyAddWrapFieldToCopyYear(TestLocalDate_Properties.java:152)

testPropertyAddWrapFieldYear(org.joda.time.TestYearMonthDay_Properties)  Time elapsed: 0.002 sec  <<< ERROR!
org.joda.time.IllegalFieldValueException: Value 876829101 for year must be in the range [-292275054,292278993]
	at org.joda.time.field.FieldUtils.verifyValueBounds(FieldUtils.java:46)
	at org.joda.time.field.BaseDateTimeField.set(BaseDateTimeField.java:585)
	at org.joda.time.field.BaseDateTimeField.addWrapField(BaseDateTimeField.java:498)
	at org.joda.time.YearMonthDay$Property.addWrapFieldToCopy(YearMonthDay.java:1035)
	at org.joda.time.TestYearMonthDay_Properties.testPropertyAddWrapFieldYear(TestYearMonthDay_Properties.java:154)

testPropertyAddWrapFieldMonth(org.joda.time.TestYearMonthDay_Properties)  Time elapsed: 0 sec  <<< FAILURE!
junit.framework.AssertionFailedError: expected:<10> but was:<8>
	at junit.framework.Assert.fail(Assert.java:47)
	at junit.framework.Assert.failNotEquals(Assert.java:280)
	at junit.framework.Assert.assertEquals(Assert.java:64)
	at junit.framework.Assert.assertEquals(Assert.java:198)
	at junit.framework.Assert.assertEquals(Assert.java:204)
	at org.joda.time.TestYearMonthDay_Properties.check(TestYearMonthDay_Properties.java:556)
	at org.joda.time.TestYearMonthDay_Properties.testPropertyAddWrapFieldMonth(TestYearMonthDay_Properties.java:265)

testPropertyAddWrapFieldDay(org.joda.time.TestYearMonthDay_Properties)  Time elapsed: 0.001 sec  <<< FAILURE!
junit.framework.AssertionFailedError: expected:<27> but was:<25>
	at junit.framework.Assert.fail(Assert.java:47)
	at junit.framework.Assert.failNotEquals(Assert.java:280)
	at junit.framework.Assert.assertEquals(Assert.java:64)
	at junit.framework.Assert.assertEquals(Assert.java:198)
	at junit.framework.Assert.assertEquals(Assert.java:204)
	at org.joda.time.TestYearMonthDay_Properties.check(TestYearMonthDay_Properties.java:557)
	at org.joda.time.TestYearMonthDay_Properties.testPropertyAddWrapFieldDay(TestYearMonthDay_Properties.java:420)

testPropertyAddWrapFieldYear(org.joda.time.TestYearMonth_Properties)  Time elapsed: 0.001 sec  <<< ERROR!
org.joda.time.IllegalFieldValueException: Value 876829101 for year must be in the range [-292275054,292278993]
	at org.joda.time.field.FieldUtils.verifyValueBounds(FieldUtils.java:46)
	at org.joda.time.field.BaseDateTimeField.set(BaseDateTimeField.java:585)
	at org.joda.time.field.BaseDateTimeField.addWrapField(BaseDateTimeField.java:498)
	at org.joda.time.YearMonth$Property.addWrapFieldToCopy(YearMonth.java:938)
	at org.joda.time.TestYearMonth_Properties.testPropertyAddWrapFieldYear(TestYearMonth_Properties.java:153)

testPropertyAddWrapFieldMonth(org.joda.time.TestYearMonth_Properties)  Time elapsed: 0.001 sec  <<< FAILURE!
junit.framework.AssertionFailedError: expected:<10> but was:<8>
	at junit.framework.Assert.fail(Assert.java:47)
	at junit.framework.Assert.failNotEquals(Assert.java:280)
	at junit.framework.Assert.assertEquals(Assert.java:64)
	at junit.framework.Assert.assertEquals(Assert.java:198)
	at junit.framework.Assert.assertEquals(Assert.java:204)
	at org.joda.time.TestYearMonth_Properties.check(TestYearMonth_Properties.java:364)
	at org.joda.time.TestYearMonth_Properties.testPropertyAddWrapFieldMonth(TestYearMonth_Properties.java:250)

testPropertyAddWrapFieldMonthOfYear(org.joda.time.TestMonthDay_Properties)  Time elapsed: 0.001 sec  <<< FAILURE!
junit.framework.AssertionFailedError: expected:<6> but was:<4>
	at junit.framework.Assert.fail(Assert.java:47)
	at junit.framework.Assert.failNotEquals(Assert.java:280)
	at junit.framework.Assert.assertEquals(Assert.java:64)
	at junit.framework.Assert.assertEquals(Assert.java:198)
	at junit.framework.Assert.assertEquals(Assert.java:204)
	at org.joda.time.TestMonthDay_Properties.check(TestMonthDay_Properties.java:345)
	at org.joda.time.TestMonthDay_Properties.testPropertyAddWrapFieldMonthOfYear(TestMonthDay_Properties.java:136)

testPropertyAddWrapFieldDayOfMonth(org.joda.time.TestMonthDay_Properties)  Time elapsed: 0 sec  <<< FAILURE!
junit.framework.AssertionFailedError: expected:<28> but was:<26>
	at junit.framework.Assert.fail(Assert.java:47)
	at junit.framework.Assert.failNotEquals(Assert.java:280)
	at junit.framework.Assert.assertEquals(Assert.java:64)
	at junit.framework.Assert.assertEquals(Assert.java:198)
	at junit.framework.Assert.assertEquals(Assert.java:204)
	at org.joda.time.TestMonthDay_Properties.check(TestMonthDay_Properties.java:346)
	at org.joda.time.TestMonthDay_Properties.testPropertyAddWrapFieldDayOfMonth(TestMonthDay_Properties.java:232)

testChronology(org.joda.time.chrono.gj.MainTest)  Time elapsed: 0.003 sec  <<< FAILURE!
junit.framework.AssertionFailedError: Value 0 for monthOfYear must be in the range [1,12]
	at junit.framework.Assert.fail(Assert.java:47)
	at org.joda.time.chrono.gj.MainTest.testChronology(MainTest.java:158)

testChronology(org.joda.time.chrono.gj.MainTest)  Time elapsed: 0.002 sec  <<< FAILURE!
junit.framework.AssertionFailedError: Value 0 for monthOfYear must be in the range [1,12]
	at junit.framework.Assert.fail(Assert.java:47)
	at org.joda.time.chrono.gj.MainTest.testChronology(MainTest.java:158)


Results :

Failed tests: 
  org.joda.time.TestDateTime_Properties#testPropertyAddWrapFieldDayOfMonth ComparisonFailure
  org.joda.time.TestDateTime_Properties#testPropertyAddWrapFieldDayOfWeek ComparisonFailure
  org.joda.time.TestDateTime_Properties#testPropertyAddWrapFieldDayOfYear ComparisonFailure
  org.joda.time.TestDateTime_Properties#testPropertyAddWrapFieldMonthOfYear ComparisonFailure
  org.joda.time.TestLocalDateTime_Properties#testPropertyAddWrapFieldToCopyDay AssertionFailedError
  org.joda.time.TestLocalDateTime_Properties#testPropertyAddWrapFieldToCopyMonth AssertionFailedError
  org.joda.time.TestLocalDate_Properties#testPropertyAddWrapFieldToCopyDay AssertionFailedError
  org.joda.time.TestLocalDate_Properties#testPropertyAddWrapFieldToCopyMonth AssertionFailedError
  org.joda.time.TestMonthDay_Properties#testPropertyAddWrapFieldDayOfMonth AssertionFailedError
  org.joda.time.TestMonthDay_Properties#testPropertyAddWrapFieldMonthOfYear AssertionFailedError
  org.joda.time.TestYearMonthDay_Properties#testPropertyAddWrapFieldDay AssertionFailedError
  org.joda.time.TestYearMonthDay_Properties#testPropertyAddWrapFieldMonth AssertionFailedError
  org.joda.time.TestYearMonth_Properties#testPropertyAddWrapFieldMonth AssertionFailedError
org.joda.time.chrono.gj.MainTest.testChronology(org.joda.time.chrono.gj.MainTest)
  Run 1: org.joda.time.chrono.gj.MainTest#testChronology AssertionFailedError Value 0 f...
  Run 2: org.joda.time.chrono.gj.MainTest#testChronology AssertionFailedError Value 0 f...

Tests in error: 
  org.joda.time.TestDateTime_Properties#testPropertyAddWrapFieldYear IllegalFieldValueException
  org.joda.time.TestLocalDateTime_Properties#testPropertyAddWrapFieldToCopyYear IllegalFieldValueException
  org.joda.time.TestLocalDate_Properties#testPropertyAddWrapFieldToCopyYear IllegalFieldValueException
  org.joda.time.TestYearMonthDay_Properties#testPropertyAddWrapFieldYear IllegalFieldValueException
  org.joda.time.TestYearMonth_Properties#testPropertyAddWrapFieldYear IllegalFieldValueException

Tests run: 4156, Failures: 14, Errors: 5, Skipped: 0

[INFO] ------------------------------------------------------------------------
[INFO] BUILD FAILURE
[INFO] ------------------------------------------------------------------------
[INFO] Total time: 14.926s
[INFO] Finished at: Thu Aug 06 04:33:14 BST 2015
[INFO] Final Memory: 9M/213M
[INFO] ------------------------------------------------------------------------
[ERROR] Failed to execute goal org.apache.maven.plugins:maven-surefire-plugin:2.18.1:test (default-test) on project joda-time: There are test failures.
[ERROR] 
[ERROR] Please refer to /home/perham/Study/LittleDarwin/Cases/joda-time-2.8.1/target/surefire-reports for the individual test results.
[ERROR] -> [Help 1]
[ERROR] 
[ERROR] To see the full stack trace of the errors, re-run Maven with the -e switch.
[ERROR] Re-run Maven using the -X switch to enable full debug logging.
[ERROR] 
[ERROR] For more information about the errors and possible solutions, please read the following articles:
[ERROR] [Help 1] http://cwiki.apache.org/confluence/display/MAVEN/MojoFailureException
