[INFO] Scanning for projects...
[INFO]                                                                         
[INFO] ------------------------------------------------------------------------
[INFO] Building Joda-Time 2.8.1
[INFO] ------------------------------------------------------------------------
[INFO] 
[INFO] --- maven-resources-plugin:2.7:resources (default-resources) @ joda-time ---
[INFO] Using 'UTF-8' encoding to copy filtered resources.
[INFO] Copying 2 resources to META-INF
[INFO] Copying 10 resources
[INFO] 
[INFO] --- maven-compiler-plugin:3.3:compile (default-compile) @ joda-time ---
[INFO] Changes detected - recompiling the module!
[INFO] Compiling 166 source files to /home/perham/Study/LittleDarwin/Cases/joda-time-2.8.1/target/classes
[INFO] 
[INFO] --- exec-maven-plugin:1.4.0:java (compile-tzdb) @ joda-time ---
Writing zoneinfo files
Writing ZoneInfoMap
[INFO] 
[INFO] --- maven-resources-plugin:2.7:testResources (default-testResources) @ joda-time ---
[INFO] Using 'UTF-8' encoding to copy filtered resources.
[INFO] Copying 34 resources
[INFO] 
[INFO] --- maven-compiler-plugin:3.3:testCompile (default-testCompile) @ joda-time ---
[INFO] Nothing to compile - all classes are up to date
[INFO] 
[INFO] --- maven-surefire-plugin:2.18.1:test (default-test) @ joda-time ---
[INFO] Surefire report directory: /home/perham/Study/LittleDarwin/Cases/joda-time-2.8.1/target/surefire-reports

-------------------------------------------------------
 T E S T S
-------------------------------------------------------
Running org.joda.time.TestAllPackages

TestBuddhistChronology.testCalendar

TestCopticChronology.testCalendar

TestEthiopicChronology.testCalendar

TestIslamicChronology.testCalendar

Testing Gregorian chronology over 1000 iterations
Failure index: 0
Test millis: -308262625532
Test value: -49
Test millis2: -46922557997542

Testing Julian chronology over 1000 iterations
Failure index: 0
Test millis: -308262625532
Test value: -49
Test millis2: -46922557997542
Writing zoneinfo files
Writing ZoneInfoMap
Tests run: 4157, Failures: 10, Errors: 24, Skipped: 0, Time elapsed: 4.821 sec <<< FAILURE! - in org.joda.time.TestAllPackages
testPropertyAddWrapFieldDayOfMonth(org.joda.time.TestDateTime_Properties)  Time elapsed: 0.004 sec  <<< ERROR!
org.joda.time.IllegalFieldValueException: Value 35 for dayOfMonth must be in the range [1,30]
	at org.joda.time.field.FieldUtils.verifyValueBounds(FieldUtils.java:46)
	at org.joda.time.field.PreciseDurationDateTimeField.set(PreciseDurationDateTimeField.java:79)
	at org.joda.time.field.BaseDateTimeField.addWrapField(BaseDateTimeField.java:464)
	at org.joda.time.chrono.ZonedChronology$ZonedDateTimeField.addWrapField(ZonedChronology.java:475)
	at org.joda.time.DateTime$Property.addWrapFieldToCopy(DateTime.java:2203)
	at org.joda.time.TestDateTime_Properties.testPropertyAddWrapFieldDayOfMonth(TestDateTime_Properties.java:600)

testPropertyAddWrapFieldDayOfWeek(org.joda.time.TestDateTime_Properties)  Time elapsed: 0.002 sec  <<< ERROR!
org.joda.time.IllegalFieldValueException: Value 9 for dayOfWeek must be in the range [1,7]
	at org.joda.time.field.FieldUtils.verifyValueBounds(FieldUtils.java:46)
	at org.joda.time.field.PreciseDurationDateTimeField.set(PreciseDurationDateTimeField.java:79)
	at org.joda.time.field.BaseDateTimeField.addWrapField(BaseDateTimeField.java:464)
	at org.joda.time.chrono.ZonedChronology$ZonedDateTimeField.addWrapField(ZonedChronology.java:475)
	at org.joda.time.DateTime$Property.addWrapFieldToCopy(DateTime.java:2203)
	at org.joda.time.TestDateTime_Properties.testPropertyAddWrapFieldDayOfWeek(TestDateTime_Properties.java:1030)

testPropertyAddWrapFieldDayOfYear(org.joda.time.TestDateTime_Properties)  Time elapsed: 0.001 sec  <<< ERROR!
org.joda.time.IllegalFieldValueException: Value 368 for dayOfYear must be in the range [1,366]
	at org.joda.time.field.FieldUtils.verifyValueBounds(FieldUtils.java:46)
	at org.joda.time.field.PreciseDurationDateTimeField.set(PreciseDurationDateTimeField.java:79)
	at org.joda.time.field.BaseDateTimeField.addWrapField(BaseDateTimeField.java:464)
	at org.joda.time.chrono.ZonedChronology$ZonedDateTimeField.addWrapField(ZonedChronology.java:475)
	at org.joda.time.DateTime$Property.addWrapFieldToCopy(DateTime.java:2203)
	at org.joda.time.TestDateTime_Properties.testPropertyAddWrapFieldDayOfYear(TestDateTime_Properties.java:776)

testPropertyAddWrapFieldYear(org.joda.time.TestDateTime_Properties)  Time elapsed: 0.001 sec  <<< ERROR!
org.joda.time.IllegalFieldValueException: Value 292278995 for year must be in the range [-292275054,292278993]
	at org.joda.time.field.FieldUtils.verifyValueBounds(FieldUtils.java:46)
	at org.joda.time.chrono.BasicYearDateTimeField.set(BasicYearDateTimeField.java:83)
	at org.joda.time.chrono.BasicYearDateTimeField.addWrapField(BasicYearDateTimeField.java:79)
	at org.joda.time.chrono.ZonedChronology$ZonedDateTimeField.addWrapField(ZonedChronology.java:475)
	at org.joda.time.DateTime$Property.addWrapFieldToCopy(DateTime.java:2203)
	at org.joda.time.TestDateTime_Properties.testPropertyAddWrapFieldYear(TestDateTime_Properties.java:281)

testPropertyAddWrapFieldMonthOfYear(org.joda.time.TestDateTime_Properties)  Time elapsed: 0 sec  <<< ERROR!
org.joda.time.IllegalFieldValueException: Value 16 for monthOfYear must be in the range [1,12]
	at org.joda.time.field.FieldUtils.verifyValueBounds(FieldUtils.java:46)
	at org.joda.time.chrono.BasicMonthOfYearDateTimeField.set(BasicMonthOfYearDateTimeField.java:299)
	at org.joda.time.chrono.BasicMonthOfYearDateTimeField.addWrapField(BasicMonthOfYearDateTimeField.java:239)
	at org.joda.time.chrono.ZonedChronology$ZonedDateTimeField.addWrapField(ZonedChronology.java:475)
	at org.joda.time.DateTime$Property.addWrapFieldToCopy(DateTime.java:2203)
	at org.joda.time.TestDateTime_Properties.testPropertyAddWrapFieldMonthOfYear(TestDateTime_Properties.java:437)

testPropertyAddWrapFieldToCopyYear(org.joda.time.TestLocalDateTime_Properties)  Time elapsed: 0.001 sec  <<< ERROR!
org.joda.time.IllegalFieldValueException: Value 292278995 for year must be in the range [-292275054,292278993]
	at org.joda.time.field.FieldUtils.verifyValueBounds(FieldUtils.java:46)
	at org.joda.time.chrono.BasicYearDateTimeField.set(BasicYearDateTimeField.java:83)
	at org.joda.time.chrono.BasicYearDateTimeField.addWrapField(BasicYearDateTimeField.java:79)
	at org.joda.time.LocalDateTime$Property.addWrapFieldToCopy(LocalDateTime.java:2262)
	at org.joda.time.TestLocalDateTime_Properties.testPropertyAddWrapFieldToCopyYear(TestLocalDateTime_Properties.java:157)

testPropertyAddWrapFieldToCopyDay(org.joda.time.TestLocalDateTime_Properties)  Time elapsed: 0.001 sec  <<< ERROR!
org.joda.time.IllegalFieldValueException: Value 35 for dayOfMonth must be in the range [1,30]
	at org.joda.time.field.FieldUtils.verifyValueBounds(FieldUtils.java:46)
	at org.joda.time.field.PreciseDurationDateTimeField.set(PreciseDurationDateTimeField.java:79)
	at org.joda.time.field.BaseDateTimeField.addWrapField(BaseDateTimeField.java:464)
	at org.joda.time.LocalDateTime$Property.addWrapFieldToCopy(LocalDateTime.java:2262)
	at org.joda.time.TestLocalDateTime_Properties.testPropertyAddWrapFieldToCopyDay(TestLocalDateTime_Properties.java:420)

testPropertyAddWrapFieldToCopyHour(org.joda.time.TestLocalDateTime_Properties)  Time elapsed: 0.001 sec  <<< FAILURE!
junit.framework.AssertionFailedError: expected:<9> but was:<10>
	at junit.framework.Assert.fail(Assert.java:47)
	at junit.framework.Assert.failNotEquals(Assert.java:280)
	at junit.framework.Assert.assertEquals(Assert.java:64)
	at junit.framework.Assert.assertEquals(Assert.java:198)
	at junit.framework.Assert.assertEquals(Assert.java:204)
	at org.joda.time.TestLocalDateTime_Properties.check(TestLocalDateTime_Properties.java:1078)
	at org.joda.time.TestLocalDateTime_Properties.testPropertyAddWrapFieldToCopyHour(TestLocalDateTime_Properties.java:628)

testPropertyAddWrapFieldToCopyMinute(org.joda.time.TestLocalDateTime_Properties)  Time elapsed: 0 sec  <<< FAILURE!
junit.framework.AssertionFailedError: expected:<10> but was:<11>
	at junit.framework.Assert.fail(Assert.java:47)
	at junit.framework.Assert.failNotEquals(Assert.java:280)
	at junit.framework.Assert.assertEquals(Assert.java:64)
	at junit.framework.Assert.assertEquals(Assert.java:198)
	at junit.framework.Assert.assertEquals(Assert.java:204)
	at org.joda.time.TestLocalDateTime_Properties.check(TestLocalDateTime_Properties.java:1079)
	at org.joda.time.TestLocalDateTime_Properties.testPropertyAddWrapFieldToCopyMinute(TestLocalDateTime_Properties.java:773)

testPropertyAddWrapFieldToCopyMonth(org.joda.time.TestLocalDateTime_Properties)  Time elapsed: 0 sec  <<< ERROR!
org.joda.time.IllegalFieldValueException: Value 16 for monthOfYear must be in the range [1,12]
	at org.joda.time.field.FieldUtils.verifyValueBounds(FieldUtils.java:46)
	at org.joda.time.chrono.BasicMonthOfYearDateTimeField.set(BasicMonthOfYearDateTimeField.java:299)
	at org.joda.time.chrono.BasicMonthOfYearDateTimeField.addWrapField(BasicMonthOfYearDateTimeField.java:239)
	at org.joda.time.LocalDateTime$Property.addWrapFieldToCopy(LocalDateTime.java:2262)
	at org.joda.time.TestLocalDateTime_Properties.testPropertyAddWrapFieldToCopyMonth(TestLocalDateTime_Properties.java:266)

testPropertyAddWrapFieldToCopySecond(org.joda.time.TestLocalDateTime_Properties)  Time elapsed: 0.001 sec  <<< FAILURE!
junit.framework.AssertionFailedError: expected:<20> but was:<21>
	at junit.framework.Assert.fail(Assert.java:47)
	at junit.framework.Assert.failNotEquals(Assert.java:280)
	at junit.framework.Assert.assertEquals(Assert.java:64)
	at junit.framework.Assert.assertEquals(Assert.java:198)
	at junit.framework.Assert.assertEquals(Assert.java:204)
	at org.joda.time.TestLocalDateTime_Properties.check(TestLocalDateTime_Properties.java:1080)
	at org.joda.time.TestLocalDateTime_Properties.testPropertyAddWrapFieldToCopySecond(TestLocalDateTime_Properties.java:901)

testPropertyAddWrapFieldToCopyMilli(org.joda.time.TestLocalDateTime_Properties)  Time elapsed: 0 sec  <<< FAILURE!
junit.framework.AssertionFailedError: expected:<30> but was:<31>
	at junit.framework.Assert.fail(Assert.java:47)
	at junit.framework.Assert.failNotEquals(Assert.java:280)
	at junit.framework.Assert.assertEquals(Assert.java:64)
	at junit.framework.Assert.assertEquals(Assert.java:198)
	at junit.framework.Assert.assertEquals(Assert.java:204)
	at org.joda.time.TestLocalDateTime_Properties.check(TestLocalDateTime_Properties.java:1081)
	at org.joda.time.TestLocalDateTime_Properties.testPropertyAddWrapFieldToCopyMilli(TestLocalDateTime_Properties.java:1026)

testPropertyAddWrapFieldToCopyYear(org.joda.time.TestLocalDate_Properties)  Time elapsed: 0 sec  <<< ERROR!
org.joda.time.IllegalFieldValueException: Value 292278995 for year must be in the range [-292275054,292278993]
	at org.joda.time.field.FieldUtils.verifyValueBounds(FieldUtils.java:46)
	at org.joda.time.chrono.BasicYearDateTimeField.set(BasicYearDateTimeField.java:83)
	at org.joda.time.chrono.BasicYearDateTimeField.addWrapField(BasicYearDateTimeField.java:79)
	at org.joda.time.LocalDate$Property.addWrapFieldToCopy(LocalDate.java:1993)
	at org.joda.time.TestLocalDate_Properties.testPropertyAddWrapFieldToCopyYear(TestLocalDate_Properties.java:152)

testPropertyAddWrapFieldToCopyDay(org.joda.time.TestLocalDate_Properties)  Time elapsed: 0 sec  <<< ERROR!
org.joda.time.IllegalFieldValueException: Value 35 for dayOfMonth must be in the range [1,30]
	at org.joda.time.field.FieldUtils.verifyValueBounds(FieldUtils.java:46)
	at org.joda.time.field.PreciseDurationDateTimeField.set(PreciseDurationDateTimeField.java:79)
	at org.joda.time.field.BaseDateTimeField.addWrapField(BaseDateTimeField.java:464)
	at org.joda.time.LocalDate$Property.addWrapFieldToCopy(LocalDate.java:1993)
	at org.joda.time.TestLocalDate_Properties.testPropertyAddWrapFieldToCopyDay(TestLocalDate_Properties.java:415)

testPropertyAddWrapFieldToCopyMonth(org.joda.time.TestLocalDate_Properties)  Time elapsed: 0.001 sec  <<< ERROR!
org.joda.time.IllegalFieldValueException: Value 16 for monthOfYear must be in the range [1,12]
	at org.joda.time.field.FieldUtils.verifyValueBounds(FieldUtils.java:46)
	at org.joda.time.chrono.BasicMonthOfYearDateTimeField.set(BasicMonthOfYearDateTimeField.java:299)
	at org.joda.time.chrono.BasicMonthOfYearDateTimeField.addWrapField(BasicMonthOfYearDateTimeField.java:239)
	at org.joda.time.LocalDate$Property.addWrapFieldToCopy(LocalDate.java:1993)
	at org.joda.time.TestLocalDate_Properties.testPropertyAddWrapFieldToCopyMonth(TestLocalDate_Properties.java:261)

testPropertyPlusWrapFieldHour(org.joda.time.TestLocalTime_Properties)  Time elapsed: 0.001 sec  <<< FAILURE!
junit.framework.AssertionFailedError: expected:<19> but was:<5>
	at junit.framework.Assert.fail(Assert.java:47)
	at junit.framework.Assert.failNotEquals(Assert.java:280)
	at junit.framework.Assert.assertEquals(Assert.java:64)
	at junit.framework.Assert.assertEquals(Assert.java:198)
	at junit.framework.Assert.assertEquals(Assert.java:204)
	at org.joda.time.TestLocalTime_Properties.check(TestLocalTime_Properties.java:780)
	at org.joda.time.TestLocalTime_Properties.testPropertyPlusWrapFieldHour(TestLocalTime_Properties.java:203)

testPropertyPlusWrapFieldMinute(org.joda.time.TestLocalTime_Properties)  Time elapsed: 0 sec  <<< FAILURE!
junit.framework.AssertionFailedError: expected:<10> but was:<11>
	at junit.framework.Assert.fail(Assert.java:47)
	at junit.framework.Assert.failNotEquals(Assert.java:280)
	at junit.framework.Assert.assertEquals(Assert.java:64)
	at junit.framework.Assert.assertEquals(Assert.java:198)
	at junit.framework.Assert.assertEquals(Assert.java:204)
	at org.joda.time.TestLocalTime_Properties.check(TestLocalTime_Properties.java:780)
	at org.joda.time.TestLocalTime_Properties.testPropertyPlusWrapFieldMinute(TestLocalTime_Properties.java:394)

testPropertyPlusWrapFieldSecond(org.joda.time.TestLocalTime_Properties)  Time elapsed: 0.001 sec  <<< FAILURE!
junit.framework.AssertionFailedError: expected:<20> but was:<21>
	at junit.framework.Assert.fail(Assert.java:47)
	at junit.framework.Assert.failNotEquals(Assert.java:280)
	at junit.framework.Assert.assertEquals(Assert.java:64)
	at junit.framework.Assert.assertEquals(Assert.java:198)
	at junit.framework.Assert.assertEquals(Assert.java:204)
	at org.joda.time.TestLocalTime_Properties.check(TestLocalTime_Properties.java:781)
	at org.joda.time.TestLocalTime_Properties.testPropertyPlusWrapFieldSecond(TestLocalTime_Properties.java:565)

testPropertyPlusWrapFieldMilli(org.joda.time.TestLocalTime_Properties)  Time elapsed: 0.001 sec  <<< FAILURE!
junit.framework.AssertionFailedError: expected:<30> but was:<31>
	at junit.framework.Assert.fail(Assert.java:47)
	at junit.framework.Assert.failNotEquals(Assert.java:280)
	at junit.framework.Assert.assertEquals(Assert.java:64)
	at junit.framework.Assert.assertEquals(Assert.java:198)
	at junit.framework.Assert.assertEquals(Assert.java:204)
	at org.joda.time.TestLocalTime_Properties.check(TestLocalTime_Properties.java:782)
	at org.joda.time.TestLocalTime_Properties.testPropertyPlusWrapFieldMilli(TestLocalTime_Properties.java:730)

testPropertyAddWrapFieldHour(org.joda.time.TestTimeOfDay_Properties)  Time elapsed: 0.001 sec  <<< ERROR!
org.joda.time.IllegalFieldValueException: Value 29 for hourOfDay must be in the range [0,23]
	at org.joda.time.field.FieldUtils.verifyValueBounds(FieldUtils.java:46)
	at org.joda.time.field.BaseDateTimeField.set(BaseDateTimeField.java:585)
	at org.joda.time.field.BaseDateTimeField.addWrapField(BaseDateTimeField.java:498)
	at org.joda.time.TimeOfDay$Property.addWrapFieldToCopy(TimeOfDay.java:1148)
	at org.joda.time.TestTimeOfDay_Properties.testPropertyAddWrapFieldHour(TestTimeOfDay_Properties.java:168)

testPropertyAddWrapFieldMinute(org.joda.time.TestTimeOfDay_Properties)  Time elapsed: 0.001 sec  <<< ERROR!
org.joda.time.IllegalFieldValueException: Value 87 for minuteOfHour must be in the range [0,59]
	at org.joda.time.field.FieldUtils.verifyValueBounds(FieldUtils.java:46)
	at org.joda.time.field.BaseDateTimeField.set(BaseDateTimeField.java:585)
	at org.joda.time.field.BaseDateTimeField.addWrapField(BaseDateTimeField.java:498)
	at org.joda.time.TimeOfDay$Property.addWrapFieldToCopy(TimeOfDay.java:1148)
	at org.joda.time.TestTimeOfDay_Properties.testPropertyAddWrapFieldMinute(TestTimeOfDay_Properties.java:354)

testPropertyAddWrapFieldSecond(org.joda.time.TestTimeOfDay_Properties)  Time elapsed: 0 sec  <<< ERROR!
org.joda.time.IllegalFieldValueException: Value 77 for secondOfMinute must be in the range [0,59]
	at org.joda.time.field.FieldUtils.verifyValueBounds(FieldUtils.java:46)
	at org.joda.time.field.BaseDateTimeField.set(BaseDateTimeField.java:585)
	at org.joda.time.field.BaseDateTimeField.addWrapField(BaseDateTimeField.java:498)
	at org.joda.time.TimeOfDay$Property.addWrapFieldToCopy(TimeOfDay.java:1148)
	at org.joda.time.TestTimeOfDay_Properties.testPropertyAddWrapFieldSecond(TestTimeOfDay_Properties.java:520)

testPropertyAddWrapFieldMilli(org.joda.time.TestTimeOfDay_Properties)  Time elapsed: 0.001 sec  <<< ERROR!
org.joda.time.IllegalFieldValueException: Value 1007 for millisOfSecond must be in the range [0,999]
	at org.joda.time.field.FieldUtils.verifyValueBounds(FieldUtils.java:46)
	at org.joda.time.field.BaseDateTimeField.set(BaseDateTimeField.java:585)
	at org.joda.time.field.BaseDateTimeField.addWrapField(BaseDateTimeField.java:498)
	at org.joda.time.TimeOfDay$Property.addWrapFieldToCopy(TimeOfDay.java:1148)
	at org.joda.time.TestTimeOfDay_Properties.testPropertyAddWrapFieldMilli(TestTimeOfDay_Properties.java:680)

testPropertyAddWrapFieldYear(org.joda.time.TestYearMonthDay_Properties)  Time elapsed: 0.001 sec  <<< ERROR!
org.joda.time.IllegalFieldValueException: Value 292278995 for year must be in the range [-292275054,292278993]
	at org.joda.time.field.FieldUtils.verifyValueBounds(FieldUtils.java:46)
	at org.joda.time.field.BaseDateTimeField.set(BaseDateTimeField.java:585)
	at org.joda.time.field.BaseDateTimeField.addWrapField(BaseDateTimeField.java:498)
	at org.joda.time.YearMonthDay$Property.addWrapFieldToCopy(YearMonthDay.java:1035)
	at org.joda.time.TestYearMonthDay_Properties.testPropertyAddWrapFieldYear(TestYearMonthDay_Properties.java:154)

testPropertyAddWrapFieldDay(org.joda.time.TestYearMonthDay_Properties)  Time elapsed: 0.001 sec  <<< ERROR!
org.joda.time.IllegalFieldValueException: Value 35 for dayOfMonth must be in the range [1,30]
	at org.joda.time.field.FieldUtils.verifyValueBounds(FieldUtils.java:46)
	at org.joda.time.field.BaseDateTimeField.set(BaseDateTimeField.java:585)
	at org.joda.time.field.BaseDateTimeField.addWrapField(BaseDateTimeField.java:498)
	at org.joda.time.YearMonthDay$Property.addWrapFieldToCopy(YearMonthDay.java:1035)
	at org.joda.time.TestYearMonthDay_Properties.testPropertyAddWrapFieldDay(TestYearMonthDay_Properties.java:419)

testPropertyAddWrapFieldMonth(org.joda.time.TestYearMonthDay_Properties)  Time elapsed: 0.001 sec  <<< ERROR!
org.joda.time.IllegalFieldValueException: Value 16 for monthOfYear must be in the range [1,12]
	at org.joda.time.field.FieldUtils.verifyValueBounds(FieldUtils.java:46)
	at org.joda.time.field.BaseDateTimeField.set(BaseDateTimeField.java:585)
	at org.joda.time.field.BaseDateTimeField.addWrapField(BaseDateTimeField.java:498)
	at org.joda.time.YearMonthDay$Property.addWrapFieldToCopy(YearMonthDay.java:1035)
	at org.joda.time.TestYearMonthDay_Properties.testPropertyAddWrapFieldMonth(TestYearMonthDay_Properties.java:264)

testPropertyAddWrapFieldYear(org.joda.time.TestYearMonth_Properties)  Time elapsed: 0.001 sec  <<< ERROR!
org.joda.time.IllegalFieldValueException: Value 292278995 for year must be in the range [-292275054,292278993]
	at org.joda.time.field.FieldUtils.verifyValueBounds(FieldUtils.java:46)
	at org.joda.time.field.BaseDateTimeField.set(BaseDateTimeField.java:585)
	at org.joda.time.field.BaseDateTimeField.addWrapField(BaseDateTimeField.java:498)
	at org.joda.time.YearMonth$Property.addWrapFieldToCopy(YearMonth.java:938)
	at org.joda.time.TestYearMonth_Properties.testPropertyAddWrapFieldYear(TestYearMonth_Properties.java:153)

testPropertyAddWrapFieldMonth(org.joda.time.TestYearMonth_Properties)  Time elapsed: 0 sec  <<< ERROR!
org.joda.time.IllegalFieldValueException: Value 16 for monthOfYear must be in the range [1,12]
	at org.joda.time.field.FieldUtils.verifyValueBounds(FieldUtils.java:46)
	at org.joda.time.field.BaseDateTimeField.set(BaseDateTimeField.java:585)
	at org.joda.time.field.BaseDateTimeField.addWrapField(BaseDateTimeField.java:498)
	at org.joda.time.YearMonth$Property.addWrapFieldToCopy(YearMonth.java:938)
	at org.joda.time.TestYearMonth_Properties.testPropertyAddWrapFieldMonth(TestYearMonth_Properties.java:249)

testPropertyAddWrapFieldDayOfMonth(org.joda.time.TestMonthDay_Properties)  Time elapsed: 0 sec  <<< ERROR!
org.joda.time.IllegalFieldValueException: Value 34 for dayOfMonth must be in the range [1,30]
	at org.joda.time.field.FieldUtils.verifyValueBounds(FieldUtils.java:46)
	at org.joda.time.field.BaseDateTimeField.set(BaseDateTimeField.java:585)
	at org.joda.time.field.BaseDateTimeField.addWrapField(BaseDateTimeField.java:498)
	at org.joda.time.MonthDay$Property.addWrapFieldToCopy(MonthDay.java:924)
	at org.joda.time.TestMonthDay_Properties.testPropertyAddWrapFieldDayOfMonth(TestMonthDay_Properties.java:231)

testPropertyAddWrapFieldMonthOfYear(org.joda.time.TestMonthDay_Properties)  Time elapsed: 0 sec  <<< ERROR!
org.joda.time.IllegalFieldValueException: Value 20 for monthOfYear must be in the range [1,12]
	at org.joda.time.field.FieldUtils.verifyValueBounds(FieldUtils.java:46)
	at org.joda.time.field.BaseDateTimeField.set(BaseDateTimeField.java:585)
	at org.joda.time.field.BaseDateTimeField.addWrapField(BaseDateTimeField.java:498)
	at org.joda.time.MonthDay$Property.addWrapFieldToCopy(MonthDay.java:924)
	at org.joda.time.TestMonthDay_Properties.testPropertyAddWrapFieldMonthOfYear(TestMonthDay_Properties.java:135)

testPropertyAddWrapFieldHour(org.joda.time.TestPartial_Properties)  Time elapsed: 0.001 sec  <<< ERROR!
org.joda.time.IllegalFieldValueException: Value 29 for hourOfDay must be in the range [0,23]
	at org.joda.time.field.FieldUtils.verifyValueBounds(FieldUtils.java:46)
	at org.joda.time.field.BaseDateTimeField.set(BaseDateTimeField.java:585)
	at org.joda.time.field.BaseDateTimeField.addWrapField(BaseDateTimeField.java:498)
	at org.joda.time.Partial$Property.addWrapFieldToCopy(Partial.java:949)
	at org.joda.time.TestPartial_Properties.testPropertyAddWrapFieldHour(TestPartial_Properties.java:174)

testPropertyAddWrapFieldMinute(org.joda.time.TestPartial_Properties)  Time elapsed: 0 sec  <<< ERROR!
org.joda.time.IllegalFieldValueException: Value 87 for minuteOfHour must be in the range [0,59]
	at org.joda.time.field.FieldUtils.verifyValueBounds(FieldUtils.java:46)
	at org.joda.time.field.BaseDateTimeField.set(BaseDateTimeField.java:585)
	at org.joda.time.field.BaseDateTimeField.addWrapField(BaseDateTimeField.java:498)
	at org.joda.time.Partial$Property.addWrapFieldToCopy(Partial.java:949)
	at org.joda.time.TestPartial_Properties.testPropertyAddWrapFieldMinute(TestPartial_Properties.java:360)

testChronology(org.joda.time.chrono.gj.MainTest)  Time elapsed: 0.002 sec  <<< FAILURE!
junit.framework.AssertionFailedError: Value 24 for monthOfYear must be in the range [1,12]
	at junit.framework.Assert.fail(Assert.java:47)
	at org.joda.time.chrono.gj.MainTest.testChronology(MainTest.java:158)

testChronology(org.joda.time.chrono.gj.MainTest)  Time elapsed: 0.002 sec  <<< FAILURE!
junit.framework.AssertionFailedError: Value 24 for monthOfYear must be in the range [1,12]
	at junit.framework.Assert.fail(Assert.java:47)
	at org.joda.time.chrono.gj.MainTest.testChronology(MainTest.java:158)


Results :

Failed tests: 
  org.joda.time.TestLocalDateTime_Properties#testPropertyAddWrapFieldToCopyHour AssertionFailedError
  org.joda.time.TestLocalDateTime_Properties#testPropertyAddWrapFieldToCopyMilli AssertionFailedError
  org.joda.time.TestLocalDateTime_Properties#testPropertyAddWrapFieldToCopyMinute AssertionFailedError
  org.joda.time.TestLocalDateTime_Properties#testPropertyAddWrapFieldToCopySecond AssertionFailedError
  org.joda.time.TestLocalTime_Properties#testPropertyPlusWrapFieldHour AssertionFailedError
  org.joda.time.TestLocalTime_Properties#testPropertyPlusWrapFieldMilli AssertionFailedError
  org.joda.time.TestLocalTime_Properties#testPropertyPlusWrapFieldMinute AssertionFailedError
  org.joda.time.TestLocalTime_Properties#testPropertyPlusWrapFieldSecond AssertionFailedError
org.joda.time.chrono.gj.MainTest.testChronology(org.joda.time.chrono.gj.MainTest)
  Run 1: org.joda.time.chrono.gj.MainTest#testChronology AssertionFailedError Value 24 ...
  Run 2: org.joda.time.chrono.gj.MainTest#testChronology AssertionFailedError Value 24 ...

Tests in error: 
  org.joda.time.TestDateTime_Properties#testPropertyAddWrapFieldDayOfMonth IllegalFieldValueException
  org.joda.time.TestDateTime_Properties#testPropertyAddWrapFieldDayOfWeek IllegalFieldValueException
  org.joda.time.TestDateTime_Properties#testPropertyAddWrapFieldDayOfYear IllegalFieldValueException
  org.joda.time.TestDateTime_Properties#testPropertyAddWrapFieldMonthOfYear IllegalFieldValueException
  org.joda.time.TestDateTime_Properties#testPropertyAddWrapFieldYear IllegalFieldValueException
  org.joda.time.TestLocalDateTime_Properties#testPropertyAddWrapFieldToCopyDay IllegalFieldValueException
  org.joda.time.TestLocalDateTime_Properties#testPropertyAddWrapFieldToCopyMonth IllegalFieldValueException
  org.joda.time.TestLocalDateTime_Properties#testPropertyAddWrapFieldToCopyYear IllegalFieldValueException
  org.joda.time.TestLocalDate_Properties#testPropertyAddWrapFieldToCopyDay IllegalFieldValueException
  org.joda.time.TestLocalDate_Properties#testPropertyAddWrapFieldToCopyMonth IllegalFieldValueException
  org.joda.time.TestLocalDate_Properties#testPropertyAddWrapFieldToCopyYear IllegalFieldValueException
  org.joda.time.TestMonthDay_Properties#testPropertyAddWrapFieldDayOfMonth IllegalFieldValueException
  org.joda.time.TestMonthDay_Properties#testPropertyAddWrapFieldMonthOfYear IllegalFieldValueException
  org.joda.time.TestPartial_Properties#testPropertyAddWrapFieldHour IllegalFieldValueException
  org.joda.time.TestPartial_Properties#testPropertyAddWrapFieldMinute IllegalFieldValueException
  org.joda.time.TestTimeOfDay_Properties#testPropertyAddWrapFieldHour IllegalFieldValueException
  org.joda.time.TestTimeOfDay_Properties#testPropertyAddWrapFieldMilli IllegalFieldValueException
  org.joda.time.TestTimeOfDay_Properties#testPropertyAddWrapFieldMinute IllegalFieldValueException
  org.joda.time.TestTimeOfDay_Properties#testPropertyAddWrapFieldSecond IllegalFieldValueException
  org.joda.time.TestYearMonthDay_Properties#testPropertyAddWrapFieldDay IllegalFieldValueException
  org.joda.time.TestYearMonthDay_Properties#testPropertyAddWrapFieldMonth IllegalFieldValueException
  org.joda.time.TestYearMonthDay_Properties#testPropertyAddWrapFieldYear IllegalFieldValueException
  org.joda.time.TestYearMonth_Properties#testPropertyAddWrapFieldMonth IllegalFieldValueException
  org.joda.time.TestYearMonth_Properties#testPropertyAddWrapFieldYear IllegalFieldValueException

Tests run: 4156, Failures: 9, Errors: 24, Skipped: 0

[INFO] ------------------------------------------------------------------------
[INFO] BUILD FAILURE
[INFO] ------------------------------------------------------------------------
[INFO] Total time: 14.933s
[INFO] Finished at: Thu Aug 06 04:37:10 BST 2015
[INFO] Final Memory: 8M/214M
[INFO] ------------------------------------------------------------------------
[ERROR] Failed to execute goal org.apache.maven.plugins:maven-surefire-plugin:2.18.1:test (default-test) on project joda-time: There are test failures.
[ERROR] 
[ERROR] Please refer to /home/perham/Study/LittleDarwin/Cases/joda-time-2.8.1/target/surefire-reports for the individual test results.
[ERROR] -> [Help 1]
[ERROR] 
[ERROR] To see the full stack trace of the errors, re-run Maven with the -e switch.
[ERROR] Re-run Maven using the -X switch to enable full debug logging.
[ERROR] 
[ERROR] For more information about the errors and possible solutions, please read the following articles:
[ERROR] [Help 1] http://cwiki.apache.org/confluence/display/MAVEN/MojoFailureException
