[INFO] Scanning for projects...
[INFO]                                                                         
[INFO] ------------------------------------------------------------------------
[INFO] Building Joda-Time 2.8.1
[INFO] ------------------------------------------------------------------------
[INFO] 
[INFO] --- maven-resources-plugin:2.7:resources (default-resources) @ joda-time ---
[INFO] Using 'UTF-8' encoding to copy filtered resources.
[INFO] Copying 2 resources to META-INF
[INFO] Copying 10 resources
[INFO] 
[INFO] --- maven-compiler-plugin:3.3:compile (default-compile) @ joda-time ---
[INFO] Changes detected - recompiling the module!
[INFO] Compiling 166 source files to /home/perham/Study/LittleDarwin/Cases/joda-time-2.8.1/target/classes
[INFO] 
[INFO] --- exec-maven-plugin:1.4.0:java (compile-tzdb) @ joda-time ---
Writing zoneinfo files
Writing ZoneInfoMap
[INFO] 
[INFO] --- maven-resources-plugin:2.7:testResources (default-testResources) @ joda-time ---
[INFO] Using 'UTF-8' encoding to copy filtered resources.
[INFO] Copying 34 resources
[INFO] 
[INFO] --- maven-compiler-plugin:3.3:testCompile (default-testCompile) @ joda-time ---
[INFO] Nothing to compile - all classes are up to date
[INFO] 
[INFO] --- maven-surefire-plugin:2.18.1:test (default-test) @ joda-time ---
[INFO] Surefire report directory: /home/perham/Study/LittleDarwin/Cases/joda-time-2.8.1/target/surefire-reports

-------------------------------------------------------
 T E S T S
-------------------------------------------------------
Running org.joda.time.TestAllPackages

TestBuddhistChronology.testCalendar

TestCopticChronology.testCalendar

TestEthiopicChronology.testCalendar

TestIslamicChronology.testCalendar

Testing Gregorian chronology over 1000 iterations
100% complete (i=1000)

Testing Julian chronology over 1000 iterations
100% complete (i=1000)
Writing zoneinfo files
Writing ZoneInfoMap
Tests run: 4157, Failures: 0, Errors: 27, Skipped: 0, Time elapsed: 5.262 sec <<< FAILURE! - in org.joda.time.TestAllPackages
testWithDurationAdded_long_int(org.joda.time.TestInstant_Basics)  Time elapsed: 0.004 sec  <<< ERROR!
java.lang.ArithmeticException: Multiplication overflows a long: 123456789 * 2
	at org.joda.time.field.FieldUtils.safeMultiply(FieldUtils.java:32)
	at org.joda.time.chrono.BaseChronology.add(BaseChronology.java:327)
	at org.joda.time.Instant.withDurationAdded(Instant.java:174)
	at org.joda.time.TestInstant_Basics.testWithDurationAdded_long_int(TestInstant_Basics.java:521)

testWithDurationAdded_RD_int(org.joda.time.TestInstant_Basics)  Time elapsed: 0.001 sec  <<< ERROR!
java.lang.ArithmeticException: Multiplication overflows a long: 123456789 * 2
	at org.joda.time.field.FieldUtils.safeMultiply(FieldUtils.java:32)
	at org.joda.time.chrono.BaseChronology.add(BaseChronology.java:327)
	at org.joda.time.Instant.withDurationAdded(Instant.java:174)
	at org.joda.time.Instant.withDurationAdded(Instant.java:192)
	at org.joda.time.TestInstant_Basics.testWithDurationAdded_RD_int(TestInstant_Basics.java:543)

testWithDurationAdded_long_int(org.joda.time.TestDateTime_Basics)  Time elapsed: 0.001 sec  <<< ERROR!
java.lang.ArithmeticException: Multiplication overflows a long: 123456789 * 2
	at org.joda.time.field.FieldUtils.safeMultiply(FieldUtils.java:32)
	at org.joda.time.chrono.BaseChronology.add(BaseChronology.java:327)
	at org.joda.time.DateTime.withDurationAdded(DateTime.java:901)
	at org.joda.time.TestDateTime_Basics.testWithDurationAdded_long_int(TestDateTime_Basics.java:984)

testWithDurationAdded_RD_int(org.joda.time.TestDateTime_Basics)  Time elapsed: 0.001 sec  <<< ERROR!
java.lang.ArithmeticException: Multiplication overflows a long: 123456789 * 2
	at org.joda.time.field.FieldUtils.safeMultiply(FieldUtils.java:32)
	at org.joda.time.chrono.BaseChronology.add(BaseChronology.java:327)
	at org.joda.time.DateTime.withDurationAdded(DateTime.java:901)
	at org.joda.time.DateTime.withDurationAdded(DateTime.java:919)
	at org.joda.time.TestDateTime_Basics.testWithDurationAdded_RD_int(TestDateTime_Basics.java:1006)

testAdd_RD_int1(org.joda.time.TestMutableDateTime_Adds)  Time elapsed: 0.001 sec  <<< ERROR!
java.lang.ArithmeticException: Multiplication overflows a long: 123456 * -2
	at org.joda.time.field.FieldUtils.safeMultiply(FieldUtils.java:32)
	at org.joda.time.MutableDateTime.add(MutableDateTime.java:522)
	at org.joda.time.TestMutableDateTime_Adds.testAdd_RD_int1(TestMutableDateTime_Adds.java:129)

testWithDurationAdded_long_int(org.joda.time.TestDateMidnight_Basics)  Time elapsed: 0 sec  <<< ERROR!
java.lang.ArithmeticException: Multiplication overflows a long: 123456789 * 2
	at org.joda.time.field.FieldUtils.safeMultiply(FieldUtils.java:32)
	at org.joda.time.chrono.BaseChronology.add(BaseChronology.java:327)
	at org.joda.time.DateMidnight.withDurationAdded(DateMidnight.java:516)
	at org.joda.time.TestDateMidnight_Basics.testWithDurationAdded_long_int(TestDateMidnight_Basics.java:797)

testWithDurationAdded_RD_int(org.joda.time.TestDateMidnight_Basics)  Time elapsed: 0.001 sec  <<< ERROR!
java.lang.ArithmeticException: Multiplication overflows a long: 123456789 * 2
	at org.joda.time.field.FieldUtils.safeMultiply(FieldUtils.java:32)
	at org.joda.time.chrono.BaseChronology.add(BaseChronology.java:327)
	at org.joda.time.DateMidnight.withDurationAdded(DateMidnight.java:516)
	at org.joda.time.DateMidnight.withDurationAdded(DateMidnight.java:534)
	at org.joda.time.TestDateMidnight_Basics.testWithDurationAdded_RD_int(TestDateMidnight_Basics.java:819)

testParse_noFormatter(org.joda.time.TestDuration_Constructors)  Time elapsed: 0.001 sec  <<< ERROR!
java.lang.ArithmeticException: Multiplication overflows a long: 3 * 1000
	at org.joda.time.field.FieldUtils.safeMultiply(FieldUtils.java:32)
	at org.joda.time.convert.StringConverter.getDurationMillis(StringConverter.java:146)
	at org.joda.time.base.BaseDuration.<init>(BaseDuration.java:105)
	at org.joda.time.Duration.<init>(Duration.java:210)
	at org.joda.time.Duration.parse(Duration.java:60)
	at org.joda.time.TestDuration_Constructors.testParse_noFormatter(TestDuration_Constructors.java:108)

testFactory_standardMinutes_long(org.joda.time.TestDuration_Constructors)  Time elapsed: 0 sec  <<< ERROR!
java.lang.ArithmeticException: Multiplication overflows a long: 1 * 60000
	at org.joda.time.field.FieldUtils.safeMultiply(FieldUtils.java:32)
	at org.joda.time.Duration.standardMinutes(Duration.java:131)
	at org.joda.time.TestDuration_Constructors.testFactory_standardMinutes_long(TestDuration_Constructors.java:138)

testFactory_standardSeconds_long(org.joda.time.TestDuration_Constructors)  Time elapsed: 0.001 sec  <<< ERROR!
java.lang.ArithmeticException: Multiplication overflows a long: 1 * 1000
	at org.joda.time.field.FieldUtils.safeMultiply(FieldUtils.java:32)
	at org.joda.time.Duration.standardSeconds(Duration.java:153)
	at org.joda.time.TestDuration_Constructors.testFactory_standardSeconds_long(TestDuration_Constructors.java:150)

testConstructor_Object1(org.joda.time.TestDuration_Constructors)  Time elapsed: 0 sec  <<< ERROR!
java.lang.ArithmeticException: Multiplication overflows a long: 72 * 1000
	at org.joda.time.field.FieldUtils.safeMultiply(FieldUtils.java:32)
	at org.joda.time.convert.StringConverter.getDurationMillis(StringConverter.java:146)
	at org.joda.time.base.BaseDuration.<init>(BaseDuration.java:105)
	at org.joda.time.Duration.<init>(Duration.java:210)
	at org.joda.time.TestDuration_Constructors.testConstructor_Object1(TestDuration_Constructors.java:224)

testFactory_standardDays_long(org.joda.time.TestDuration_Constructors)  Time elapsed: 0.001 sec  <<< ERROR!
java.lang.ArithmeticException: Multiplication overflows a long: 1 * 86400000
	at org.joda.time.field.FieldUtils.safeMultiply(FieldUtils.java:32)
	at org.joda.time.Duration.standardDays(Duration.java:85)
	at org.joda.time.TestDuration_Constructors.testFactory_standardDays_long(TestDuration_Constructors.java:114)

testFactory_standardHours_long(org.joda.time.TestDuration_Constructors)  Time elapsed: 0 sec  <<< ERROR!
java.lang.ArithmeticException: Multiplication overflows a long: 1 * 3600000
	at org.joda.time.field.FieldUtils.safeMultiply(FieldUtils.java:32)
	at org.joda.time.Duration.standardHours(Duration.java:108)
	at org.joda.time.TestDuration_Constructors.testFactory_standardHours_long(TestDuration_Constructors.java:126)

testWithDurationAdded_long_int2(org.joda.time.TestDuration_Basics)  Time elapsed: 0 sec  <<< ERROR!
java.lang.ArithmeticException: Multiplication overflows a long: 8000 * 2
	at org.joda.time.field.FieldUtils.safeMultiply(FieldUtils.java:32)
	at org.joda.time.Duration.withDurationAdded(Duration.java:393)
	at org.joda.time.TestDuration_Basics.testWithDurationAdded_long_int2(TestDuration_Basics.java:633)

testWithDurationAdded_RD_int2(org.joda.time.TestDuration_Basics)  Time elapsed: 0 sec  <<< ERROR!
java.lang.ArithmeticException: Multiplication overflows a long: 8000 * 2
	at org.joda.time.field.FieldUtils.safeMultiply(FieldUtils.java:32)
	at org.joda.time.Duration.withDurationAdded(Duration.java:393)
	at org.joda.time.Duration.withDurationAdded(Duration.java:412)
	at org.joda.time.TestDuration_Basics.testWithDurationAdded_RD_int2(TestDuration_Basics.java:739)

testFactory_standardPeriodIn_RPeriod(org.joda.time.TestBaseSingleFieldPeriod)  Time elapsed: 0.001 sec  <<< ERROR!
java.lang.ArithmeticException: Multiplication overflows a long: 86400000 * 123
	at org.joda.time.field.FieldUtils.safeMultiply(FieldUtils.java:32)
	at org.joda.time.base.BaseSingleFieldPeriod.standardPeriodIn(BaseSingleFieldPeriod.java:144)
	at org.joda.time.TestBaseSingleFieldPeriod$Single.standardPeriodIn(TestBaseSingleFieldPeriod.java:314)
	at org.joda.time.TestBaseSingleFieldPeriod.testFactory_standardPeriodIn_RPeriod(TestBaseSingleFieldPeriod.java:140)

testFactory_standardWeeksIn_RPeriod(org.joda.time.TestWeeks)  Time elapsed: 0 sec  <<< ERROR!
java.lang.ArithmeticException: Multiplication overflows a long: 604800000 * 123
	at org.joda.time.field.FieldUtils.safeMultiply(FieldUtils.java:32)
	at org.joda.time.base.BaseSingleFieldPeriod.standardPeriodIn(BaseSingleFieldPeriod.java:144)
	at org.joda.time.Weeks.standardWeeksIn(Weeks.java:165)
	at org.joda.time.TestWeeks.testFactory_standardWeeksIn_RPeriod(TestWeeks.java:118)

testFactory_standardDaysIn_RPeriod(org.joda.time.TestDays)  Time elapsed: 0.001 sec  <<< ERROR!
java.lang.ArithmeticException: Multiplication overflows a long: 86400000 * 123
	at org.joda.time.field.FieldUtils.safeMultiply(FieldUtils.java:32)
	at org.joda.time.base.BaseSingleFieldPeriod.standardPeriodIn(BaseSingleFieldPeriod.java:144)
	at org.joda.time.Days.standardDaysIn(Days.java:183)
	at org.joda.time.TestDays.testFactory_standardDaysIn_RPeriod(TestDays.java:159)

testFactory_standardHoursIn_RPeriod(org.joda.time.TestHours)  Time elapsed: 0.001 sec  <<< ERROR!
java.lang.ArithmeticException: Multiplication overflows a long: 3600000 * 123
	at org.joda.time.field.FieldUtils.safeMultiply(FieldUtils.java:32)
	at org.joda.time.base.BaseSingleFieldPeriod.standardPeriodIn(BaseSingleFieldPeriod.java:144)
	at org.joda.time.Hours.standardHoursIn(Hours.java:185)
	at org.joda.time.TestHours.testFactory_standardHoursIn_RPeriod(TestHours.java:128)

testFactory_standardMinutesIn_RPeriod(org.joda.time.TestMinutes)  Time elapsed: 0 sec  <<< ERROR!
java.lang.ArithmeticException: Multiplication overflows a long: 60000 * 123
	at org.joda.time.field.FieldUtils.safeMultiply(FieldUtils.java:32)
	at org.joda.time.base.BaseSingleFieldPeriod.standardPeriodIn(BaseSingleFieldPeriod.java:144)
	at org.joda.time.Minutes.standardMinutesIn(Minutes.java:165)
	at org.joda.time.TestMinutes.testFactory_standardMinutesIn_RPeriod(TestMinutes.java:118)

testFactory_standardSecondsIn_RPeriod(org.joda.time.TestSeconds)  Time elapsed: 0 sec  <<< ERROR!
java.lang.ArithmeticException: Multiplication overflows a long: 1000 * 123
	at org.joda.time.field.FieldUtils.safeMultiply(FieldUtils.java:32)
	at org.joda.time.base.BaseSingleFieldPeriod.standardPeriodIn(BaseSingleFieldPeriod.java:144)
	at org.joda.time.Seconds.standardSecondsIn(Seconds.java:165)
	at org.joda.time.TestSeconds.testFactory_standardSecondsIn_RPeriod(TestSeconds.java:118)

testDuration(org.joda.time.TestStringConvert)  Time elapsed: 0.001 sec  <<< ERROR!
java.lang.ArithmeticException: Multiplication overflows a long: 12345 * 1000
	at org.joda.time.field.FieldUtils.safeMultiply(FieldUtils.java:32)
	at org.joda.time.convert.StringConverter.getDurationMillis(StringConverter.java:146)
	at org.joda.time.base.BaseDuration.<init>(BaseDuration.java:105)
	at org.joda.time.Duration.<init>(Duration.java:210)
	at org.joda.time.Duration.parse(Duration.java:60)
	at sun.reflect.NativeMethodAccessorImpl.invoke0(Native Method)
	at sun.reflect.NativeMethodAccessorImpl.invoke(NativeMethodAccessorImpl.java:57)
	at sun.reflect.DelegatingMethodAccessorImpl.invoke(DelegatingMethodAccessorImpl.java:43)
	at java.lang.reflect.Method.invoke(Method.java:606)
	at org.joda.convert.MethodsStringConverter.convertFromString(MethodsStringConverter.java:70)
	at org.joda.convert.StringConvert.convertFromString(StringConvert.java:163)
	at org.joda.time.TestStringConvert.testDuration(TestStringConvert.java:137)

testGetDurationMillis_Object1(org.joda.time.convert.TestStringConverter)  Time elapsed: 0 sec  <<< ERROR!
java.lang.ArithmeticException: Multiplication overflows a long: 12 * 1000
	at org.joda.time.field.FieldUtils.safeMultiply(FieldUtils.java:32)
	at org.joda.time.convert.StringConverter.getDurationMillis(StringConverter.java:146)
	at org.joda.time.convert.TestStringConverter.testGetDurationMillis_Object1(TestStringConverter.java:290)

testSafeMultiplyLongInt(org.joda.time.field.TestFieldUtils)  Time elapsed: 0.001 sec  <<< ERROR!
java.lang.ArithmeticException: Multiplication overflows a long: 1 * 3
	at org.joda.time.field.FieldUtils.safeMultiply(FieldUtils.java:32)
	at org.joda.time.field.TestFieldUtils.testSafeMultiplyLongInt(TestFieldUtils.java:245)

test_add_long_long(org.joda.time.field.TestScaledDurationField)  Time elapsed: 0 sec  <<< ERROR!
java.lang.ArithmeticException: Multiplication overflows a long: 1234 * 90
	at org.joda.time.field.FieldUtils.safeMultiply(FieldUtils.java:32)
	at org.joda.time.field.ScaledDurationField.add(ScaledDurationField.java:96)
	at org.joda.time.field.TestScaledDurationField.test_add_long_long(TestScaledDurationField.java:198)

test_getMillis_long(org.joda.time.field.TestScaledDurationField)  Time elapsed: 0 sec  <<< ERROR!
java.lang.ArithmeticException: Multiplication overflows a long: 1234 * 90
	at org.joda.time.field.FieldUtils.safeMultiply(FieldUtils.java:32)
	at org.joda.time.field.ScaledDurationField.getMillis(ScaledDurationField.java:76)
	at org.joda.time.field.TestScaledDurationField.test_getMillis_long(TestScaledDurationField.java:160)

test_getMillis_long_long(org.joda.time.field.TestScaledDurationField)  Time elapsed: 0 sec  <<< ERROR!
java.lang.ArithmeticException: Multiplication overflows a long: 1234 * 90
	at org.joda.time.field.FieldUtils.safeMultiply(FieldUtils.java:32)
	at org.joda.time.field.ScaledDurationField.getMillis(ScaledDurationField.java:86)
	at org.joda.time.field.TestScaledDurationField.test_getMillis_long_long(TestScaledDurationField.java:177)


Results :

Tests in error: 
  org.joda.time.TestBaseSingleFieldPeriod#testFactory_standardPeriodIn_RPeriod ArithmeticException
  org.joda.time.TestDateMidnight_Basics#testWithDurationAdded_RD_int ArithmeticException
  org.joda.time.TestDateMidnight_Basics#testWithDurationAdded_long_int ArithmeticException
  org.joda.time.TestDateTime_Basics#testWithDurationAdded_RD_int ArithmeticException
  org.joda.time.TestDateTime_Basics#testWithDurationAdded_long_int ArithmeticException
  org.joda.time.TestDays#testFactory_standardDaysIn_RPeriod ArithmeticException ...
  org.joda.time.TestDuration_Basics#testWithDurationAdded_RD_int2 ArithmeticException
  org.joda.time.TestDuration_Basics#testWithDurationAdded_long_int2 ArithmeticException
  org.joda.time.TestDuration_Constructors#testConstructor_Object1 ArithmeticException
  org.joda.time.TestDuration_Constructors#testFactory_standardDays_long ArithmeticException
  org.joda.time.TestDuration_Constructors#testFactory_standardHours_long ArithmeticException
  org.joda.time.TestDuration_Constructors#testFactory_standardMinutes_long ArithmeticException
  org.joda.time.TestDuration_Constructors#testFactory_standardSeconds_long ArithmeticException
  org.joda.time.TestDuration_Constructors#testParse_noFormatter ArithmeticException
  org.joda.time.TestHours#testFactory_standardHoursIn_RPeriod ArithmeticException
  org.joda.time.TestInstant_Basics#testWithDurationAdded_RD_int ArithmeticException
  org.joda.time.TestInstant_Basics#testWithDurationAdded_long_int ArithmeticException
  org.joda.time.TestMinutes#testFactory_standardMinutesIn_RPeriod ArithmeticException
  org.joda.time.TestMutableDateTime_Adds#testAdd_RD_int1 ArithmeticException Mul...
  org.joda.time.TestSeconds#testFactory_standardSecondsIn_RPeriod ArithmeticException
  org.joda.time.TestStringConvert#testDuration ArithmeticException Multiplicatio...
  org.joda.time.TestWeeks#testFactory_standardWeeksIn_RPeriod ArithmeticException
  org.joda.time.convert.TestStringConverter#testGetDurationMillis_Object1 ArithmeticException
  org.joda.time.field.TestFieldUtils#testSafeMultiplyLongInt ArithmeticException
  org.joda.time.field.TestScaledDurationField#test_add_long_long ArithmeticException
  org.joda.time.field.TestScaledDurationField#test_getMillis_long ArithmeticException
  org.joda.time.field.TestScaledDurationField#test_getMillis_long_long ArithmeticException

Tests run: 4157, Failures: 0, Errors: 27, Skipped: 0

[INFO] ------------------------------------------------------------------------
[INFO] BUILD FAILURE
[INFO] ------------------------------------------------------------------------
[INFO] Total time: 16.042s
[INFO] Finished at: Thu Aug 06 04:36:11 BST 2015
[INFO] Final Memory: 9M/213M
[INFO] ------------------------------------------------------------------------
[ERROR] Failed to execute goal org.apache.maven.plugins:maven-surefire-plugin:2.18.1:test (default-test) on project joda-time: There are test failures.
[ERROR] 
[ERROR] Please refer to /home/perham/Study/LittleDarwin/Cases/joda-time-2.8.1/target/surefire-reports for the individual test results.
[ERROR] -> [Help 1]
[ERROR] 
[ERROR] To see the full stack trace of the errors, re-run Maven with the -e switch.
[ERROR] Re-run Maven using the -X switch to enable full debug logging.
[ERROR] 
[ERROR] For more information about the errors and possible solutions, please read the following articles:
[ERROR] [Help 1] http://cwiki.apache.org/confluence/display/MAVEN/MojoFailureException
