[INFO] Scanning for projects...
[INFO]                                                                         
[INFO] ------------------------------------------------------------------------
[INFO] Building Joda-Time 2.8.1
[INFO] ------------------------------------------------------------------------
[INFO] 
[INFO] --- maven-resources-plugin:2.7:resources (default-resources) @ joda-time ---
[INFO] Using 'UTF-8' encoding to copy filtered resources.
[INFO] Copying 2 resources to META-INF
[INFO] Copying 10 resources
[INFO] 
[INFO] --- maven-compiler-plugin:3.3:compile (default-compile) @ joda-time ---
[INFO] Changes detected - recompiling the module!
[INFO] Compiling 166 source files to /home/perham/Study/LittleDarwin/Cases/joda-time-2.8.1/target/classes
[INFO] 
[INFO] --- exec-maven-plugin:1.4.0:java (compile-tzdb) @ joda-time ---
Writing zoneinfo files
Writing ZoneInfoMap
[INFO] 
[INFO] --- maven-resources-plugin:2.7:testResources (default-testResources) @ joda-time ---
[INFO] Using 'UTF-8' encoding to copy filtered resources.
[INFO] Copying 34 resources
[INFO] 
[INFO] --- maven-compiler-plugin:3.3:testCompile (default-testCompile) @ joda-time ---
[INFO] Nothing to compile - all classes are up to date
[INFO] 
[INFO] --- maven-surefire-plugin:2.18.1:test (default-test) @ joda-time ---
[INFO] Surefire report directory: /home/perham/Study/LittleDarwin/Cases/joda-time-2.8.1/target/surefire-reports

-------------------------------------------------------
 T E S T S
-------------------------------------------------------
Running org.joda.time.TestAllPackages

TestBuddhistChronology.testCalendar

TestCopticChronology.testCalendar

TestEthiopicChronology.testCalendar

TestIslamicChronology.testCalendar

Testing Gregorian chronology over 1000 iterations
100% complete (i=1000)

Testing Julian chronology over 1000 iterations
100% complete (i=1000)
Writing zoneinfo files
Writing ZoneInfoMap
Tests run: 4157, Failures: 0, Errors: 39, Skipped: 0, Time elapsed: 5.188 sec <<< FAILURE! - in org.joda.time.TestAllPackages
testPropertyAddNoWrapMilli(org.joda.time.TestTimeOfDay_Properties)  Time elapsed: 0.004 sec  <<< ERROR!
java.lang.IllegalArgumentException: Maximum value exceeded for add
	at org.joda.time.field.BaseDateTimeField.add(BaseDateTimeField.java:41)
	at org.joda.time.field.BaseDateTimeField.add(BaseDateTimeField.java:45)
	at org.joda.time.field.BaseDateTimeField.add(BaseDateTimeField.java:45)
	at org.joda.time.field.BaseDateTimeField.add(BaseDateTimeField.java:45)
	at org.joda.time.TimeOfDay$Property.addNoWrapToCopy(TimeOfDay.java:1124)
	at org.joda.time.TestTimeOfDay_Properties.testPropertyAddNoWrapMilli(TestTimeOfDay_Properties.java:633)

testPropertyAddNoWrapHour(org.joda.time.TestTimeOfDay_Properties)  Time elapsed: 0 sec  <<< ERROR!
java.lang.IllegalArgumentException: Maximum value exceeded for add
	at org.joda.time.field.BaseDateTimeField.add(BaseDateTimeField.java:41)
	at org.joda.time.TimeOfDay$Property.addNoWrapToCopy(TimeOfDay.java:1124)
	at org.joda.time.TestTimeOfDay_Properties.testPropertyAddNoWrapHour(TestTimeOfDay_Properties.java:130)

testPropertyAddNoWrapMinute(org.joda.time.TestTimeOfDay_Properties)  Time elapsed: 0 sec  <<< ERROR!
java.lang.IllegalArgumentException: Maximum value exceeded for add
	at org.joda.time.field.BaseDateTimeField.add(BaseDateTimeField.java:41)
	at org.joda.time.field.BaseDateTimeField.add(BaseDateTimeField.java:45)
	at org.joda.time.TimeOfDay$Property.addNoWrapToCopy(TimeOfDay.java:1124)
	at org.joda.time.TestTimeOfDay_Properties.testPropertyAddNoWrapMinute(TestTimeOfDay_Properties.java:301)

testPropertyAddNoWrapSecond(org.joda.time.TestTimeOfDay_Properties)  Time elapsed: 0.001 sec  <<< ERROR!
java.lang.IllegalArgumentException: Maximum value exceeded for add
	at org.joda.time.field.BaseDateTimeField.add(BaseDateTimeField.java:41)
	at org.joda.time.field.BaseDateTimeField.add(BaseDateTimeField.java:45)
	at org.joda.time.field.BaseDateTimeField.add(BaseDateTimeField.java:45)
	at org.joda.time.TimeOfDay$Property.addNoWrapToCopy(TimeOfDay.java:1124)
	at org.joda.time.TestTimeOfDay_Properties.testPropertyAddNoWrapSecond(TestTimeOfDay_Properties.java:470)

testWithFieldAdded1(org.joda.time.TestYearMonthDay_Basics)  Time elapsed: 0.001 sec  <<< ERROR!
java.lang.IllegalArgumentException: Maximum value exceeded for add
	at org.joda.time.field.BaseDateTimeField.add(BaseDateTimeField.java:41)
	at org.joda.time.YearMonthDay.withFieldAdded(YearMonthDay.java:444)
	at org.joda.time.TestYearMonthDay_Basics.testWithFieldAdded1(TestYearMonthDay_Basics.java:408)

testPlus_RP(org.joda.time.TestYearMonthDay_Basics)  Time elapsed: 0.001 sec  <<< ERROR!
java.lang.IllegalArgumentException: Maximum value exceeded for add
	at org.joda.time.field.BaseDateTimeField.add(BaseDateTimeField.java:41)
	at org.joda.time.YearMonthDay.withPeriodAdded(YearMonthDay.java:473)
	at org.joda.time.YearMonthDay.plus(YearMonthDay.java:495)
	at org.joda.time.TestYearMonthDay_Basics.testPlus_RP(TestYearMonthDay_Basics.java:447)

testPlusYears_int(org.joda.time.TestYearMonthDay_Basics)  Time elapsed: 0.001 sec  <<< ERROR!
java.lang.IllegalArgumentException: Maximum value exceeded for add
	at org.joda.time.field.BaseDateTimeField.add(BaseDateTimeField.java:41)
	at org.joda.time.YearMonthDay.withFieldAdded(YearMonthDay.java:444)
	at org.joda.time.YearMonthDay.plusYears(YearMonthDay.java:516)
	at org.joda.time.TestYearMonthDay_Basics.testPlusYears_int(TestYearMonthDay_Basics.java:457)

testPlusMonths_int(org.joda.time.TestYearMonthDay_Basics)  Time elapsed: 0.001 sec  <<< ERROR!
java.lang.IllegalArgumentException: Maximum value exceeded for add
	at org.joda.time.field.BaseDateTimeField.add(BaseDateTimeField.java:41)
	at org.joda.time.field.BaseDateTimeField.add(BaseDateTimeField.java:45)
	at org.joda.time.YearMonthDay.withFieldAdded(YearMonthDay.java:444)
	at org.joda.time.YearMonthDay.plusMonths(YearMonthDay.java:536)
	at org.joda.time.TestYearMonthDay_Basics.testPlusMonths_int(TestYearMonthDay_Basics.java:467)

testPlusDays_int(org.joda.time.TestYearMonthDay_Basics)  Time elapsed: 0.001 sec  <<< ERROR!
java.lang.IllegalArgumentException: Maximum value exceeded for add
	at org.joda.time.field.BaseDateTimeField.add(BaseDateTimeField.java:41)
	at org.joda.time.field.BaseDateTimeField.add(BaseDateTimeField.java:45)
	at org.joda.time.field.BaseDateTimeField.add(BaseDateTimeField.java:45)
	at org.joda.time.YearMonthDay.withFieldAdded(YearMonthDay.java:444)
	at org.joda.time.YearMonthDay.plusDays(YearMonthDay.java:556)
	at org.joda.time.TestYearMonthDay_Basics.testPlusDays_int(TestYearMonthDay_Basics.java:477)

testPropertyAddYear(org.joda.time.TestYearMonthDay_Properties)  Time elapsed: 0.001 sec  <<< ERROR!
java.lang.IllegalArgumentException: Maximum value exceeded for add
	at org.joda.time.field.BaseDateTimeField.add(BaseDateTimeField.java:41)
	at org.joda.time.YearMonthDay$Property.addToCopy(YearMonthDay.java:1011)
	at org.joda.time.TestYearMonthDay_Properties.testPropertyAddYear(TestYearMonthDay_Properties.java:113)

testPropertyAddDay(org.joda.time.TestYearMonthDay_Properties)  Time elapsed: 0 sec  <<< ERROR!
org.joda.time.IllegalFieldValueException: Value 31 for dayOfMonth must be in the range [1,30]
	at org.joda.time.field.FieldUtils.verifyValueBounds(FieldUtils.java:234)
	at org.joda.time.field.BaseDateTimeField.set(BaseDateTimeField.java:94)
	at org.joda.time.field.BaseDateTimeField.add(BaseDateTimeField.java:57)
	at org.joda.time.YearMonthDay$Property.addToCopy(YearMonthDay.java:1011)
	at org.joda.time.TestYearMonthDay_Properties.testPropertyAddDay(TestYearMonthDay_Properties.java:382)

testPlus_RP(org.joda.time.TestYearMonth_Basics)  Time elapsed: 0 sec  <<< ERROR!
java.lang.IllegalArgumentException: Maximum value exceeded for add
	at org.joda.time.field.BaseDateTimeField.add(BaseDateTimeField.java:41)
	at org.joda.time.YearMonth.withPeriodAdded(YearMonth.java:540)
	at org.joda.time.YearMonth.plus(YearMonth.java:562)
	at org.joda.time.TestYearMonth_Basics.testPlus_RP(TestYearMonth_Basics.java:441)

testPlusYears_int(org.joda.time.TestYearMonth_Basics)  Time elapsed: 0.001 sec  <<< ERROR!
java.lang.IllegalArgumentException: Maximum value exceeded for add
	at org.joda.time.field.BaseDateTimeField.add(BaseDateTimeField.java:41)
	at org.joda.time.YearMonth.withFieldAdded(YearMonth.java:511)
	at org.joda.time.YearMonth.plusYears(YearMonth.java:582)
	at org.joda.time.TestYearMonth_Basics.testPlusYears_int(TestYearMonth_Basics.java:451)

testPlusMonths_int(org.joda.time.TestYearMonth_Basics)  Time elapsed: 0.001 sec  <<< ERROR!
java.lang.IllegalArgumentException: Maximum value exceeded for add
	at org.joda.time.field.BaseDateTimeField.add(BaseDateTimeField.java:41)
	at org.joda.time.field.BaseDateTimeField.add(BaseDateTimeField.java:45)
	at org.joda.time.YearMonth.withFieldAdded(YearMonth.java:511)
	at org.joda.time.YearMonth.plusMonths(YearMonth.java:601)
	at org.joda.time.TestYearMonth_Basics.testPlusMonths_int(TestYearMonth_Basics.java:461)

testToInterval(org.joda.time.TestYearMonth_Basics)  Time elapsed: 0.001 sec  <<< ERROR!
java.lang.IllegalArgumentException: Maximum value exceeded for add
	at org.joda.time.field.BaseDateTimeField.add(BaseDateTimeField.java:41)
	at org.joda.time.field.BaseDateTimeField.add(BaseDateTimeField.java:45)
	at org.joda.time.YearMonth.withFieldAdded(YearMonth.java:511)
	at org.joda.time.YearMonth.plusMonths(YearMonth.java:601)
	at org.joda.time.YearMonth.toInterval(YearMonth.java:699)
	at org.joda.time.YearMonth.toInterval(YearMonth.java:683)
	at org.joda.time.TestYearMonth_Basics.testToInterval(TestYearMonth_Basics.java:540)

testWithFieldAdded(org.joda.time.TestYearMonth_Basics)  Time elapsed: 0.001 sec  <<< ERROR!
java.lang.IllegalArgumentException: Maximum value exceeded for add
	at org.joda.time.field.BaseDateTimeField.add(BaseDateTimeField.java:41)
	at org.joda.time.YearMonth.withFieldAdded(YearMonth.java:511)
	at org.joda.time.TestYearMonth_Basics.testWithFieldAdded(TestYearMonth_Basics.java:402)

testToInterval_Zone(org.joda.time.TestYearMonth_Basics)  Time elapsed: 0.001 sec  <<< ERROR!
java.lang.IllegalArgumentException: Maximum value exceeded for add
	at org.joda.time.field.BaseDateTimeField.add(BaseDateTimeField.java:41)
	at org.joda.time.field.BaseDateTimeField.add(BaseDateTimeField.java:45)
	at org.joda.time.YearMonth.withFieldAdded(YearMonth.java:511)
	at org.joda.time.YearMonth.plusMonths(YearMonth.java:601)
	at org.joda.time.YearMonth.toInterval(YearMonth.java:699)
	at org.joda.time.TestYearMonth_Basics.testToInterval_Zone(TestYearMonth_Basics.java:551)

testToInterval_nullZone(org.joda.time.TestYearMonth_Basics)  Time elapsed: 0.001 sec  <<< ERROR!
java.lang.IllegalArgumentException: Maximum value exceeded for add
	at org.joda.time.field.BaseDateTimeField.add(BaseDateTimeField.java:41)
	at org.joda.time.field.BaseDateTimeField.add(BaseDateTimeField.java:45)
	at org.joda.time.YearMonth.withFieldAdded(YearMonth.java:511)
	at org.joda.time.YearMonth.plusMonths(YearMonth.java:601)
	at org.joda.time.YearMonth.toInterval(YearMonth.java:699)
	at org.joda.time.TestYearMonth_Basics.testToInterval_nullZone(TestYearMonth_Basics.java:561)

testPropertyAddYear(org.joda.time.TestYearMonth_Properties)  Time elapsed: 0.001 sec  <<< ERROR!
java.lang.IllegalArgumentException: Maximum value exceeded for add
	at org.joda.time.field.BaseDateTimeField.add(BaseDateTimeField.java:41)
	at org.joda.time.YearMonth$Property.addToCopy(YearMonth.java:914)
	at org.joda.time.TestYearMonth_Properties.testPropertyAddYear(TestYearMonth_Properties.java:112)

testPlus_RP(org.joda.time.TestMonthDay_Basics)  Time elapsed: 0 sec  <<< ERROR!
java.lang.IllegalArgumentException: Maximum value exceeded for add
	at org.joda.time.field.BaseDateTimeField.add(BaseDateTimeField.java:41)
	at org.joda.time.MonthDay.withPeriodAdded(MonthDay.java:548)
	at org.joda.time.MonthDay.plus(MonthDay.java:570)
	at org.joda.time.TestMonthDay_Basics.testPlus_RP(TestMonthDay_Basics.java:436)

testPlusMonths_int(org.joda.time.TestMonthDay_Basics)  Time elapsed: 0.001 sec  <<< ERROR!
java.lang.IllegalArgumentException: Maximum value exceeded for add
	at org.joda.time.field.BaseDateTimeField.add(BaseDateTimeField.java:41)
	at org.joda.time.MonthDay.withFieldAdded(MonthDay.java:519)
	at org.joda.time.MonthDay.plusMonths(MonthDay.java:592)
	at org.joda.time.TestMonthDay_Basics.testPlusMonths_int(TestMonthDay_Basics.java:446)

testPlusDays_int(org.joda.time.TestMonthDay_Basics)  Time elapsed: 0.001 sec  <<< ERROR!
java.lang.IllegalArgumentException: Maximum value exceeded for add
	at org.joda.time.field.BaseDateTimeField.add(BaseDateTimeField.java:41)
	at org.joda.time.field.BaseDateTimeField.add(BaseDateTimeField.java:45)
	at org.joda.time.MonthDay.withFieldAdded(MonthDay.java:519)
	at org.joda.time.MonthDay.plusDays(MonthDay.java:615)
	at org.joda.time.TestMonthDay_Basics.testPlusDays_int(TestMonthDay_Basics.java:502)

testPlusDays_int_wrapMonth(org.joda.time.TestMonthDay_Basics)  Time elapsed: 0.001 sec  <<< ERROR!
org.joda.time.IllegalFieldValueException: Value 32 for dayOfMonth must be in the range [1,30]
	at org.joda.time.field.FieldUtils.verifyValueBounds(FieldUtils.java:234)
	at org.joda.time.field.BaseDateTimeField.set(BaseDateTimeField.java:94)
	at org.joda.time.field.BaseDateTimeField.add(BaseDateTimeField.java:57)
	at org.joda.time.MonthDay.withFieldAdded(MonthDay.java:519)
	at org.joda.time.MonthDay.plusDays(MonthDay.java:615)
	at org.joda.time.TestMonthDay_Basics.testPlusDays_int_wrapMonth(TestMonthDay_Basics.java:509)

testPlusDays_int_wrapMonthTwice(org.joda.time.TestMonthDay_Basics)  Time elapsed: 0 sec  <<< ERROR!
org.joda.time.IllegalFieldValueException: Value 63 for dayOfMonth must be in the range [1,31]
	at org.joda.time.field.FieldUtils.verifyValueBounds(FieldUtils.java:234)
	at org.joda.time.field.BaseDateTimeField.set(BaseDateTimeField.java:94)
	at org.joda.time.field.BaseDateTimeField.add(BaseDateTimeField.java:57)
	at org.joda.time.MonthDay.withFieldAdded(MonthDay.java:519)
	at org.joda.time.MonthDay.plusDays(MonthDay.java:615)
	at org.joda.time.TestMonthDay_Basics.testPlusDays_int_wrapMonthTwice(TestMonthDay_Basics.java:516)

testPlusDays_int_wrapMonthIntoNextYear(org.joda.time.TestMonthDay_Basics)  Time elapsed: 0.001 sec  <<< ERROR!
org.joda.time.IllegalFieldValueException: Value 32 for dayOfMonth must be in the range [1,31]
	at org.joda.time.field.FieldUtils.verifyValueBounds(FieldUtils.java:234)
	at org.joda.time.field.BaseDateTimeField.set(BaseDateTimeField.java:94)
	at org.joda.time.field.BaseDateTimeField.add(BaseDateTimeField.java:57)
	at org.joda.time.MonthDay.withFieldAdded(MonthDay.java:519)
	at org.joda.time.MonthDay.plusDays(MonthDay.java:615)
	at org.joda.time.TestMonthDay_Basics.testPlusDays_int_wrapMonthIntoNextYear(TestMonthDay_Basics.java:523)

testPlusDays_int_wrapMonthTwiceIntoNextYear(org.joda.time.TestMonthDay_Basics)  Time elapsed: 0.001 sec  <<< ERROR!
org.joda.time.IllegalFieldValueException: Value 62 for dayOfMonth must be in the range [1,30]
	at org.joda.time.field.FieldUtils.verifyValueBounds(FieldUtils.java:234)
	at org.joda.time.field.BaseDateTimeField.set(BaseDateTimeField.java:94)
	at org.joda.time.field.BaseDateTimeField.add(BaseDateTimeField.java:57)
	at org.joda.time.MonthDay.withFieldAdded(MonthDay.java:519)
	at org.joda.time.MonthDay.plusDays(MonthDay.java:615)
	at org.joda.time.TestMonthDay_Basics.testPlusDays_int_wrapMonthTwiceIntoNextYear(TestMonthDay_Basics.java:530)

testPlusDays_int_wrap50(org.joda.time.TestMonthDay_Basics)  Time elapsed: 0 sec  <<< ERROR!
org.joda.time.IllegalFieldValueException: Value 65 for dayOfMonth must be in the range [1,31]
	at org.joda.time.field.FieldUtils.verifyValueBounds(FieldUtils.java:234)
	at org.joda.time.field.BaseDateTimeField.set(BaseDateTimeField.java:94)
	at org.joda.time.field.BaseDateTimeField.add(BaseDateTimeField.java:57)
	at org.joda.time.MonthDay.withFieldAdded(MonthDay.java:519)
	at org.joda.time.MonthDay.plusDays(MonthDay.java:615)
	at org.joda.time.TestMonthDay_Basics.testPlusDays_int_wrap50(TestMonthDay_Basics.java:537)

testPlusDays_int_fromLeap(org.joda.time.TestMonthDay_Basics)  Time elapsed: 0 sec  <<< ERROR!
org.joda.time.IllegalFieldValueException: Value 30 for dayOfMonth must be in the range [1,29]
	at org.joda.time.field.FieldUtils.verifyValueBounds(FieldUtils.java:234)
	at org.joda.time.field.BaseDateTimeField.set(BaseDateTimeField.java:94)
	at org.joda.time.field.BaseDateTimeField.add(BaseDateTimeField.java:57)
	at org.joda.time.MonthDay.withFieldAdded(MonthDay.java:519)
	at org.joda.time.MonthDay.plusDays(MonthDay.java:615)
	at org.joda.time.TestMonthDay_Basics.testPlusDays_int_fromLeap(TestMonthDay_Basics.java:551)

testMinusDays_int_negativeFromLeap(org.joda.time.TestMonthDay_Basics)  Time elapsed: 0 sec  <<< ERROR!
org.joda.time.IllegalFieldValueException: Value 30 for dayOfMonth must be in the range [1,29]
	at org.joda.time.field.FieldUtils.verifyValueBounds(FieldUtils.java:234)
	at org.joda.time.field.BaseDateTimeField.set(BaseDateTimeField.java:94)
	at org.joda.time.field.BaseDateTimeField.add(BaseDateTimeField.java:57)
	at org.joda.time.MonthDay.withFieldAdded(MonthDay.java:519)
	at org.joda.time.MonthDay.minusDays(MonthDay.java:675)
	at org.joda.time.TestMonthDay_Basics.testMinusDays_int_negativeFromLeap(TestMonthDay_Basics.java:687)

testWithFieldAdded1(org.joda.time.TestPartial_Basics)  Time elapsed: 0 sec  <<< ERROR!
java.lang.IllegalArgumentException: Maximum value exceeded for add
	at org.joda.time.field.BaseDateTimeField.add(BaseDateTimeField.java:41)
	at org.joda.time.Partial.withFieldAdded(Partial.java:576)
	at org.joda.time.TestPartial_Basics.testWithFieldAdded1(TestPartial_Basics.java:552)

testPlus_RP(org.joda.time.TestPartial_Basics)  Time elapsed: 0 sec  <<< ERROR!
java.lang.IllegalArgumentException: Maximum value exceeded for add
	at org.joda.time.field.BaseDateTimeField.add(BaseDateTimeField.java:41)
	at org.joda.time.Partial.withPeriodAdded(Partial.java:628)
	at org.joda.time.Partial.plus(Partial.java:645)
	at org.joda.time.TestPartial_Basics.testPlus_RP(TestPartial_Basics.java:722)

testPropertyAddHour(org.joda.time.TestPartial_Properties)  Time elapsed: 0.001 sec  <<< ERROR!
java.lang.IllegalArgumentException: Maximum value exceeded for add
	at org.joda.time.field.BaseDateTimeField.add(BaseDateTimeField.java:41)
	at org.joda.time.Partial$Property.addToCopy(Partial.java:925)
	at org.joda.time.TestPartial_Properties.testPropertyAddHour(TestPartial_Properties.java:136)

testPropertyAddMinute(org.joda.time.TestPartial_Properties)  Time elapsed: 0 sec  <<< ERROR!
java.lang.IllegalArgumentException: Maximum value exceeded for add
	at org.joda.time.field.BaseDateTimeField.add(BaseDateTimeField.java:41)
	at org.joda.time.field.BaseDateTimeField.add(BaseDateTimeField.java:45)
	at org.joda.time.Partial$Property.addToCopy(Partial.java:925)
	at org.joda.time.TestPartial_Properties.testPropertyAddMinute(TestPartial_Properties.java:307)

testCutoverAddYears(org.joda.time.chrono.TestISOChronology)  Time elapsed: 0.001 sec  <<< ERROR!
java.lang.IllegalArgumentException: Maximum value exceeded for add
	at org.joda.time.field.BaseDateTimeField.add(BaseDateTimeField.java:41)
	at org.joda.time.YearMonthDay.withFieldAdded(YearMonthDay.java:444)
	at org.joda.time.chrono.TestISOChronology.testAdd(TestISOChronology.java:425)
	at org.joda.time.chrono.TestISOChronology.testCutoverAddYears(TestISOChronology.java:376)

testPartialDayOfYearAdd(org.joda.time.chrono.TestISOChronology)  Time elapsed: 0.001 sec  <<< ERROR!
org.joda.time.IllegalFieldValueException: Value 1827 for dayOfYear must be in the range [1,366]
	at org.joda.time.field.FieldUtils.verifyValueBounds(FieldUtils.java:234)
	at org.joda.time.field.BaseDateTimeField.set(BaseDateTimeField.java:94)
	at org.joda.time.field.BaseDateTimeField.add(BaseDateTimeField.java:57)
	at org.joda.time.Partial.withFieldAdded(Partial.java:576)
	at org.joda.time.chrono.TestISOChronology.testPartialDayOfYearAdd(TestISOChronology.java:442)

test_add_RP_int_intarray_int(org.joda.time.field.TestBaseDateTimeField)  Time elapsed: 0 sec  <<< ERROR!
java.lang.IllegalArgumentException: Maximum value exceeded for add
	at org.joda.time.field.BaseDateTimeField.add(BaseDateTimeField.java:41)
	at org.joda.time.field.BaseDateTimeField.add(BaseDateTimeField.java:45)
	at org.joda.time.field.BaseDateTimeField.add(BaseDateTimeField.java:45)
	at org.joda.time.field.TestBaseDateTimeField.test_add_RP_int_intarray_int(TestBaseDateTimeField.java:179)

test_add_RP_int_intarray_int(org.joda.time.field.TestOffsetDateTimeField)  Time elapsed: 0 sec  <<< ERROR!
java.lang.IllegalArgumentException: Maximum value exceeded for add
	at org.joda.time.field.BaseDateTimeField.add(BaseDateTimeField.java:41)
	at org.joda.time.field.BaseDateTimeField.add(BaseDateTimeField.java:45)
	at org.joda.time.field.BaseDateTimeField.add(BaseDateTimeField.java:45)
	at org.joda.time.field.TestOffsetDateTimeField.test_add_RP_int_intarray_int(TestOffsetDateTimeField.java:227)

test_add_RP_int_intarray_int(org.joda.time.field.TestPreciseDurationDateTimeField)  Time elapsed: 0 sec  <<< ERROR!
java.lang.IllegalArgumentException: Maximum value exceeded for add
	at org.joda.time.field.BaseDateTimeField.add(BaseDateTimeField.java:41)
	at org.joda.time.field.BaseDateTimeField.add(BaseDateTimeField.java:45)
	at org.joda.time.field.BaseDateTimeField.add(BaseDateTimeField.java:45)
	at org.joda.time.field.TestPreciseDurationDateTimeField.test_add_RP_int_intarray_int(TestPreciseDurationDateTimeField.java:196)

test_add_RP_int_intarray_int(org.joda.time.field.TestPreciseDateTimeField)  Time elapsed: 0.001 sec  <<< ERROR!
java.lang.IllegalArgumentException: Maximum value exceeded for add
	at org.joda.time.field.BaseDateTimeField.add(BaseDateTimeField.java:41)
	at org.joda.time.field.BaseDateTimeField.add(BaseDateTimeField.java:45)
	at org.joda.time.field.BaseDateTimeField.add(BaseDateTimeField.java:45)
	at org.joda.time.field.TestPreciseDateTimeField.test_add_RP_int_intarray_int(TestPreciseDateTimeField.java:225)


Results :

Tests in error: 
  org.joda.time.TestMonthDay_Basics#testMinusDays_int_negativeFromLeap IllegalFieldValueException
  org.joda.time.TestMonthDay_Basics#testPlusDays_int IllegalArgumentException Ma...
  org.joda.time.TestMonthDay_Basics#testPlusDays_int_fromLeap IllegalFieldValueException
  org.joda.time.TestMonthDay_Basics#testPlusDays_int_wrap50 IllegalFieldValueException
  org.joda.time.TestMonthDay_Basics#testPlusDays_int_wrapMonth IllegalFieldValueException
  org.joda.time.TestMonthDay_Basics#testPlusDays_int_wrapMonthIntoNextYear IllegalFieldValueException
  org.joda.time.TestMonthDay_Basics#testPlusDays_int_wrapMonthTwice IllegalFieldValueException
  org.joda.time.TestMonthDay_Basics#testPlusDays_int_wrapMonthTwiceIntoNextYear IllegalFieldValueException
  org.joda.time.TestMonthDay_Basics#testPlusMonths_int IllegalArgumentException ...
  org.joda.time.TestMonthDay_Basics#testPlus_RP IllegalArgumentException Maximum...
  org.joda.time.TestPartial_Basics#testPlus_RP IllegalArgumentException Maximum ...
  org.joda.time.TestPartial_Basics#testWithFieldAdded1 IllegalArgumentException ...
  org.joda.time.TestPartial_Properties#testPropertyAddHour IllegalArgumentException
  org.joda.time.TestPartial_Properties#testPropertyAddMinute IllegalArgumentException
  org.joda.time.TestTimeOfDay_Properties#testPropertyAddNoWrapHour IllegalArgumentException
  org.joda.time.TestTimeOfDay_Properties#testPropertyAddNoWrapMilli IllegalArgumentException
  org.joda.time.TestTimeOfDay_Properties#testPropertyAddNoWrapMinute IllegalArgumentException
  org.joda.time.TestTimeOfDay_Properties#testPropertyAddNoWrapSecond IllegalArgumentException
  org.joda.time.TestYearMonthDay_Basics#testPlusDays_int IllegalArgumentException
  org.joda.time.TestYearMonthDay_Basics#testPlusMonths_int IllegalArgumentException
  org.joda.time.TestYearMonthDay_Basics#testPlusYears_int IllegalArgumentException
  org.joda.time.TestYearMonthDay_Basics#testPlus_RP IllegalArgumentException Max...
  org.joda.time.TestYearMonthDay_Basics#testWithFieldAdded1 IllegalArgumentException
  org.joda.time.TestYearMonthDay_Properties#testPropertyAddDay IllegalFieldValueException
  org.joda.time.TestYearMonthDay_Properties#testPropertyAddYear IllegalArgumentException
  org.joda.time.TestYearMonth_Basics#testPlusMonths_int IllegalArgumentException
  org.joda.time.TestYearMonth_Basics#testPlusYears_int IllegalArgumentException ...
  org.joda.time.TestYearMonth_Basics#testPlus_RP IllegalArgumentException Maximu...
  org.joda.time.TestYearMonth_Basics#testToInterval IllegalArgumentException Max...
  org.joda.time.TestYearMonth_Basics#testToInterval_Zone IllegalArgumentException
  org.joda.time.TestYearMonth_Basics#testToInterval_nullZone IllegalArgumentException
  org.joda.time.TestYearMonth_Basics#testWithFieldAdded IllegalArgumentException
  org.joda.time.TestYearMonth_Properties#testPropertyAddYear IllegalArgumentException
  org.joda.time.chrono.TestISOChronology#testCutoverAddYears IllegalArgumentException
  org.joda.time.chrono.TestISOChronology#testPartialDayOfYearAdd IllegalFieldValueException
  org.joda.time.field.TestBaseDateTimeField#test_add_RP_int_intarray_int IllegalArgumentException
  org.joda.time.field.TestOffsetDateTimeField#test_add_RP_int_intarray_int IllegalArgumentException
  org.joda.time.field.TestPreciseDateTimeField#test_add_RP_int_intarray_int IllegalArgumentException
  org.joda.time.field.TestPreciseDurationDateTimeField#test_add_RP_int_intarray_int IllegalArgumentException

Tests run: 4157, Failures: 0, Errors: 39, Skipped: 0

[INFO] ------------------------------------------------------------------------
[INFO] BUILD FAILURE
[INFO] ------------------------------------------------------------------------
[INFO] Total time: 15.170s
[INFO] Finished at: Thu Aug 06 04:10:05 BST 2015
[INFO] Final Memory: 9M/213M
[INFO] ------------------------------------------------------------------------
[ERROR] Failed to execute goal org.apache.maven.plugins:maven-surefire-plugin:2.18.1:test (default-test) on project joda-time: There are test failures.
[ERROR] 
[ERROR] Please refer to /home/perham/Study/LittleDarwin/Cases/joda-time-2.8.1/target/surefire-reports for the individual test results.
[ERROR] -> [Help 1]
[ERROR] 
[ERROR] To see the full stack trace of the errors, re-run Maven with the -e switch.
[ERROR] Re-run Maven using the -X switch to enable full debug logging.
[ERROR] 
[ERROR] For more information about the errors and possible solutions, please read the following articles:
[ERROR] [Help 1] http://cwiki.apache.org/confluence/display/MAVEN/MojoFailureException
