[INFO] Scanning for projects...
[INFO]                                                                         
[INFO] ------------------------------------------------------------------------
[INFO] Building Joda-Time 2.8.1
[INFO] ------------------------------------------------------------------------
[INFO] 
[INFO] --- maven-resources-plugin:2.7:resources (default-resources) @ joda-time ---
[INFO] Using 'UTF-8' encoding to copy filtered resources.
[INFO] Copying 2 resources to META-INF
[INFO] Copying 10 resources
[INFO] 
[INFO] --- maven-compiler-plugin:3.3:compile (default-compile) @ joda-time ---
[INFO] Changes detected - recompiling the module!
[INFO] Compiling 166 source files to /home/perham/Study/LittleDarwin/Cases/joda-time-2.8.1/target/classes
[INFO] 
[INFO] --- exec-maven-plugin:1.4.0:java (compile-tzdb) @ joda-time ---
Writing zoneinfo files
Writing ZoneInfoMap
[INFO] 
[INFO] --- maven-resources-plugin:2.7:testResources (default-testResources) @ joda-time ---
[INFO] Using 'UTF-8' encoding to copy filtered resources.
[INFO] Copying 34 resources
[INFO] 
[INFO] --- maven-compiler-plugin:3.3:testCompile (default-testCompile) @ joda-time ---
[INFO] Nothing to compile - all classes are up to date
[INFO] 
[INFO] --- maven-surefire-plugin:2.18.1:test (default-test) @ joda-time ---
[INFO] Surefire report directory: /home/perham/Study/LittleDarwin/Cases/joda-time-2.8.1/target/surefire-reports

-------------------------------------------------------
 T E S T S
-------------------------------------------------------
Running org.joda.time.TestAllPackages

TestBuddhistChronology.testCalendar

TestCopticChronology.testCalendar

TestEthiopicChronology.testCalendar

TestIslamicChronology.testCalendar

Testing Gregorian chronology over 1000 iterations
100% complete (i=1000)

Testing Julian chronology over 1000 iterations
100% complete (i=1000)
Writing zoneinfo files
Writing ZoneInfoMap
Tests run: 4157, Failures: 0, Errors: 7, Skipped: 0, Time elapsed: 5.206 sec <<< FAILURE! - in org.joda.time.TestAllPackages
testWithFieldAdded8(org.joda.time.TestTimeOfDay_Basics)  Time elapsed: 0.004 sec  <<< ERROR!
java.lang.IllegalArgumentException: Fields invalid for add
	at org.joda.time.field.BaseDateTimeField.addWrapPartial(BaseDateTimeField.java:80)
	at org.joda.time.TimeOfDay.withFieldAdded(TimeOfDay.java:558)
	at org.joda.time.TestTimeOfDay_Basics.testWithFieldAdded8(TestTimeOfDay_Basics.java:470)

testPropertyAddMinute(org.joda.time.TestTimeOfDay_Properties)  Time elapsed: 0.001 sec  <<< ERROR!
java.lang.IllegalArgumentException: Fields invalid for add
	at org.joda.time.field.BaseDateTimeField.addWrapPartial(BaseDateTimeField.java:80)
	at org.joda.time.TimeOfDay$Property.addToCopy(TimeOfDay.java:1098)
	at org.joda.time.TestTimeOfDay_Properties.testPropertyAddMinute(TestTimeOfDay_Properties.java:289)

testPropertyAddSecond(org.joda.time.TestTimeOfDay_Properties)  Time elapsed: 0.004 sec  <<< ERROR!
java.lang.IllegalArgumentException: Fields invalid for add
	at org.joda.time.field.BaseDateTimeField.addWrapPartial(BaseDateTimeField.java:80)
	at org.joda.time.TimeOfDay$Property.addToCopy(TimeOfDay.java:1098)
	at org.joda.time.TestTimeOfDay_Properties.testPropertyAddSecond(TestTimeOfDay_Properties.java:458)

testPropertyAddMilli(org.joda.time.TestTimeOfDay_Properties)  Time elapsed: 0.048 sec  <<< ERROR!
java.lang.IllegalArgumentException: Fields invalid for add
	at org.joda.time.field.BaseDateTimeField.addWrapPartial(BaseDateTimeField.java:80)
	at org.joda.time.TimeOfDay$Property.addToCopy(TimeOfDay.java:1098)
	at org.joda.time.TestTimeOfDay_Properties.testPropertyAddMilli(TestTimeOfDay_Properties.java:621)

testWithFieldAddWrapped8(org.joda.time.TestPartial_Basics)  Time elapsed: 0.001 sec  <<< ERROR!
java.lang.IllegalArgumentException: Fields invalid for add
	at org.joda.time.field.BaseDateTimeField.addWrapPartial(BaseDateTimeField.java:80)
	at org.joda.time.Partial.withFieldAddWrapped(Partial.java:600)
	at org.joda.time.TestPartial_Basics.testWithFieldAddWrapped8(TestPartial_Basics.java:709)

testTimeOfDayAdd(org.joda.time.chrono.TestGJChronology)  Time elapsed: 0.003 sec  <<< ERROR!
java.lang.IllegalArgumentException: Fields invalid for add
	at org.joda.time.field.BaseDateTimeField.addWrapPartial(BaseDateTimeField.java:80)
	at org.joda.time.TimeOfDay.withFieldAdded(TimeOfDay.java:558)
	at org.joda.time.TimeOfDay.minusMinutes(TimeOfDay.java:752)
	at org.joda.time.chrono.TestGJChronology.testTimeOfDayAdd(TestGJChronology.java:507)

testTimeOfDayAdd(org.joda.time.chrono.TestISOChronology)  Time elapsed: 0.001 sec  <<< ERROR!
java.lang.IllegalArgumentException: Fields invalid for add
	at org.joda.time.field.BaseDateTimeField.addWrapPartial(BaseDateTimeField.java:80)
	at org.joda.time.TimeOfDay.withFieldAdded(TimeOfDay.java:558)
	at org.joda.time.TimeOfDay.minusMinutes(TimeOfDay.java:752)
	at org.joda.time.chrono.TestISOChronology.testTimeOfDayAdd(TestISOChronology.java:436)


Results :

Tests in error: 
  org.joda.time.TestPartial_Basics#testWithFieldAddWrapped8 IllegalArgumentException
  org.joda.time.TestTimeOfDay_Basics#testWithFieldAdded8 IllegalArgumentException
  org.joda.time.TestTimeOfDay_Properties#testPropertyAddMilli IllegalArgumentException
  org.joda.time.TestTimeOfDay_Properties#testPropertyAddMinute IllegalArgumentException
  org.joda.time.TestTimeOfDay_Properties#testPropertyAddSecond IllegalArgumentException
  org.joda.time.chrono.TestGJChronology#testTimeOfDayAdd IllegalArgumentException
  org.joda.time.chrono.TestISOChronology#testTimeOfDayAdd IllegalArgumentException

Tests run: 4157, Failures: 0, Errors: 7, Skipped: 0

[INFO] ------------------------------------------------------------------------
[INFO] BUILD FAILURE
[INFO] ------------------------------------------------------------------------
[INFO] Total time: 15.324s
[INFO] Finished at: Thu Aug 06 04:04:36 BST 2015
[INFO] Final Memory: 8M/214M
[INFO] ------------------------------------------------------------------------
[ERROR] Failed to execute goal org.apache.maven.plugins:maven-surefire-plugin:2.18.1:test (default-test) on project joda-time: There are test failures.
[ERROR] 
[ERROR] Please refer to /home/perham/Study/LittleDarwin/Cases/joda-time-2.8.1/target/surefire-reports for the individual test results.
[ERROR] -> [Help 1]
[ERROR] 
[ERROR] To see the full stack trace of the errors, re-run Maven with the -e switch.
[ERROR] Re-run Maven using the -X switch to enable full debug logging.
[ERROR] 
[ERROR] For more information about the errors and possible solutions, please read the following articles:
[ERROR] [Help 1] http://cwiki.apache.org/confluence/display/MAVEN/MojoFailureException
