[INFO] Scanning for projects...
[INFO]                                                                         
[INFO] ------------------------------------------------------------------------
[INFO] Building Joda-Time 2.8.1
[INFO] ------------------------------------------------------------------------
[INFO] 
[INFO] --- maven-resources-plugin:2.7:resources (default-resources) @ joda-time ---
[INFO] Using 'UTF-8' encoding to copy filtered resources.
[INFO] Copying 2 resources to META-INF
[INFO] Copying 10 resources
[INFO] 
[INFO] --- maven-compiler-plugin:3.3:compile (default-compile) @ joda-time ---
[INFO] Changes detected - recompiling the module!
[INFO] Compiling 166 source files to /home/perham/Study/LittleDarwin/Cases/joda-time-2.8.1/target/classes
[INFO] 
[INFO] --- exec-maven-plugin:1.4.0:java (compile-tzdb) @ joda-time ---
Writing zoneinfo files
Writing ZoneInfoMap
[INFO] 
[INFO] --- maven-resources-plugin:2.7:testResources (default-testResources) @ joda-time ---
[INFO] Using 'UTF-8' encoding to copy filtered resources.
[INFO] Copying 34 resources
[INFO] 
[INFO] --- maven-compiler-plugin:3.3:testCompile (default-testCompile) @ joda-time ---
[INFO] Nothing to compile - all classes are up to date
[INFO] 
[INFO] --- maven-surefire-plugin:2.18.1:test (default-test) @ joda-time ---
[INFO] Surefire report directory: /home/perham/Study/LittleDarwin/Cases/joda-time-2.8.1/target/surefire-reports

-------------------------------------------------------
 T E S T S
-------------------------------------------------------
Running org.joda.time.TestAllPackages

TestBuddhistChronology.testCalendar

TestCopticChronology.testCalendar

TestEthiopicChronology.testCalendar

TestIslamicChronology.testCalendar

Testing Gregorian chronology over 1000 iterations
100% complete (i=1000)

Testing Julian chronology over 1000 iterations
100% complete (i=1000)
Writing zoneinfo files
Writing ZoneInfoMap
Tests run: 4157, Failures: 8, Errors: 64, Skipped: 0, Time elapsed: 5.125 sec <<< FAILURE! - in org.joda.time.TestAllPackages
testPlus_RP(org.joda.time.TestTimeOfDay_Basics)  Time elapsed: 0.004 sec  <<< ERROR!
java.lang.IndexOutOfBoundsException: Invalid index: 4
	at org.joda.time.TimeOfDay.getField(TimeOfDay.java:452)
	at org.joda.time.base.AbstractPartial.getField(AbstractPartial.java:105)
	at org.joda.time.field.BaseDateTimeField.set(BaseDateTimeField.java:98)
	at org.joda.time.field.BaseDateTimeField.addWrapPartial(BaseDateTimeField.java:84)
	at org.joda.time.TimeOfDay.withPeriodAdded(TimeOfDay.java:588)
	at org.joda.time.TimeOfDay.plus(TimeOfDay.java:611)
	at org.joda.time.TestTimeOfDay_Basics.testPlus_RP(TestTimeOfDay_Basics.java:489)

testWithers(org.joda.time.TestTimeOfDay_Basics)  Time elapsed: 0 sec  <<< ERROR!
java.lang.IndexOutOfBoundsException: Invalid index: 4
	at org.joda.time.TimeOfDay.getField(TimeOfDay.java:452)
	at org.joda.time.base.AbstractPartial.getField(AbstractPartial.java:105)
	at org.joda.time.field.BaseDateTimeField.set(BaseDateTimeField.java:98)
	at org.joda.time.TimeOfDay.withMillisOfSecond(TimeOfDay.java:956)
	at org.joda.time.TestTimeOfDay_Basics.testWithers(TestTimeOfDay_Basics.java:821)

testPlusMillis_int(org.joda.time.TestTimeOfDay_Basics)  Time elapsed: 0 sec  <<< ERROR!
java.lang.IndexOutOfBoundsException: Invalid index: 4
	at org.joda.time.TimeOfDay.getField(TimeOfDay.java:452)
	at org.joda.time.base.AbstractPartial.getField(AbstractPartial.java:105)
	at org.joda.time.field.BaseDateTimeField.set(BaseDateTimeField.java:98)
	at org.joda.time.field.BaseDateTimeField.addWrapPartial(BaseDateTimeField.java:84)
	at org.joda.time.TimeOfDay.withFieldAdded(TimeOfDay.java:558)
	at org.joda.time.TimeOfDay.plusMillis(TimeOfDay.java:692)
	at org.joda.time.TestTimeOfDay_Basics.testPlusMillis_int(TestTimeOfDay_Basics.java:529)

testMinus_RP(org.joda.time.TestTimeOfDay_Basics)  Time elapsed: 0.001 sec  <<< ERROR!
java.lang.IndexOutOfBoundsException: Invalid index: 4
	at org.joda.time.TimeOfDay.getField(TimeOfDay.java:452)
	at org.joda.time.base.AbstractPartial.getField(AbstractPartial.java:105)
	at org.joda.time.field.BaseDateTimeField.set(BaseDateTimeField.java:98)
	at org.joda.time.field.BaseDateTimeField.addWrapPartial(BaseDateTimeField.java:84)
	at org.joda.time.TimeOfDay.withPeriodAdded(TimeOfDay.java:588)
	at org.joda.time.TimeOfDay.minus(TimeOfDay.java:711)
	at org.joda.time.TestTimeOfDay_Basics.testMinus_RP(TestTimeOfDay_Basics.java:540)

testMinusMillis_int(org.joda.time.TestTimeOfDay_Basics)  Time elapsed: 0.001 sec  <<< ERROR!
java.lang.IndexOutOfBoundsException: Invalid index: 4
	at org.joda.time.TimeOfDay.getField(TimeOfDay.java:452)
	at org.joda.time.base.AbstractPartial.getField(AbstractPartial.java:105)
	at org.joda.time.field.BaseDateTimeField.set(BaseDateTimeField.java:98)
	at org.joda.time.field.BaseDateTimeField.addWrapPartial(BaseDateTimeField.java:84)
	at org.joda.time.TimeOfDay.withFieldAdded(TimeOfDay.java:558)
	at org.joda.time.TimeOfDay.minusMillis(TimeOfDay.java:792)
	at org.joda.time.TestTimeOfDay_Basics.testMinusMillis_int(TestTimeOfDay_Basics.java:580)

testWithFieldAdded7(org.joda.time.TestTimeOfDay_Basics)  Time elapsed: 0 sec  <<< ERROR!
java.lang.IndexOutOfBoundsException: Invalid index: 4
	at org.joda.time.TimeOfDay.getField(TimeOfDay.java:452)
	at org.joda.time.base.AbstractPartial.getField(AbstractPartial.java:105)
	at org.joda.time.field.BaseDateTimeField.set(BaseDateTimeField.java:98)
	at org.joda.time.field.BaseDateTimeField.addWrapPartial(BaseDateTimeField.java:84)
	at org.joda.time.TimeOfDay.withFieldAdded(TimeOfDay.java:558)
	at org.joda.time.TestTimeOfDay_Basics.testWithFieldAdded7(TestTimeOfDay_Basics.java:452)

testWithFieldAdded8(org.joda.time.TestTimeOfDay_Basics)  Time elapsed: 0 sec  <<< ERROR!
java.lang.IndexOutOfBoundsException: Invalid index: 4
	at org.joda.time.TimeOfDay.getField(TimeOfDay.java:452)
	at org.joda.time.base.AbstractPartial.getField(AbstractPartial.java:105)
	at org.joda.time.field.BaseDateTimeField.set(BaseDateTimeField.java:98)
	at org.joda.time.field.BaseDateTimeField.addWrapPartial(BaseDateTimeField.java:84)
	at org.joda.time.TimeOfDay.withFieldAdded(TimeOfDay.java:558)
	at org.joda.time.TestTimeOfDay_Basics.testWithFieldAdded8(TestTimeOfDay_Basics.java:470)

testPropertySetMilli(org.joda.time.TestTimeOfDay_Properties)  Time elapsed: 0 sec  <<< ERROR!
java.lang.IndexOutOfBoundsException: Invalid index: 4
	at org.joda.time.TimeOfDay.getField(TimeOfDay.java:452)
	at org.joda.time.base.AbstractPartial.getField(AbstractPartial.java:105)
	at org.joda.time.field.BaseDateTimeField.set(BaseDateTimeField.java:98)
	at org.joda.time.TimeOfDay$Property.setCopy(TimeOfDay.java:1165)
	at org.joda.time.TestTimeOfDay_Properties.testPropertySetMilli(TestTimeOfDay_Properties.java:686)

testPropertySetTextMilli(org.joda.time.TestTimeOfDay_Properties)  Time elapsed: 0.001 sec  <<< ERROR!
java.lang.IndexOutOfBoundsException: Invalid index: 4
	at org.joda.time.TimeOfDay.getField(TimeOfDay.java:452)
	at org.joda.time.base.AbstractPartial.getField(AbstractPartial.java:105)
	at org.joda.time.field.BaseDateTimeField.set(BaseDateTimeField.java:98)
	at org.joda.time.field.BaseDateTimeField.set(BaseDateTimeField.java:106)
	at org.joda.time.TimeOfDay$Property.setCopy(TimeOfDay.java:1182)
	at org.joda.time.TimeOfDay$Property.setCopy(TimeOfDay.java:1197)
	at org.joda.time.TestTimeOfDay_Properties.testPropertySetTextMilli(TestTimeOfDay_Properties.java:702)

testPropertyAddMilli(org.joda.time.TestTimeOfDay_Properties)  Time elapsed: 0.001 sec  <<< ERROR!
java.lang.IndexOutOfBoundsException: Invalid index: 4
	at org.joda.time.TimeOfDay.getField(TimeOfDay.java:452)
	at org.joda.time.base.AbstractPartial.getField(AbstractPartial.java:105)
	at org.joda.time.field.BaseDateTimeField.set(BaseDateTimeField.java:98)
	at org.joda.time.field.BaseDateTimeField.addWrapPartial(BaseDateTimeField.java:84)
	at org.joda.time.TimeOfDay$Property.addToCopy(TimeOfDay.java:1098)
	at org.joda.time.TestTimeOfDay_Properties.testPropertyAddMilli(TestTimeOfDay_Properties.java:599)

testPropertyAddNoWrapMilli(org.joda.time.TestTimeOfDay_Properties)  Time elapsed: 0 sec  <<< ERROR!
java.lang.IndexOutOfBoundsException: Invalid index: 4
	at org.joda.time.TimeOfDay.getField(TimeOfDay.java:452)
	at org.joda.time.base.AbstractPartial.getField(AbstractPartial.java:105)
	at org.joda.time.field.BaseDateTimeField.set(BaseDateTimeField.java:98)
	at org.joda.time.field.BaseDateTimeField.add(BaseDateTimeField.java:57)
	at org.joda.time.TimeOfDay$Property.addNoWrapToCopy(TimeOfDay.java:1124)
	at org.joda.time.TestTimeOfDay_Properties.testPropertyAddNoWrapMilli(TestTimeOfDay_Properties.java:633)

testPropertyAddWrapFieldMilli(org.joda.time.TestTimeOfDay_Properties)  Time elapsed: 0.001 sec  <<< ERROR!
java.lang.IndexOutOfBoundsException: Invalid index: 4
	at org.joda.time.TimeOfDay.getField(TimeOfDay.java:452)
	at org.joda.time.base.AbstractPartial.getField(AbstractPartial.java:105)
	at org.joda.time.field.BaseDateTimeField.set(BaseDateTimeField.java:98)
	at org.joda.time.field.BaseDateTimeField.addWrapField(BaseDateTimeField.java:90)
	at org.joda.time.TimeOfDay$Property.addWrapFieldToCopy(TimeOfDay.java:1148)
	at org.joda.time.TestTimeOfDay_Properties.testPropertyAddWrapFieldMilli(TestTimeOfDay_Properties.java:673)

testPlus_RP(org.joda.time.TestYearMonthDay_Basics)  Time elapsed: 0 sec  <<< ERROR!
java.lang.IndexOutOfBoundsException: Invalid index: 3
	at org.joda.time.YearMonthDay.getField(YearMonthDay.java:339)
	at org.joda.time.base.AbstractPartial.getField(AbstractPartial.java:105)
	at org.joda.time.field.BaseDateTimeField.set(BaseDateTimeField.java:98)
	at org.joda.time.field.BaseDateTimeField.add(BaseDateTimeField.java:57)
	at org.joda.time.YearMonthDay.withPeriodAdded(YearMonthDay.java:473)
	at org.joda.time.YearMonthDay.plus(YearMonthDay.java:495)
	at org.joda.time.TestYearMonthDay_Basics.testPlus_RP(TestYearMonthDay_Basics.java:447)

testWithers(org.joda.time.TestYearMonthDay_Basics)  Time elapsed: 0.01 sec  <<< ERROR!
java.lang.IndexOutOfBoundsException: Invalid index: 3
	at org.joda.time.YearMonthDay.getField(YearMonthDay.java:339)
	at org.joda.time.base.AbstractPartial.getField(AbstractPartial.java:105)
	at org.joda.time.field.BaseDateTimeField.set(BaseDateTimeField.java:98)
	at org.joda.time.YearMonthDay.withDayOfMonth(YearMonthDay.java:880)
	at org.joda.time.TestYearMonthDay_Basics.testWithers(TestYearMonthDay_Basics.java:748)

testPlusDays_int(org.joda.time.TestYearMonthDay_Basics)  Time elapsed: 0.001 sec  <<< ERROR!
java.lang.IndexOutOfBoundsException: Invalid index: 3
	at org.joda.time.YearMonthDay.getField(YearMonthDay.java:339)
	at org.joda.time.base.AbstractPartial.getField(AbstractPartial.java:105)
	at org.joda.time.field.BaseDateTimeField.set(BaseDateTimeField.java:98)
	at org.joda.time.field.BaseDateTimeField.add(BaseDateTimeField.java:57)
	at org.joda.time.YearMonthDay.withFieldAdded(YearMonthDay.java:444)
	at org.joda.time.YearMonthDay.plusDays(YearMonthDay.java:556)
	at org.joda.time.TestYearMonthDay_Basics.testPlusDays_int(TestYearMonthDay_Basics.java:477)

testMinus_RP(org.joda.time.TestYearMonthDay_Basics)  Time elapsed: 0.002 sec  <<< ERROR!
java.lang.IndexOutOfBoundsException: Invalid index: 3
	at org.joda.time.YearMonthDay.getField(YearMonthDay.java:339)
	at org.joda.time.base.AbstractPartial.getField(AbstractPartial.java:105)
	at org.joda.time.field.BaseDateTimeField.set(BaseDateTimeField.java:98)
	at org.joda.time.field.BaseDateTimeField.add(BaseDateTimeField.java:57)
	at org.joda.time.YearMonthDay.withPeriodAdded(YearMonthDay.java:473)
	at org.joda.time.YearMonthDay.minus(YearMonthDay.java:574)
	at org.joda.time.TestYearMonthDay_Basics.testMinus_RP(TestYearMonthDay_Basics.java:488)

testMinusDays_int(org.joda.time.TestYearMonthDay_Basics)  Time elapsed: 0.001 sec  <<< ERROR!
java.lang.IndexOutOfBoundsException: Invalid index: 3
	at org.joda.time.YearMonthDay.getField(YearMonthDay.java:339)
	at org.joda.time.base.AbstractPartial.getField(AbstractPartial.java:105)
	at org.joda.time.field.BaseDateTimeField.set(BaseDateTimeField.java:98)
	at org.joda.time.field.BaseDateTimeField.add(BaseDateTimeField.java:57)
	at org.joda.time.YearMonthDay.withFieldAdded(YearMonthDay.java:444)
	at org.joda.time.YearMonthDay.minusDays(YearMonthDay.java:635)
	at org.joda.time.TestYearMonthDay_Basics.testMinusDays_int(TestYearMonthDay_Basics.java:518)

testPropertyWithMaximumValueDayOfMonth(org.joda.time.TestYearMonthDay_Properties)  Time elapsed: 0 sec  <<< ERROR!
java.lang.IndexOutOfBoundsException: Invalid index: 3
	at org.joda.time.YearMonthDay.getField(YearMonthDay.java:339)
	at org.joda.time.base.AbstractPartial.getField(AbstractPartial.java:105)
	at org.joda.time.field.BaseDateTimeField.set(BaseDateTimeField.java:98)
	at org.joda.time.YearMonthDay$Property.setCopy(YearMonthDay.java:1052)
	at org.joda.time.YearMonthDay$Property.withMaximumValue(YearMonthDay.java:1104)
	at org.joda.time.TestYearMonthDay_Properties.testPropertyWithMaximumValueDayOfMonth(TestYearMonthDay_Properties.java:461)

testPropertyWithMinimumValueDayOfMonth(org.joda.time.TestYearMonthDay_Properties)  Time elapsed: 0.001 sec  <<< ERROR!
java.lang.IndexOutOfBoundsException: Invalid index: 3
	at org.joda.time.YearMonthDay.getField(YearMonthDay.java:339)
	at org.joda.time.base.AbstractPartial.getField(AbstractPartial.java:105)
	at org.joda.time.field.BaseDateTimeField.set(BaseDateTimeField.java:98)
	at org.joda.time.YearMonthDay$Property.setCopy(YearMonthDay.java:1052)
	at org.joda.time.YearMonthDay$Property.withMinimumValue(YearMonthDay.java:1117)
	at org.joda.time.TestYearMonthDay_Properties.testPropertyWithMinimumValueDayOfMonth(TestYearMonthDay_Properties.java:468)

testPropertyAddWrapFieldMonth(org.joda.time.TestYearMonthDay_Properties)  Time elapsed: 0.001 sec  <<< FAILURE!
junit.framework.AssertionFailedError: expected:<29> but was:<31>
	at junit.framework.Assert.fail(Assert.java:47)
	at junit.framework.Assert.failNotEquals(Assert.java:280)
	at junit.framework.Assert.assertEquals(Assert.java:64)
	at junit.framework.Assert.assertEquals(Assert.java:198)
	at junit.framework.Assert.assertEquals(Assert.java:204)
	at org.joda.time.TestYearMonthDay_Properties.check(TestYearMonthDay_Properties.java:557)
	at org.joda.time.TestYearMonthDay_Properties.testPropertyAddWrapFieldMonth(TestYearMonthDay_Properties.java:269)

testPropertySetMonth(org.joda.time.TestYearMonthDay_Properties)  Time elapsed: 0 sec  <<< FAILURE!
junit.framework.AssertionFailedError: expected:<29> but was:<31>
	at junit.framework.Assert.fail(Assert.java:47)
	at junit.framework.Assert.failNotEquals(Assert.java:280)
	at junit.framework.Assert.assertEquals(Assert.java:64)
	at junit.framework.Assert.assertEquals(Assert.java:198)
	at junit.framework.Assert.assertEquals(Assert.java:204)
	at org.joda.time.TestYearMonthDay_Properties.check(TestYearMonthDay_Properties.java:557)
	at org.joda.time.TestYearMonthDay_Properties.testPropertySetMonth(TestYearMonthDay_Properties.java:290)

testPropertyAddDay(org.joda.time.TestYearMonthDay_Properties)  Time elapsed: 0 sec  <<< ERROR!
java.lang.IndexOutOfBoundsException: Invalid index: 3
	at org.joda.time.YearMonthDay.getField(YearMonthDay.java:339)
	at org.joda.time.base.AbstractPartial.getField(AbstractPartial.java:105)
	at org.joda.time.field.BaseDateTimeField.set(BaseDateTimeField.java:98)
	at org.joda.time.field.BaseDateTimeField.add(BaseDateTimeField.java:57)
	at org.joda.time.YearMonthDay$Property.addToCopy(YearMonthDay.java:1011)
	at org.joda.time.TestYearMonthDay_Properties.testPropertyAddDay(TestYearMonthDay_Properties.java:375)

testPropertyAddWrapFieldDay(org.joda.time.TestYearMonthDay_Properties)  Time elapsed: 0 sec  <<< ERROR!
java.lang.IndexOutOfBoundsException: Invalid index: 3
	at org.joda.time.YearMonthDay.getField(YearMonthDay.java:339)
	at org.joda.time.base.AbstractPartial.getField(AbstractPartial.java:105)
	at org.joda.time.field.BaseDateTimeField.set(BaseDateTimeField.java:98)
	at org.joda.time.field.BaseDateTimeField.addWrapField(BaseDateTimeField.java:90)
	at org.joda.time.YearMonthDay$Property.addWrapFieldToCopy(YearMonthDay.java:1035)
	at org.joda.time.TestYearMonthDay_Properties.testPropertyAddWrapFieldDay(TestYearMonthDay_Properties.java:412)

testPropertySetDay(org.joda.time.TestYearMonthDay_Properties)  Time elapsed: 0.001 sec  <<< ERROR!
java.lang.IndexOutOfBoundsException: Invalid index: 3
	at org.joda.time.YearMonthDay.getField(YearMonthDay.java:339)
	at org.joda.time.base.AbstractPartial.getField(AbstractPartial.java:105)
	at org.joda.time.field.BaseDateTimeField.set(BaseDateTimeField.java:98)
	at org.joda.time.YearMonthDay$Property.setCopy(YearMonthDay.java:1052)
	at org.joda.time.TestYearMonthDay_Properties.testPropertySetDay(TestYearMonthDay_Properties.java:438)

testPropertySetTextDay(org.joda.time.TestYearMonthDay_Properties)  Time elapsed: 0 sec  <<< ERROR!
java.lang.IndexOutOfBoundsException: Invalid index: 3
	at org.joda.time.YearMonthDay.getField(YearMonthDay.java:339)
	at org.joda.time.base.AbstractPartial.getField(AbstractPartial.java:105)
	at org.joda.time.field.BaseDateTimeField.set(BaseDateTimeField.java:98)
	at org.joda.time.field.BaseDateTimeField.set(BaseDateTimeField.java:106)
	at org.joda.time.YearMonthDay$Property.setCopy(YearMonthDay.java:1069)
	at org.joda.time.YearMonthDay$Property.setCopy(YearMonthDay.java:1084)
	at org.joda.time.TestYearMonthDay_Properties.testPropertySetTextDay(TestYearMonthDay_Properties.java:454)

testPlus_RP(org.joda.time.TestYearMonth_Basics)  Time elapsed: 0 sec  <<< ERROR!
java.lang.IndexOutOfBoundsException: Invalid index: 2
	at org.joda.time.YearMonth.getField(YearMonth.java:406)
	at org.joda.time.base.AbstractPartial.getField(AbstractPartial.java:105)
	at org.joda.time.field.BaseDateTimeField.set(BaseDateTimeField.java:98)
	at org.joda.time.field.BaseDateTimeField.add(BaseDateTimeField.java:57)
	at org.joda.time.YearMonth.withPeriodAdded(YearMonth.java:540)
	at org.joda.time.YearMonth.plus(YearMonth.java:562)
	at org.joda.time.TestYearMonth_Basics.testPlus_RP(TestYearMonth_Basics.java:441)

testWithers(org.joda.time.TestYearMonth_Basics)  Time elapsed: 0.001 sec  <<< ERROR!
java.lang.IndexOutOfBoundsException: Invalid index: 2
	at org.joda.time.YearMonth.getField(YearMonth.java:406)
	at org.joda.time.base.AbstractPartial.getField(AbstractPartial.java:105)
	at org.joda.time.field.BaseDateTimeField.set(BaseDateTimeField.java:98)
	at org.joda.time.YearMonth.withMonthOfYear(YearMonth.java:753)
	at org.joda.time.TestYearMonth_Basics.testWithers(TestYearMonth_Basics.java:573)

testPlusMonths_int(org.joda.time.TestYearMonth_Basics)  Time elapsed: 0.001 sec  <<< ERROR!
java.lang.IndexOutOfBoundsException: Invalid index: 2
	at org.joda.time.YearMonth.getField(YearMonth.java:406)
	at org.joda.time.base.AbstractPartial.getField(AbstractPartial.java:105)
	at org.joda.time.field.BaseDateTimeField.set(BaseDateTimeField.java:98)
	at org.joda.time.field.BaseDateTimeField.add(BaseDateTimeField.java:57)
	at org.joda.time.YearMonth.withFieldAdded(YearMonth.java:511)
	at org.joda.time.YearMonth.plusMonths(YearMonth.java:601)
	at org.joda.time.TestYearMonth_Basics.testPlusMonths_int(TestYearMonth_Basics.java:461)

testMinus_RP(org.joda.time.TestYearMonth_Basics)  Time elapsed: 0 sec  <<< ERROR!
java.lang.IndexOutOfBoundsException: Invalid index: 2
	at org.joda.time.YearMonth.getField(YearMonth.java:406)
	at org.joda.time.base.AbstractPartial.getField(AbstractPartial.java:105)
	at org.joda.time.field.BaseDateTimeField.set(BaseDateTimeField.java:98)
	at org.joda.time.field.BaseDateTimeField.add(BaseDateTimeField.java:57)
	at org.joda.time.YearMonth.withPeriodAdded(YearMonth.java:540)
	at org.joda.time.YearMonth.minus(YearMonth.java:619)
	at org.joda.time.TestYearMonth_Basics.testMinus_RP(TestYearMonth_Basics.java:472)

testMinusMonths_int(org.joda.time.TestYearMonth_Basics)  Time elapsed: 0.001 sec  <<< ERROR!
java.lang.IndexOutOfBoundsException: Invalid index: 2
	at org.joda.time.YearMonth.getField(YearMonth.java:406)
	at org.joda.time.base.AbstractPartial.getField(AbstractPartial.java:105)
	at org.joda.time.field.BaseDateTimeField.set(BaseDateTimeField.java:98)
	at org.joda.time.field.BaseDateTimeField.add(BaseDateTimeField.java:57)
	at org.joda.time.YearMonth.withFieldAdded(YearMonth.java:511)
	at org.joda.time.YearMonth.minusMonths(YearMonth.java:658)
	at org.joda.time.TestYearMonth_Basics.testMinusMonths_int(TestYearMonth_Basics.java:492)

testToInterval(org.joda.time.TestYearMonth_Basics)  Time elapsed: 0 sec  <<< ERROR!
java.lang.IndexOutOfBoundsException: Invalid index: 2
	at org.joda.time.YearMonth.getField(YearMonth.java:406)
	at org.joda.time.base.AbstractPartial.getField(AbstractPartial.java:105)
	at org.joda.time.field.BaseDateTimeField.set(BaseDateTimeField.java:98)
	at org.joda.time.field.BaseDateTimeField.add(BaseDateTimeField.java:57)
	at org.joda.time.YearMonth.withFieldAdded(YearMonth.java:511)
	at org.joda.time.YearMonth.plusMonths(YearMonth.java:601)
	at org.joda.time.YearMonth.toInterval(YearMonth.java:699)
	at org.joda.time.YearMonth.toInterval(YearMonth.java:683)
	at org.joda.time.TestYearMonth_Basics.testToInterval(TestYearMonth_Basics.java:540)

testToInterval_Zone(org.joda.time.TestYearMonth_Basics)  Time elapsed: 0.001 sec  <<< ERROR!
java.lang.IndexOutOfBoundsException: Invalid index: 2
	at org.joda.time.YearMonth.getField(YearMonth.java:406)
	at org.joda.time.base.AbstractPartial.getField(AbstractPartial.java:105)
	at org.joda.time.field.BaseDateTimeField.set(BaseDateTimeField.java:98)
	at org.joda.time.field.BaseDateTimeField.add(BaseDateTimeField.java:57)
	at org.joda.time.YearMonth.withFieldAdded(YearMonth.java:511)
	at org.joda.time.YearMonth.plusMonths(YearMonth.java:601)
	at org.joda.time.YearMonth.toInterval(YearMonth.java:699)
	at org.joda.time.TestYearMonth_Basics.testToInterval_Zone(TestYearMonth_Basics.java:551)

testToInterval_nullZone(org.joda.time.TestYearMonth_Basics)  Time elapsed: 0 sec  <<< ERROR!
java.lang.IndexOutOfBoundsException: Invalid index: 2
	at org.joda.time.YearMonth.getField(YearMonth.java:406)
	at org.joda.time.base.AbstractPartial.getField(AbstractPartial.java:105)
	at org.joda.time.field.BaseDateTimeField.set(BaseDateTimeField.java:98)
	at org.joda.time.field.BaseDateTimeField.add(BaseDateTimeField.java:57)
	at org.joda.time.YearMonth.withFieldAdded(YearMonth.java:511)
	at org.joda.time.YearMonth.plusMonths(YearMonth.java:601)
	at org.joda.time.YearMonth.toInterval(YearMonth.java:699)
	at org.joda.time.TestYearMonth_Basics.testToInterval_nullZone(TestYearMonth_Basics.java:561)

testPropertyAddWrapFieldMonth(org.joda.time.TestYearMonth_Properties)  Time elapsed: 0.001 sec  <<< ERROR!
java.lang.IndexOutOfBoundsException: Invalid index: 2
	at org.joda.time.YearMonth.getField(YearMonth.java:406)
	at org.joda.time.base.AbstractPartial.getField(AbstractPartial.java:105)
	at org.joda.time.field.BaseDateTimeField.set(BaseDateTimeField.java:98)
	at org.joda.time.field.BaseDateTimeField.addWrapField(BaseDateTimeField.java:90)
	at org.joda.time.YearMonth$Property.addWrapFieldToCopy(YearMonth.java:938)
	at org.joda.time.TestYearMonth_Properties.testPropertyAddWrapFieldMonth(TestYearMonth_Properties.java:242)

testPropertySetMonth(org.joda.time.TestYearMonth_Properties)  Time elapsed: 0 sec  <<< ERROR!
java.lang.IndexOutOfBoundsException: Invalid index: 2
	at org.joda.time.YearMonth.getField(YearMonth.java:406)
	at org.joda.time.base.AbstractPartial.getField(AbstractPartial.java:105)
	at org.joda.time.field.BaseDateTimeField.set(BaseDateTimeField.java:98)
	at org.joda.time.YearMonth$Property.setCopy(YearMonth.java:955)
	at org.joda.time.TestYearMonth_Properties.testPropertySetMonth(TestYearMonth_Properties.java:255)

testPropertySetTextMonth(org.joda.time.TestYearMonth_Properties)  Time elapsed: 0.001 sec  <<< ERROR!
java.lang.IndexOutOfBoundsException: Invalid index: 2
	at org.joda.time.YearMonth.getField(YearMonth.java:406)
	at org.joda.time.base.AbstractPartial.getField(AbstractPartial.java:105)
	at org.joda.time.field.BaseDateTimeField.set(BaseDateTimeField.java:98)
	at org.joda.time.field.BaseDateTimeField.set(BaseDateTimeField.java:106)
	at org.joda.time.YearMonth$Property.setCopy(YearMonth.java:972)
	at org.joda.time.YearMonth$Property.setCopy(YearMonth.java:987)
	at org.joda.time.TestYearMonth_Properties.testPropertySetTextMonth(TestYearMonth_Properties.java:271)

testPlus_RP(org.joda.time.TestMonthDay_Basics)  Time elapsed: 0.001 sec  <<< ERROR!
java.lang.IndexOutOfBoundsException: Invalid index: 2
	at org.joda.time.MonthDay.getField(MonthDay.java:414)
	at org.joda.time.base.AbstractPartial.getField(AbstractPartial.java:105)
	at org.joda.time.field.BaseDateTimeField.set(BaseDateTimeField.java:98)
	at org.joda.time.field.BaseDateTimeField.add(BaseDateTimeField.java:57)
	at org.joda.time.MonthDay.withPeriodAdded(MonthDay.java:548)
	at org.joda.time.MonthDay.plus(MonthDay.java:570)
	at org.joda.time.TestMonthDay_Basics.testPlus_RP(TestMonthDay_Basics.java:436)

testWithers(org.joda.time.TestMonthDay_Basics)  Time elapsed: 0 sec  <<< ERROR!
java.lang.IndexOutOfBoundsException: Invalid index: 2
	at org.joda.time.MonthDay.getField(MonthDay.java:414)
	at org.joda.time.base.AbstractPartial.getField(AbstractPartial.java:105)
	at org.joda.time.field.BaseDateTimeField.set(BaseDateTimeField.java:98)
	at org.joda.time.MonthDay.withDayOfMonth(MonthDay.java:739)
	at org.joda.time.TestMonthDay_Basics.testWithers(TestMonthDay_Basics.java:739)

testPlusDays_int(org.joda.time.TestMonthDay_Basics)  Time elapsed: 0.001 sec  <<< ERROR!
java.lang.IndexOutOfBoundsException: Invalid index: 2
	at org.joda.time.MonthDay.getField(MonthDay.java:414)
	at org.joda.time.base.AbstractPartial.getField(AbstractPartial.java:105)
	at org.joda.time.field.BaseDateTimeField.set(BaseDateTimeField.java:98)
	at org.joda.time.field.BaseDateTimeField.add(BaseDateTimeField.java:57)
	at org.joda.time.MonthDay.withFieldAdded(MonthDay.java:519)
	at org.joda.time.MonthDay.plusDays(MonthDay.java:615)
	at org.joda.time.TestMonthDay_Basics.testPlusDays_int(TestMonthDay_Basics.java:502)

testMinus_RP(org.joda.time.TestMonthDay_Basics)  Time elapsed: 0 sec  <<< ERROR!
java.lang.IndexOutOfBoundsException: Invalid index: 2
	at org.joda.time.MonthDay.getField(MonthDay.java:414)
	at org.joda.time.base.AbstractPartial.getField(AbstractPartial.java:105)
	at org.joda.time.field.BaseDateTimeField.set(BaseDateTimeField.java:98)
	at org.joda.time.field.BaseDateTimeField.add(BaseDateTimeField.java:57)
	at org.joda.time.MonthDay.withPeriodAdded(MonthDay.java:548)
	at org.joda.time.MonthDay.minus(MonthDay.java:633)
	at org.joda.time.TestMonthDay_Basics.testMinus_RP(TestMonthDay_Basics.java:572)

testMinusDays_int(org.joda.time.TestMonthDay_Basics)  Time elapsed: 0.001 sec  <<< ERROR!
java.lang.IndexOutOfBoundsException: Invalid index: 2
	at org.joda.time.MonthDay.getField(MonthDay.java:414)
	at org.joda.time.base.AbstractPartial.getField(AbstractPartial.java:105)
	at org.joda.time.field.BaseDateTimeField.set(BaseDateTimeField.java:98)
	at org.joda.time.field.BaseDateTimeField.add(BaseDateTimeField.java:57)
	at org.joda.time.MonthDay.withFieldAdded(MonthDay.java:519)
	at org.joda.time.MonthDay.minusDays(MonthDay.java:675)
	at org.joda.time.TestMonthDay_Basics.testMinusDays_int(TestMonthDay_Basics.java:638)

testPlusMonths_int_endOfMonthAdjust(org.joda.time.TestMonthDay_Basics)  Time elapsed: 0 sec  <<< FAILURE!
junit.framework.AssertionFailedError: expected:<--04-30> but was:<--04-31>
	at junit.framework.Assert.fail(Assert.java:47)
	at junit.framework.Assert.failNotEquals(Assert.java:280)
	at junit.framework.Assert.assertEquals(Assert.java:64)
	at junit.framework.Assert.assertEquals(Assert.java:71)
	at org.joda.time.TestMonthDay_Basics.testPlusMonths_int_endOfMonthAdjust(TestMonthDay_Basics.java:469)

testPlusMonths_int_negativeEndOfMonthAdjust(org.joda.time.TestMonthDay_Basics)  Time elapsed: 0 sec  <<< FAILURE!
junit.framework.AssertionFailedError: expected:<--02-29> but was:<--02-31>
	at junit.framework.Assert.fail(Assert.java:47)
	at junit.framework.Assert.failNotEquals(Assert.java:280)
	at junit.framework.Assert.assertEquals(Assert.java:64)
	at junit.framework.Assert.assertEquals(Assert.java:71)
	at org.joda.time.TestMonthDay_Basics.testPlusMonths_int_negativeEndOfMonthAdjust(TestMonthDay_Basics.java:476)

testPlusMonths_int_adjust(org.joda.time.TestMonthDay_Basics)  Time elapsed: 0.001 sec  <<< FAILURE!
junit.framework.AssertionFailedError: expected:<--09-30> but was:<--09-31>
	at junit.framework.Assert.fail(Assert.java:47)
	at junit.framework.Assert.failNotEquals(Assert.java:280)
	at junit.framework.Assert.assertEquals(Assert.java:64)
	at junit.framework.Assert.assertEquals(Assert.java:71)
	at org.joda.time.TestMonthDay_Basics.testPlusMonths_int_adjust(TestMonthDay_Basics.java:496)

testPlusDays_int_wrapMonth(org.joda.time.TestMonthDay_Basics)  Time elapsed: 0 sec  <<< ERROR!
java.lang.IndexOutOfBoundsException: Invalid index: 2
	at org.joda.time.MonthDay.getField(MonthDay.java:414)
	at org.joda.time.base.AbstractPartial.getField(AbstractPartial.java:105)
	at org.joda.time.field.BaseDateTimeField.set(BaseDateTimeField.java:98)
	at org.joda.time.field.BaseDateTimeField.add(BaseDateTimeField.java:57)
	at org.joda.time.MonthDay.withFieldAdded(MonthDay.java:519)
	at org.joda.time.MonthDay.plusDays(MonthDay.java:615)
	at org.joda.time.TestMonthDay_Basics.testPlusDays_int_wrapMonth(TestMonthDay_Basics.java:509)

testPlusDays_int_wrapMonthTwice(org.joda.time.TestMonthDay_Basics)  Time elapsed: 0 sec  <<< ERROR!
java.lang.IndexOutOfBoundsException: Invalid index: 2
	at org.joda.time.MonthDay.getField(MonthDay.java:414)
	at org.joda.time.base.AbstractPartial.getField(AbstractPartial.java:105)
	at org.joda.time.field.BaseDateTimeField.set(BaseDateTimeField.java:98)
	at org.joda.time.field.BaseDateTimeField.add(BaseDateTimeField.java:57)
	at org.joda.time.MonthDay.withFieldAdded(MonthDay.java:519)
	at org.joda.time.MonthDay.plusDays(MonthDay.java:615)
	at org.joda.time.TestMonthDay_Basics.testPlusDays_int_wrapMonthTwice(TestMonthDay_Basics.java:516)

testPlusDays_int_wrapMonthIntoNextYear(org.joda.time.TestMonthDay_Basics)  Time elapsed: 0.001 sec  <<< ERROR!
java.lang.IndexOutOfBoundsException: Invalid index: 2
	at org.joda.time.MonthDay.getField(MonthDay.java:414)
	at org.joda.time.base.AbstractPartial.getField(AbstractPartial.java:105)
	at org.joda.time.field.BaseDateTimeField.set(BaseDateTimeField.java:98)
	at org.joda.time.field.BaseDateTimeField.add(BaseDateTimeField.java:57)
	at org.joda.time.MonthDay.withFieldAdded(MonthDay.java:519)
	at org.joda.time.MonthDay.plusDays(MonthDay.java:615)
	at org.joda.time.TestMonthDay_Basics.testPlusDays_int_wrapMonthIntoNextYear(TestMonthDay_Basics.java:523)

testPlusDays_int_wrapMonthTwiceIntoNextYear(org.joda.time.TestMonthDay_Basics)  Time elapsed: 0 sec  <<< ERROR!
java.lang.IndexOutOfBoundsException: Invalid index: 2
	at org.joda.time.MonthDay.getField(MonthDay.java:414)
	at org.joda.time.base.AbstractPartial.getField(AbstractPartial.java:105)
	at org.joda.time.field.BaseDateTimeField.set(BaseDateTimeField.java:98)
	at org.joda.time.field.BaseDateTimeField.add(BaseDateTimeField.java:57)
	at org.joda.time.MonthDay.withFieldAdded(MonthDay.java:519)
	at org.joda.time.MonthDay.plusDays(MonthDay.java:615)
	at org.joda.time.TestMonthDay_Basics.testPlusDays_int_wrapMonthTwiceIntoNextYear(TestMonthDay_Basics.java:530)

testPlusDays_int_wrap50(org.joda.time.TestMonthDay_Basics)  Time elapsed: 0.004 sec  <<< ERROR!
java.lang.IndexOutOfBoundsException: Invalid index: 2
	at org.joda.time.MonthDay.getField(MonthDay.java:414)
	at org.joda.time.base.AbstractPartial.getField(AbstractPartial.java:105)
	at org.joda.time.field.BaseDateTimeField.set(BaseDateTimeField.java:98)
	at org.joda.time.field.BaseDateTimeField.add(BaseDateTimeField.java:57)
	at org.joda.time.MonthDay.withFieldAdded(MonthDay.java:519)
	at org.joda.time.MonthDay.plusDays(MonthDay.java:615)
	at org.joda.time.TestMonthDay_Basics.testPlusDays_int_wrap50(TestMonthDay_Basics.java:537)

testPlusDays_int_toLeap(org.joda.time.TestMonthDay_Basics)  Time elapsed: 0 sec  <<< ERROR!
java.lang.IndexOutOfBoundsException: Invalid index: 2
	at org.joda.time.MonthDay.getField(MonthDay.java:414)
	at org.joda.time.base.AbstractPartial.getField(AbstractPartial.java:105)
	at org.joda.time.field.BaseDateTimeField.set(BaseDateTimeField.java:98)
	at org.joda.time.field.BaseDateTimeField.add(BaseDateTimeField.java:57)
	at org.joda.time.MonthDay.withFieldAdded(MonthDay.java:519)
	at org.joda.time.MonthDay.plusDays(MonthDay.java:615)
	at org.joda.time.TestMonthDay_Basics.testPlusDays_int_toLeap(TestMonthDay_Basics.java:544)

testPlusDays_int_fromLeap(org.joda.time.TestMonthDay_Basics)  Time elapsed: 0 sec  <<< ERROR!
java.lang.IndexOutOfBoundsException: Invalid index: 2
	at org.joda.time.MonthDay.getField(MonthDay.java:414)
	at org.joda.time.base.AbstractPartial.getField(AbstractPartial.java:105)
	at org.joda.time.field.BaseDateTimeField.set(BaseDateTimeField.java:98)
	at org.joda.time.field.BaseDateTimeField.add(BaseDateTimeField.java:57)
	at org.joda.time.MonthDay.withFieldAdded(MonthDay.java:519)
	at org.joda.time.MonthDay.plusDays(MonthDay.java:615)
	at org.joda.time.TestMonthDay_Basics.testPlusDays_int_fromLeap(TestMonthDay_Basics.java:551)

testPlusDays_int_negativeFromLeap(org.joda.time.TestMonthDay_Basics)  Time elapsed: 0 sec  <<< ERROR!
java.lang.IndexOutOfBoundsException: Invalid index: 2
	at org.joda.time.MonthDay.getField(MonthDay.java:414)
	at org.joda.time.base.AbstractPartial.getField(AbstractPartial.java:105)
	at org.joda.time.field.BaseDateTimeField.set(BaseDateTimeField.java:98)
	at org.joda.time.field.BaseDateTimeField.add(BaseDateTimeField.java:57)
	at org.joda.time.MonthDay.withFieldAdded(MonthDay.java:519)
	at org.joda.time.MonthDay.plusDays(MonthDay.java:615)
	at org.joda.time.TestMonthDay_Basics.testPlusDays_int_negativeFromLeap(TestMonthDay_Basics.java:558)

testMinusMonths_int_endOfMonthAdjust(org.joda.time.TestMonthDay_Basics)  Time elapsed: 0 sec  <<< FAILURE!
junit.framework.AssertionFailedError: expected:<--02-29> but was:<--02-31>
	at junit.framework.Assert.fail(Assert.java:47)
	at junit.framework.Assert.failNotEquals(Assert.java:280)
	at junit.framework.Assert.assertEquals(Assert.java:64)
	at junit.framework.Assert.assertEquals(Assert.java:71)
	at org.joda.time.TestMonthDay_Basics.testMinusMonths_int_endOfMonthAdjust(TestMonthDay_Basics.java:605)

testMinusMonths_int_negativeEndOfMonthAdjust(org.joda.time.TestMonthDay_Basics)  Time elapsed: 0 sec  <<< FAILURE!
junit.framework.AssertionFailedError: expected:<--04-30> but was:<--04-31>
	at junit.framework.Assert.fail(Assert.java:47)
	at junit.framework.Assert.failNotEquals(Assert.java:280)
	at junit.framework.Assert.assertEquals(Assert.java:64)
	at junit.framework.Assert.assertEquals(Assert.java:71)
	at org.joda.time.TestMonthDay_Basics.testMinusMonths_int_negativeEndOfMonthAdjust(TestMonthDay_Basics.java:612)

testMinusMonths_int_adjust(org.joda.time.TestMonthDay_Basics)  Time elapsed: 0.001 sec  <<< FAILURE!
junit.framework.AssertionFailedError: expected:<--04-30> but was:<--04-31>
	at junit.framework.Assert.fail(Assert.java:47)
	at junit.framework.Assert.failNotEquals(Assert.java:280)
	at junit.framework.Assert.assertEquals(Assert.java:64)
	at junit.framework.Assert.assertEquals(Assert.java:71)
	at org.joda.time.TestMonthDay_Basics.testMinusMonths_int_adjust(TestMonthDay_Basics.java:632)

testMinusDays_int_wrapMonth(org.joda.time.TestMonthDay_Basics)  Time elapsed: 0 sec  <<< ERROR!
java.lang.IndexOutOfBoundsException: Invalid index: 2
	at org.joda.time.MonthDay.getField(MonthDay.java:414)
	at org.joda.time.base.AbstractPartial.getField(AbstractPartial.java:105)
	at org.joda.time.field.BaseDateTimeField.set(BaseDateTimeField.java:98)
	at org.joda.time.field.BaseDateTimeField.add(BaseDateTimeField.java:57)
	at org.joda.time.MonthDay.withFieldAdded(MonthDay.java:519)
	at org.joda.time.MonthDay.minusDays(MonthDay.java:675)
	at org.joda.time.TestMonthDay_Basics.testMinusDays_int_wrapMonth(TestMonthDay_Basics.java:645)

testMinusDays_int_wrapMonthTwice(org.joda.time.TestMonthDay_Basics)  Time elapsed: 0.001 sec  <<< ERROR!
java.lang.IndexOutOfBoundsException: Invalid index: 2
	at org.joda.time.MonthDay.getField(MonthDay.java:414)
	at org.joda.time.base.AbstractPartial.getField(AbstractPartial.java:105)
	at org.joda.time.field.BaseDateTimeField.set(BaseDateTimeField.java:98)
	at org.joda.time.field.BaseDateTimeField.add(BaseDateTimeField.java:57)
	at org.joda.time.MonthDay.withFieldAdded(MonthDay.java:519)
	at org.joda.time.MonthDay.minusDays(MonthDay.java:675)
	at org.joda.time.TestMonthDay_Basics.testMinusDays_int_wrapMonthTwice(TestMonthDay_Basics.java:652)

testMinusDays_int_wrapMonthIntoLastYear(org.joda.time.TestMonthDay_Basics)  Time elapsed: 0.001 sec  <<< ERROR!
java.lang.IndexOutOfBoundsException: Invalid index: 2
	at org.joda.time.MonthDay.getField(MonthDay.java:414)
	at org.joda.time.base.AbstractPartial.getField(AbstractPartial.java:105)
	at org.joda.time.field.BaseDateTimeField.set(BaseDateTimeField.java:98)
	at org.joda.time.field.BaseDateTimeField.add(BaseDateTimeField.java:57)
	at org.joda.time.MonthDay.withFieldAdded(MonthDay.java:519)
	at org.joda.time.MonthDay.minusDays(MonthDay.java:675)
	at org.joda.time.TestMonthDay_Basics.testMinusDays_int_wrapMonthIntoLastYear(TestMonthDay_Basics.java:659)

testMinusDays_int_wrapMonthTwiceIntoLastYear(org.joda.time.TestMonthDay_Basics)  Time elapsed: 0 sec  <<< ERROR!
java.lang.IndexOutOfBoundsException: Invalid index: 2
	at org.joda.time.MonthDay.getField(MonthDay.java:414)
	at org.joda.time.base.AbstractPartial.getField(AbstractPartial.java:105)
	at org.joda.time.field.BaseDateTimeField.set(BaseDateTimeField.java:98)
	at org.joda.time.field.BaseDateTimeField.add(BaseDateTimeField.java:57)
	at org.joda.time.MonthDay.withFieldAdded(MonthDay.java:519)
	at org.joda.time.MonthDay.minusDays(MonthDay.java:675)
	at org.joda.time.TestMonthDay_Basics.testMinusDays_int_wrapMonthTwiceIntoLastYear(TestMonthDay_Basics.java:666)

testMinusDays_int_toLeap(org.joda.time.TestMonthDay_Basics)  Time elapsed: 0.001 sec  <<< ERROR!
java.lang.IndexOutOfBoundsException: Invalid index: 2
	at org.joda.time.MonthDay.getField(MonthDay.java:414)
	at org.joda.time.base.AbstractPartial.getField(AbstractPartial.java:105)
	at org.joda.time.field.BaseDateTimeField.set(BaseDateTimeField.java:98)
	at org.joda.time.field.BaseDateTimeField.add(BaseDateTimeField.java:57)
	at org.joda.time.MonthDay.withFieldAdded(MonthDay.java:519)
	at org.joda.time.MonthDay.minusDays(MonthDay.java:675)
	at org.joda.time.TestMonthDay_Basics.testMinusDays_int_toLeap(TestMonthDay_Basics.java:673)

testMinusDays_int_fromLeap(org.joda.time.TestMonthDay_Basics)  Time elapsed: 0 sec  <<< ERROR!
java.lang.IndexOutOfBoundsException: Invalid index: 2
	at org.joda.time.MonthDay.getField(MonthDay.java:414)
	at org.joda.time.base.AbstractPartial.getField(AbstractPartial.java:105)
	at org.joda.time.field.BaseDateTimeField.set(BaseDateTimeField.java:98)
	at org.joda.time.field.BaseDateTimeField.add(BaseDateTimeField.java:57)
	at org.joda.time.MonthDay.withFieldAdded(MonthDay.java:519)
	at org.joda.time.MonthDay.minusDays(MonthDay.java:675)
	at org.joda.time.TestMonthDay_Basics.testMinusDays_int_fromLeap(TestMonthDay_Basics.java:680)

testMinusDays_int_negativeFromLeap(org.joda.time.TestMonthDay_Basics)  Time elapsed: 0.001 sec  <<< ERROR!
java.lang.IndexOutOfBoundsException: Invalid index: 2
	at org.joda.time.MonthDay.getField(MonthDay.java:414)
	at org.joda.time.base.AbstractPartial.getField(AbstractPartial.java:105)
	at org.joda.time.field.BaseDateTimeField.set(BaseDateTimeField.java:98)
	at org.joda.time.field.BaseDateTimeField.add(BaseDateTimeField.java:57)
	at org.joda.time.MonthDay.withFieldAdded(MonthDay.java:519)
	at org.joda.time.MonthDay.minusDays(MonthDay.java:675)
	at org.joda.time.TestMonthDay_Basics.testMinusDays_int_negativeFromLeap(TestMonthDay_Basics.java:687)

testPropertyAddDayOfMonth(org.joda.time.TestMonthDay_Properties)  Time elapsed: 0 sec  <<< ERROR!
java.lang.IndexOutOfBoundsException: Invalid index: 2
	at org.joda.time.MonthDay.getField(MonthDay.java:414)
	at org.joda.time.base.AbstractPartial.getField(AbstractPartial.java:105)
	at org.joda.time.field.BaseDateTimeField.set(BaseDateTimeField.java:98)
	at org.joda.time.field.BaseDateTimeField.add(BaseDateTimeField.java:57)
	at org.joda.time.MonthDay$Property.addToCopy(MonthDay.java:900)
	at org.joda.time.TestMonthDay_Properties.testPropertyAddDayOfMonth(TestMonthDay_Properties.java:208)

testPropertyAddWrapFieldDayOfMonth(org.joda.time.TestMonthDay_Properties)  Time elapsed: 0.001 sec  <<< ERROR!
java.lang.IndexOutOfBoundsException: Invalid index: 2
	at org.joda.time.MonthDay.getField(MonthDay.java:414)
	at org.joda.time.base.AbstractPartial.getField(AbstractPartial.java:105)
	at org.joda.time.field.BaseDateTimeField.set(BaseDateTimeField.java:98)
	at org.joda.time.field.BaseDateTimeField.addWrapField(BaseDateTimeField.java:90)
	at org.joda.time.MonthDay$Property.addWrapFieldToCopy(MonthDay.java:924)
	at org.joda.time.TestMonthDay_Properties.testPropertyAddWrapFieldDayOfMonth(TestMonthDay_Properties.java:224)

testPropertySetDayOfMonth(org.joda.time.TestMonthDay_Properties)  Time elapsed: 0 sec  <<< ERROR!
java.lang.IndexOutOfBoundsException: Invalid index: 2
	at org.joda.time.MonthDay.getField(MonthDay.java:414)
	at org.joda.time.base.AbstractPartial.getField(AbstractPartial.java:105)
	at org.joda.time.field.BaseDateTimeField.set(BaseDateTimeField.java:98)
	at org.joda.time.MonthDay$Property.setCopy(MonthDay.java:941)
	at org.joda.time.TestMonthDay_Properties.testPropertySetDayOfMonth(TestMonthDay_Properties.java:237)

testPropertySetTextDayOfMonth(org.joda.time.TestMonthDay_Properties)  Time elapsed: 0.001 sec  <<< ERROR!
java.lang.IndexOutOfBoundsException: Invalid index: 2
	at org.joda.time.MonthDay.getField(MonthDay.java:414)
	at org.joda.time.base.AbstractPartial.getField(AbstractPartial.java:105)
	at org.joda.time.field.BaseDateTimeField.set(BaseDateTimeField.java:98)
	at org.joda.time.field.BaseDateTimeField.set(BaseDateTimeField.java:106)
	at org.joda.time.MonthDay$Property.setCopy(MonthDay.java:958)
	at org.joda.time.MonthDay$Property.setCopy(MonthDay.java:973)
	at org.joda.time.TestMonthDay_Properties.testPropertySetTextDayOfMonth(TestMonthDay_Properties.java:253)

testPlus_RP(org.joda.time.TestPartial_Basics)  Time elapsed: 0 sec  <<< ERROR!
java.lang.ArrayIndexOutOfBoundsException: 2
	at org.joda.time.Partial.getField(Partial.java:358)
	at org.joda.time.base.AbstractPartial.getField(AbstractPartial.java:105)
	at org.joda.time.field.BaseDateTimeField.set(BaseDateTimeField.java:98)
	at org.joda.time.field.BaseDateTimeField.add(BaseDateTimeField.java:57)
	at org.joda.time.Partial.withPeriodAdded(Partial.java:628)
	at org.joda.time.Partial.plus(Partial.java:645)
	at org.joda.time.TestPartial_Basics.testPlus_RP(TestPartial_Basics.java:722)

testMinus_RP(org.joda.time.TestPartial_Basics)  Time elapsed: 0 sec  <<< ERROR!
java.lang.ArrayIndexOutOfBoundsException: 2
	at org.joda.time.Partial.getField(Partial.java:358)
	at org.joda.time.base.AbstractPartial.getField(AbstractPartial.java:105)
	at org.joda.time.field.BaseDateTimeField.set(BaseDateTimeField.java:98)
	at org.joda.time.field.BaseDateTimeField.add(BaseDateTimeField.java:57)
	at org.joda.time.Partial.withPeriodAdded(Partial.java:628)
	at org.joda.time.Partial.minus(Partial.java:658)
	at org.joda.time.TestPartial_Basics.testMinus_RP(TestPartial_Basics.java:733)

testWithFieldAddWrapped7(org.joda.time.TestPartial_Basics)  Time elapsed: 0 sec  <<< ERROR!
java.lang.ArrayIndexOutOfBoundsException: 2
	at org.joda.time.Partial.getField(Partial.java:358)
	at org.joda.time.base.AbstractPartial.getField(AbstractPartial.java:105)
	at org.joda.time.field.BaseDateTimeField.set(BaseDateTimeField.java:98)
	at org.joda.time.field.BaseDateTimeField.addWrapPartial(BaseDateTimeField.java:84)
	at org.joda.time.Partial.withFieldAddWrapped(Partial.java:600)
	at org.joda.time.TestPartial_Basics.testWithFieldAddWrapped7(TestPartial_Basics.java:697)

testWithFieldAddWrapped8(org.joda.time.TestPartial_Basics)  Time elapsed: 0.001 sec  <<< ERROR!
java.lang.ArrayIndexOutOfBoundsException: 2
	at org.joda.time.Partial.getField(Partial.java:358)
	at org.joda.time.base.AbstractPartial.getField(AbstractPartial.java:105)
	at org.joda.time.field.BaseDateTimeField.set(BaseDateTimeField.java:98)
	at org.joda.time.field.BaseDateTimeField.addWrapPartial(BaseDateTimeField.java:84)
	at org.joda.time.Partial.withFieldAddWrapped(Partial.java:600)
	at org.joda.time.TestPartial_Basics.testWithFieldAddWrapped8(TestPartial_Basics.java:709)

testSetMethods(org.joda.time.TestBasePartial)  Time elapsed: 0.001 sec  <<< ERROR!
java.lang.IndexOutOfBoundsException
	at org.joda.time.TestBasePartial$MockPartial.getField(TestBasePartial.java:117)
	at org.joda.time.base.AbstractPartial.getField(AbstractPartial.java:105)
	at org.joda.time.field.BaseDateTimeField.set(BaseDateTimeField.java:98)
	at org.joda.time.base.BasePartial.setValue(BasePartial.java:266)
	at org.joda.time.TestBasePartial$MockPartial.setMonthOfYear(TestBasePartial.java:138)
	at org.joda.time.TestBasePartial.testSetMethods(TestBasePartial.java:81)

testPartialDayOfYearAdd(org.joda.time.chrono.TestISOChronology)  Time elapsed: 0.001 sec  <<< ERROR!
java.lang.ArrayIndexOutOfBoundsException: 2
	at org.joda.time.Partial.getField(Partial.java:358)
	at org.joda.time.base.AbstractPartial.getField(AbstractPartial.java:105)
	at org.joda.time.field.BaseDateTimeField.set(BaseDateTimeField.java:98)
	at org.joda.time.field.BaseDateTimeField.add(BaseDateTimeField.java:57)
	at org.joda.time.Partial.withFieldAdded(Partial.java:576)
	at org.joda.time.chrono.TestISOChronology.testPartialDayOfYearAdd(TestISOChronology.java:442)


Results :

Failed tests: 
  org.joda.time.TestMonthDay_Basics#testMinusMonths_int_adjust AssertionFailedError
  org.joda.time.TestMonthDay_Basics#testMinusMonths_int_endOfMonthAdjust AssertionFailedError
  org.joda.time.TestMonthDay_Basics#testMinusMonths_int_negativeEndOfMonthAdjust AssertionFailedError
  org.joda.time.TestMonthDay_Basics#testPlusMonths_int_adjust AssertionFailedError
  org.joda.time.TestMonthDay_Basics#testPlusMonths_int_endOfMonthAdjust AssertionFailedError
  org.joda.time.TestMonthDay_Basics#testPlusMonths_int_negativeEndOfMonthAdjust AssertionFailedError
  org.joda.time.TestYearMonthDay_Properties#testPropertyAddWrapFieldMonth AssertionFailedError
  org.joda.time.TestYearMonthDay_Properties#testPropertySetMonth AssertionFailedError
Tests in error: 
  org.joda.time.TestBasePartial#testSetMethods IndexOutOfBoundsException
  org.joda.time.TestMonthDay_Basics#testMinusDays_int IndexOutOfBoundsException ...
  org.joda.time.TestMonthDay_Basics#testMinusDays_int_fromLeap IndexOutOfBoundsException
  org.joda.time.TestMonthDay_Basics#testMinusDays_int_negativeFromLeap IndexOutOfBoundsException
  org.joda.time.TestMonthDay_Basics#testMinusDays_int_toLeap IndexOutOfBoundsException
  org.joda.time.TestMonthDay_Basics#testMinusDays_int_wrapMonth IndexOutOfBoundsException
  org.joda.time.TestMonthDay_Basics#testMinusDays_int_wrapMonthIntoLastYear IndexOutOfBoundsException
  org.joda.time.TestMonthDay_Basics#testMinusDays_int_wrapMonthTwice IndexOutOfBoundsException
  org.joda.time.TestMonthDay_Basics#testMinusDays_int_wrapMonthTwiceIntoLastYear IndexOutOfBoundsException
  org.joda.time.TestMonthDay_Basics#testMinus_RP IndexOutOfBoundsException Inval...
  org.joda.time.TestMonthDay_Basics#testPlusDays_int IndexOutOfBoundsException I...
  org.joda.time.TestMonthDay_Basics#testPlusDays_int_fromLeap IndexOutOfBoundsException
  org.joda.time.TestMonthDay_Basics#testPlusDays_int_negativeFromLeap IndexOutOfBoundsException
  org.joda.time.TestMonthDay_Basics#testPlusDays_int_toLeap IndexOutOfBoundsException
  org.joda.time.TestMonthDay_Basics#testPlusDays_int_wrap50 IndexOutOfBoundsException
  org.joda.time.TestMonthDay_Basics#testPlusDays_int_wrapMonth IndexOutOfBoundsException
  org.joda.time.TestMonthDay_Basics#testPlusDays_int_wrapMonthIntoNextYear IndexOutOfBoundsException
  org.joda.time.TestMonthDay_Basics#testPlusDays_int_wrapMonthTwice IndexOutOfBoundsException
  org.joda.time.TestMonthDay_Basics#testPlusDays_int_wrapMonthTwiceIntoNextYear IndexOutOfBoundsException
  org.joda.time.TestMonthDay_Basics#testPlus_RP IndexOutOfBoundsException Invali...
  org.joda.time.TestMonthDay_Basics#testWithers IndexOutOfBoundsException Invali...
  org.joda.time.TestMonthDay_Properties#testPropertyAddDayOfMonth IndexOutOfBoundsException
  org.joda.time.TestMonthDay_Properties#testPropertyAddWrapFieldDayOfMonth IndexOutOfBoundsException
  org.joda.time.TestMonthDay_Properties#testPropertySetDayOfMonth IndexOutOfBoundsException
  org.joda.time.TestMonthDay_Properties#testPropertySetTextDayOfMonth IndexOutOfBoundsException
  org.joda.time.TestPartial_Basics#testMinus_RP ArrayIndexOutOfBoundsException 2
  org.joda.time.TestPartial_Basics#testPlus_RP ArrayIndexOutOfBoundsException 2
  org.joda.time.TestPartial_Basics#testWithFieldAddWrapped7 ArrayIndexOutOfBoundsException
  org.joda.time.TestPartial_Basics#testWithFieldAddWrapped8 ArrayIndexOutOfBoundsException
  org.joda.time.TestTimeOfDay_Basics#testMinusMillis_int IndexOutOfBoundsException
  org.joda.time.TestTimeOfDay_Basics#testMinus_RP IndexOutOfBoundsException Inva...
  org.joda.time.TestTimeOfDay_Basics#testPlusMillis_int IndexOutOfBoundsException
  org.joda.time.TestTimeOfDay_Basics#testPlus_RP IndexOutOfBoundsException Inval...
  org.joda.time.TestTimeOfDay_Basics#testWithFieldAdded7 IndexOutOfBoundsException
  org.joda.time.TestTimeOfDay_Basics#testWithFieldAdded8 IndexOutOfBoundsException
  org.joda.time.TestTimeOfDay_Basics#testWithers IndexOutOfBoundsException Inval...
  org.joda.time.TestTimeOfDay_Properties#testPropertyAddMilli IndexOutOfBoundsException
  org.joda.time.TestTimeOfDay_Properties#testPropertyAddNoWrapMilli IndexOutOfBoundsException
  org.joda.time.TestTimeOfDay_Properties#testPropertyAddWrapFieldMilli IndexOutOfBoundsException
  org.joda.time.TestTimeOfDay_Properties#testPropertySetMilli IndexOutOfBoundsException
  org.joda.time.TestTimeOfDay_Properties#testPropertySetTextMilli IndexOutOfBoundsException
  org.joda.time.TestYearMonthDay_Basics#testMinusDays_int IndexOutOfBoundsException
  org.joda.time.TestYearMonthDay_Basics#testMinus_RP IndexOutOfBoundsException I...
  org.joda.time.TestYearMonthDay_Basics#testPlusDays_int IndexOutOfBoundsException
  org.joda.time.TestYearMonthDay_Basics#testPlus_RP IndexOutOfBoundsException In...
  org.joda.time.TestYearMonthDay_Basics#testWithers IndexOutOfBoundsException In...
  org.joda.time.TestYearMonthDay_Properties#testPropertyAddDay IndexOutOfBoundsException
  org.joda.time.TestYearMonthDay_Properties#testPropertyAddWrapFieldDay IndexOutOfBoundsException
  org.joda.time.TestYearMonthDay_Properties#testPropertySetDay IndexOutOfBoundsException
  org.joda.time.TestYearMonthDay_Properties#testPropertySetTextDay IndexOutOfBoundsException
  org.joda.time.TestYearMonthDay_Properties#testPropertyWithMaximumValueDayOfMonth IndexOutOfBoundsException
  org.joda.time.TestYearMonthDay_Properties#testPropertyWithMinimumValueDayOfMonth IndexOutOfBoundsException
  org.joda.time.TestYearMonth_Basics#testMinusMonths_int IndexOutOfBoundsException
  org.joda.time.TestYearMonth_Basics#testMinus_RP IndexOutOfBoundsException Inva...
  org.joda.time.TestYearMonth_Basics#testPlusMonths_int IndexOutOfBoundsException
  org.joda.time.TestYearMonth_Basics#testPlus_RP IndexOutOfBoundsException Inval...
  org.joda.time.TestYearMonth_Basics#testToInterval IndexOutOfBoundsException In...
  org.joda.time.TestYearMonth_Basics#testToInterval_Zone IndexOutOfBoundsException
  org.joda.time.TestYearMonth_Basics#testToInterval_nullZone IndexOutOfBoundsException
  org.joda.time.TestYearMonth_Basics#testWithers IndexOutOfBoundsException Inval...
  org.joda.time.TestYearMonth_Properties#testPropertyAddWrapFieldMonth IndexOutOfBoundsException
  org.joda.time.TestYearMonth_Properties#testPropertySetMonth IndexOutOfBoundsException
  org.joda.time.TestYearMonth_Properties#testPropertySetTextMonth IndexOutOfBoundsException
  org.joda.time.chrono.TestISOChronology#testPartialDayOfYearAdd ArrayIndexOutOfBoundsException

Tests run: 4157, Failures: 8, Errors: 64, Skipped: 0

[INFO] ------------------------------------------------------------------------
[INFO] BUILD FAILURE
[INFO] ------------------------------------------------------------------------
[INFO] Total time: 15.651s
[INFO] Finished at: Thu Aug 06 04:04:18 BST 2015
[INFO] Final Memory: 7M/157M
[INFO] ------------------------------------------------------------------------
[ERROR] Failed to execute goal org.apache.maven.plugins:maven-surefire-plugin:2.18.1:test (default-test) on project joda-time: There are test failures.
[ERROR] 
[ERROR] Please refer to /home/perham/Study/LittleDarwin/Cases/joda-time-2.8.1/target/surefire-reports for the individual test results.
[ERROR] -> [Help 1]
[ERROR] 
[ERROR] To see the full stack trace of the errors, re-run Maven with the -e switch.
[ERROR] Re-run Maven using the -X switch to enable full debug logging.
[ERROR] 
[ERROR] For more information about the errors and possible solutions, please read the following articles:
[ERROR] [Help 1] http://cwiki.apache.org/confluence/display/MAVEN/MojoFailureException
