[INFO] Scanning for projects...
[INFO]                                                                         
[INFO] ------------------------------------------------------------------------
[INFO] Building Joda-Time 2.8.1
[INFO] ------------------------------------------------------------------------
[INFO] 
[INFO] --- maven-resources-plugin:2.7:resources (default-resources) @ joda-time ---
[INFO] Using 'UTF-8' encoding to copy filtered resources.
[INFO] Copying 2 resources to META-INF
[INFO] Copying 10 resources
[INFO] 
[INFO] --- maven-compiler-plugin:3.3:compile (default-compile) @ joda-time ---
[INFO] Changes detected - recompiling the module!
[INFO] Compiling 166 source files to /home/perham/Study/LittleDarwin/Cases/joda-time-2.8.1/target/classes
[INFO] 
[INFO] --- exec-maven-plugin:1.4.0:java (compile-tzdb) @ joda-time ---
Writing zoneinfo files
Writing ZoneInfoMap
[INFO] 
[INFO] --- maven-resources-plugin:2.7:testResources (default-testResources) @ joda-time ---
[INFO] Using 'UTF-8' encoding to copy filtered resources.
[INFO] Copying 34 resources
[INFO] 
[INFO] --- maven-compiler-plugin:3.3:testCompile (default-testCompile) @ joda-time ---
[INFO] Nothing to compile - all classes are up to date
[INFO] 
[INFO] --- maven-surefire-plugin:2.18.1:test (default-test) @ joda-time ---
[INFO] Surefire report directory: /home/perham/Study/LittleDarwin/Cases/joda-time-2.8.1/target/surefire-reports

-------------------------------------------------------
 T E S T S
-------------------------------------------------------
Running org.joda.time.TestAllPackages

TestBuddhistChronology.testCalendar

TestCopticChronology.testCalendar

TestEthiopicChronology.testCalendar

TestIslamicChronology.testCalendar

Testing Gregorian chronology over 1000 iterations
100% complete (i=1000)

Testing Julian chronology over 1000 iterations
100% complete (i=1000)
Writing zoneinfo files
Writing ZoneInfoMap
Tests run: 4157, Failures: 118, Errors: 0, Skipped: 0, Time elapsed: 5.281 sec <<< FAILURE! - in org.joda.time.TestAllPackages
testWithers(org.joda.time.TestTimeOfDay_Basics)  Time elapsed: 0.001 sec  <<< FAILURE!
junit.framework.AssertionFailedError: expected:<20> but was:<59>
	at junit.framework.Assert.fail(Assert.java:47)
	at junit.framework.Assert.failNotEquals(Assert.java:280)
	at junit.framework.Assert.assertEquals(Assert.java:64)
	at junit.framework.Assert.assertEquals(Assert.java:198)
	at junit.framework.Assert.assertEquals(Assert.java:204)
	at org.joda.time.TestTimeOfDay_Basics.check(TestTimeOfDay_Basics.java:902)
	at org.joda.time.TestTimeOfDay_Basics.testWithers(TestTimeOfDay_Basics.java:818)

testWithField1(org.joda.time.TestTimeOfDay_Basics)  Time elapsed: 0.001 sec  <<< FAILURE!
junit.framework.AssertionFailedError: expected:<T15:20:30.040> but was:<T15:59:59.999>
	at junit.framework.Assert.fail(Assert.java:47)
	at junit.framework.Assert.failNotEquals(Assert.java:280)
	at junit.framework.Assert.assertEquals(Assert.java:64)
	at junit.framework.Assert.assertEquals(Assert.java:71)
	at org.joda.time.TestTimeOfDay_Basics.testWithField1(TestTimeOfDay_Basics.java:378)

testWithFieldAdded1(org.joda.time.TestTimeOfDay_Basics)  Time elapsed: 0.001 sec  <<< FAILURE!
junit.framework.AssertionFailedError: expected:<T16:20:30.040> but was:<T16:59:59.999>
	at junit.framework.Assert.fail(Assert.java:47)
	at junit.framework.Assert.failNotEquals(Assert.java:280)
	at junit.framework.Assert.assertEquals(Assert.java:64)
	at junit.framework.Assert.assertEquals(Assert.java:71)
	at org.joda.time.TestTimeOfDay_Basics.testWithFieldAdded1(TestTimeOfDay_Basics.java:409)

testPlus_RP(org.joda.time.TestTimeOfDay_Basics)  Time elapsed: 0.001 sec  <<< FAILURE!
junit.framework.AssertionFailedError: expected:<T15:26:37.048> but was:<T16:06:07.007>
	at junit.framework.Assert.fail(Assert.java:47)
	at junit.framework.Assert.failNotEquals(Assert.java:280)
	at junit.framework.Assert.assertEquals(Assert.java:64)
	at junit.framework.Assert.assertEquals(Assert.java:71)
	at org.joda.time.TestTimeOfDay_Basics.testPlus_RP(TestTimeOfDay_Basics.java:491)

testPlusHours_int(org.joda.time.TestTimeOfDay_Basics)  Time elapsed: 0.001 sec  <<< FAILURE!
junit.framework.AssertionFailedError: expected:<T02:02:03.004> but was:<T02:59:59.999>
	at junit.framework.Assert.fail(Assert.java:47)
	at junit.framework.Assert.failNotEquals(Assert.java:280)
	at junit.framework.Assert.assertEquals(Assert.java:64)
	at junit.framework.Assert.assertEquals(Assert.java:71)
	at org.joda.time.TestTimeOfDay_Basics.testPlusHours_int(TestTimeOfDay_Basics.java:501)

testPlusMinutes_int(org.joda.time.TestTimeOfDay_Basics)  Time elapsed: 0 sec  <<< FAILURE!
junit.framework.AssertionFailedError: expected:<T01:03:03.004> but was:<T01:03:59.999>
	at junit.framework.Assert.fail(Assert.java:47)
	at junit.framework.Assert.failNotEquals(Assert.java:280)
	at junit.framework.Assert.assertEquals(Assert.java:64)
	at junit.framework.Assert.assertEquals(Assert.java:71)
	at org.joda.time.TestTimeOfDay_Basics.testPlusMinutes_int(TestTimeOfDay_Basics.java:511)

testPlusSeconds_int(org.joda.time.TestTimeOfDay_Basics)  Time elapsed: 0 sec  <<< FAILURE!
junit.framework.AssertionFailedError: expected:<T01:02:04.004> but was:<T01:02:04.999>
	at junit.framework.Assert.fail(Assert.java:47)
	at junit.framework.Assert.failNotEquals(Assert.java:280)
	at junit.framework.Assert.assertEquals(Assert.java:64)
	at junit.framework.Assert.assertEquals(Assert.java:71)
	at org.joda.time.TestTimeOfDay_Basics.testPlusSeconds_int(TestTimeOfDay_Basics.java:521)

testMinus_RP(org.joda.time.TestTimeOfDay_Basics)  Time elapsed: 0.001 sec  <<< FAILURE!
junit.framework.AssertionFailedError: expected:<T09:19:29.039> but was:<T09:58:58.998>
	at junit.framework.Assert.fail(Assert.java:47)
	at junit.framework.Assert.failNotEquals(Assert.java:280)
	at junit.framework.Assert.assertEquals(Assert.java:64)
	at junit.framework.Assert.assertEquals(Assert.java:71)
	at org.joda.time.TestTimeOfDay_Basics.testMinus_RP(TestTimeOfDay_Basics.java:542)

testMinusHours_int(org.joda.time.TestTimeOfDay_Basics)  Time elapsed: 0.001 sec  <<< FAILURE!
junit.framework.AssertionFailedError: expected:<T00:02:03.004> but was:<T00:59:59.999>
	at junit.framework.Assert.fail(Assert.java:47)
	at junit.framework.Assert.failNotEquals(Assert.java:280)
	at junit.framework.Assert.assertEquals(Assert.java:64)
	at junit.framework.Assert.assertEquals(Assert.java:71)
	at org.joda.time.TestTimeOfDay_Basics.testMinusHours_int(TestTimeOfDay_Basics.java:552)

testMinusMinutes_int(org.joda.time.TestTimeOfDay_Basics)  Time elapsed: 0 sec  <<< FAILURE!
junit.framework.AssertionFailedError: expected:<T01:01:03.004> but was:<T01:01:59.999>
	at junit.framework.Assert.fail(Assert.java:47)
	at junit.framework.Assert.failNotEquals(Assert.java:280)
	at junit.framework.Assert.assertEquals(Assert.java:64)
	at junit.framework.Assert.assertEquals(Assert.java:71)
	at org.joda.time.TestTimeOfDay_Basics.testMinusMinutes_int(TestTimeOfDay_Basics.java:562)

testMinusSeconds_int(org.joda.time.TestTimeOfDay_Basics)  Time elapsed: 0 sec  <<< FAILURE!
junit.framework.AssertionFailedError: expected:<T01:02:02.004> but was:<T01:02:02.999>
	at junit.framework.Assert.fail(Assert.java:47)
	at junit.framework.Assert.failNotEquals(Assert.java:280)
	at junit.framework.Assert.assertEquals(Assert.java:64)
	at junit.framework.Assert.assertEquals(Assert.java:71)
	at org.joda.time.TestTimeOfDay_Basics.testMinusSeconds_int(TestTimeOfDay_Basics.java:572)

testWithFieldAdded6(org.joda.time.TestTimeOfDay_Basics)  Time elapsed: 0.001 sec  <<< FAILURE!
junit.framework.AssertionFailedError: expected:<T02:20:30.040> but was:<T02:59:59.999>
	at junit.framework.Assert.fail(Assert.java:47)
	at junit.framework.Assert.failNotEquals(Assert.java:280)
	at junit.framework.Assert.assertEquals(Assert.java:64)
	at junit.framework.Assert.assertEquals(Assert.java:71)
	at org.joda.time.TestTimeOfDay_Basics.testWithFieldAdded6(TestTimeOfDay_Basics.java:447)

testWithFieldAdded8(org.joda.time.TestTimeOfDay_Basics)  Time elapsed: 0.001 sec  <<< FAILURE!
junit.framework.AssertionFailedError: expected:<T23:59:59.000> but was:<T23:59:59.999>
	at junit.framework.Assert.fail(Assert.java:47)
	at junit.framework.Assert.failNotEquals(Assert.java:280)
	at junit.framework.Assert.assertEquals(Assert.java:64)
	at junit.framework.Assert.assertEquals(Assert.java:71)
	at org.joda.time.TestTimeOfDay_Basics.testWithFieldAdded8(TestTimeOfDay_Basics.java:475)

testPropertySetSecond(org.joda.time.TestTimeOfDay_Properties)  Time elapsed: 0.001 sec  <<< FAILURE!
junit.framework.AssertionFailedError: expected:<40> but was:<999>
	at junit.framework.Assert.fail(Assert.java:47)
	at junit.framework.Assert.failNotEquals(Assert.java:280)
	at junit.framework.Assert.assertEquals(Assert.java:64)
	at junit.framework.Assert.assertEquals(Assert.java:198)
	at junit.framework.Assert.assertEquals(Assert.java:204)
	at org.joda.time.TestTimeOfDay_Properties.check(TestTimeOfDay_Properties.java:734)
	at org.joda.time.TestTimeOfDay_Properties.testPropertySetSecond(TestTimeOfDay_Properties.java:528)

testPropertySetTextSecond(org.joda.time.TestTimeOfDay_Properties)  Time elapsed: 0 sec  <<< FAILURE!
junit.framework.AssertionFailedError: expected:<40> but was:<999>
	at junit.framework.Assert.fail(Assert.java:47)
	at junit.framework.Assert.failNotEquals(Assert.java:280)
	at junit.framework.Assert.assertEquals(Assert.java:64)
	at junit.framework.Assert.assertEquals(Assert.java:198)
	at junit.framework.Assert.assertEquals(Assert.java:204)
	at org.joda.time.TestTimeOfDay_Properties.check(TestTimeOfDay_Properties.java:734)
	at org.joda.time.TestTimeOfDay_Properties.testPropertySetTextSecond(TestTimeOfDay_Properties.java:544)

testPropertyAddNoWrapHour(org.joda.time.TestTimeOfDay_Properties)  Time elapsed: 0.001 sec  <<< FAILURE!
junit.framework.AssertionFailedError: expected:<20> but was:<59>
	at junit.framework.Assert.fail(Assert.java:47)
	at junit.framework.Assert.failNotEquals(Assert.java:280)
	at junit.framework.Assert.assertEquals(Assert.java:64)
	at junit.framework.Assert.assertEquals(Assert.java:198)
	at junit.framework.Assert.assertEquals(Assert.java:204)
	at org.joda.time.TestTimeOfDay_Properties.check(TestTimeOfDay_Properties.java:732)
	at org.joda.time.TestTimeOfDay_Properties.testPropertyAddNoWrapHour(TestTimeOfDay_Properties.java:132)

testPropertyAddWrapFieldHour(org.joda.time.TestTimeOfDay_Properties)  Time elapsed: 0.009 sec  <<< FAILURE!
junit.framework.AssertionFailedError: expected:<20> but was:<59>
	at junit.framework.Assert.fail(Assert.java:47)
	at junit.framework.Assert.failNotEquals(Assert.java:280)
	at junit.framework.Assert.assertEquals(Assert.java:64)
	at junit.framework.Assert.assertEquals(Assert.java:198)
	at junit.framework.Assert.assertEquals(Assert.java:204)
	at org.joda.time.TestTimeOfDay_Properties.check(TestTimeOfDay_Properties.java:732)
	at org.joda.time.TestTimeOfDay_Properties.testPropertyAddWrapFieldHour(TestTimeOfDay_Properties.java:160)

testPropertyAddMinute(org.joda.time.TestTimeOfDay_Properties)  Time elapsed: 0 sec  <<< FAILURE!
junit.framework.AssertionFailedError: expected:<30> but was:<59>
	at junit.framework.Assert.fail(Assert.java:47)
	at junit.framework.Assert.failNotEquals(Assert.java:280)
	at junit.framework.Assert.assertEquals(Assert.java:64)
	at junit.framework.Assert.assertEquals(Assert.java:198)
	at junit.framework.Assert.assertEquals(Assert.java:204)
	at org.joda.time.TestTimeOfDay_Properties.check(TestTimeOfDay_Properties.java:733)
	at org.joda.time.TestTimeOfDay_Properties.testPropertyAddMinute(TestTimeOfDay_Properties.java:263)

testPropertyAddNoWrapMinute(org.joda.time.TestTimeOfDay_Properties)  Time elapsed: 0 sec  <<< FAILURE!
junit.framework.AssertionFailedError: expected:<30> but was:<59>
	at junit.framework.Assert.fail(Assert.java:47)
	at junit.framework.Assert.failNotEquals(Assert.java:280)
	at junit.framework.Assert.assertEquals(Assert.java:64)
	at junit.framework.Assert.assertEquals(Assert.java:198)
	at junit.framework.Assert.assertEquals(Assert.java:204)
	at org.joda.time.TestTimeOfDay_Properties.check(TestTimeOfDay_Properties.java:733)
	at org.joda.time.TestTimeOfDay_Properties.testPropertyAddNoWrapMinute(TestTimeOfDay_Properties.java:303)

testPropertyAddWrapFieldMinute(org.joda.time.TestTimeOfDay_Properties)  Time elapsed: 0 sec  <<< FAILURE!
junit.framework.AssertionFailedError: expected:<30> but was:<59>
	at junit.framework.Assert.fail(Assert.java:47)
	at junit.framework.Assert.failNotEquals(Assert.java:280)
	at junit.framework.Assert.assertEquals(Assert.java:64)
	at junit.framework.Assert.assertEquals(Assert.java:198)
	at junit.framework.Assert.assertEquals(Assert.java:204)
	at org.joda.time.TestTimeOfDay_Properties.check(TestTimeOfDay_Properties.java:733)
	at org.joda.time.TestTimeOfDay_Properties.testPropertyAddWrapFieldMinute(TestTimeOfDay_Properties.java:349)

testPropertyAddSecond(org.joda.time.TestTimeOfDay_Properties)  Time elapsed: 0 sec  <<< FAILURE!
junit.framework.AssertionFailedError: expected:<40> but was:<999>
	at junit.framework.Assert.fail(Assert.java:47)
	at junit.framework.Assert.failNotEquals(Assert.java:280)
	at junit.framework.Assert.assertEquals(Assert.java:64)
	at junit.framework.Assert.assertEquals(Assert.java:198)
	at junit.framework.Assert.assertEquals(Assert.java:204)
	at org.joda.time.TestTimeOfDay_Properties.check(TestTimeOfDay_Properties.java:734)
	at org.joda.time.TestTimeOfDay_Properties.testPropertyAddSecond(TestTimeOfDay_Properties.java:435)

testPropertyAddNoWrapSecond(org.joda.time.TestTimeOfDay_Properties)  Time elapsed: 0.001 sec  <<< FAILURE!
junit.framework.AssertionFailedError: expected:<40> but was:<999>
	at junit.framework.Assert.fail(Assert.java:47)
	at junit.framework.Assert.failNotEquals(Assert.java:280)
	at junit.framework.Assert.assertEquals(Assert.java:64)
	at junit.framework.Assert.assertEquals(Assert.java:198)
	at junit.framework.Assert.assertEquals(Assert.java:204)
	at org.joda.time.TestTimeOfDay_Properties.check(TestTimeOfDay_Properties.java:734)
	at org.joda.time.TestTimeOfDay_Properties.testPropertyAddNoWrapSecond(TestTimeOfDay_Properties.java:472)

testPropertyAddWrapFieldSecond(org.joda.time.TestTimeOfDay_Properties)  Time elapsed: 0 sec  <<< FAILURE!
junit.framework.AssertionFailedError: expected:<40> but was:<999>
	at junit.framework.Assert.fail(Assert.java:47)
	at junit.framework.Assert.failNotEquals(Assert.java:280)
	at junit.framework.Assert.assertEquals(Assert.java:64)
	at junit.framework.Assert.assertEquals(Assert.java:198)
	at junit.framework.Assert.assertEquals(Assert.java:204)
	at org.joda.time.TestTimeOfDay_Properties.check(TestTimeOfDay_Properties.java:734)
	at org.joda.time.TestTimeOfDay_Properties.testPropertyAddWrapFieldSecond(TestTimeOfDay_Properties.java:515)

testPropertyAddHour(org.joda.time.TestTimeOfDay_Properties)  Time elapsed: 0.001 sec  <<< FAILURE!
junit.framework.AssertionFailedError: expected:<20> but was:<59>
	at junit.framework.Assert.fail(Assert.java:47)
	at junit.framework.Assert.failNotEquals(Assert.java:280)
	at junit.framework.Assert.assertEquals(Assert.java:64)
	at junit.framework.Assert.assertEquals(Assert.java:198)
	at junit.framework.Assert.assertEquals(Assert.java:204)
	at org.joda.time.TestTimeOfDay_Properties.check(TestTimeOfDay_Properties.java:732)
	at org.joda.time.TestTimeOfDay_Properties.testPropertyAddHour(TestTimeOfDay_Properties.java:110)

testPropertySetHour(org.joda.time.TestTimeOfDay_Properties)  Time elapsed: 0.001 sec  <<< FAILURE!
junit.framework.AssertionFailedError: expected:<20> but was:<59>
	at junit.framework.Assert.fail(Assert.java:47)
	at junit.framework.Assert.failNotEquals(Assert.java:280)
	at junit.framework.Assert.assertEquals(Assert.java:64)
	at junit.framework.Assert.assertEquals(Assert.java:198)
	at junit.framework.Assert.assertEquals(Assert.java:204)
	at org.joda.time.TestTimeOfDay_Properties.check(TestTimeOfDay_Properties.java:732)
	at org.joda.time.TestTimeOfDay_Properties.testPropertySetHour(TestTimeOfDay_Properties.java:176)

testPropertySetTextHour(org.joda.time.TestTimeOfDay_Properties)  Time elapsed: 0 sec  <<< FAILURE!
junit.framework.AssertionFailedError: expected:<20> but was:<59>
	at junit.framework.Assert.fail(Assert.java:47)
	at junit.framework.Assert.failNotEquals(Assert.java:280)
	at junit.framework.Assert.assertEquals(Assert.java:64)
	at junit.framework.Assert.assertEquals(Assert.java:198)
	at junit.framework.Assert.assertEquals(Assert.java:204)
	at org.joda.time.TestTimeOfDay_Properties.check(TestTimeOfDay_Properties.java:732)
	at org.joda.time.TestTimeOfDay_Properties.testPropertySetTextHour(TestTimeOfDay_Properties.java:192)

testPropertyWithMaximumValueHour(org.joda.time.TestTimeOfDay_Properties)  Time elapsed: 0.001 sec  <<< FAILURE!
junit.framework.AssertionFailedError: expected:<20> but was:<59>
	at junit.framework.Assert.fail(Assert.java:47)
	at junit.framework.Assert.failNotEquals(Assert.java:280)
	at junit.framework.Assert.assertEquals(Assert.java:64)
	at junit.framework.Assert.assertEquals(Assert.java:198)
	at junit.framework.Assert.assertEquals(Assert.java:204)
	at org.joda.time.TestTimeOfDay_Properties.check(TestTimeOfDay_Properties.java:732)
	at org.joda.time.TestTimeOfDay_Properties.testPropertyWithMaximumValueHour(TestTimeOfDay_Properties.java:199)

testPropertyWithMinimumValueHour(org.joda.time.TestTimeOfDay_Properties)  Time elapsed: 0 sec  <<< FAILURE!
junit.framework.AssertionFailedError: expected:<20> but was:<59>
	at junit.framework.Assert.fail(Assert.java:47)
	at junit.framework.Assert.failNotEquals(Assert.java:280)
	at junit.framework.Assert.assertEquals(Assert.java:64)
	at junit.framework.Assert.assertEquals(Assert.java:198)
	at junit.framework.Assert.assertEquals(Assert.java:204)
	at org.joda.time.TestTimeOfDay_Properties.check(TestTimeOfDay_Properties.java:732)
	at org.joda.time.TestTimeOfDay_Properties.testPropertyWithMinimumValueHour(TestTimeOfDay_Properties.java:206)

testPropertySetMinute(org.joda.time.TestTimeOfDay_Properties)  Time elapsed: 0 sec  <<< FAILURE!
junit.framework.AssertionFailedError: expected:<30> but was:<59>
	at junit.framework.Assert.fail(Assert.java:47)
	at junit.framework.Assert.failNotEquals(Assert.java:280)
	at junit.framework.Assert.assertEquals(Assert.java:64)
	at junit.framework.Assert.assertEquals(Assert.java:198)
	at junit.framework.Assert.assertEquals(Assert.java:204)
	at org.joda.time.TestTimeOfDay_Properties.check(TestTimeOfDay_Properties.java:733)
	at org.joda.time.TestTimeOfDay_Properties.testPropertySetMinute(TestTimeOfDay_Properties.java:362)

testPropertySetTextMinute(org.joda.time.TestTimeOfDay_Properties)  Time elapsed: 0.001 sec  <<< FAILURE!
junit.framework.AssertionFailedError: expected:<30> but was:<59>
	at junit.framework.Assert.fail(Assert.java:47)
	at junit.framework.Assert.failNotEquals(Assert.java:280)
	at junit.framework.Assert.assertEquals(Assert.java:64)
	at junit.framework.Assert.assertEquals(Assert.java:198)
	at junit.framework.Assert.assertEquals(Assert.java:204)
	at org.joda.time.TestTimeOfDay_Properties.check(TestTimeOfDay_Properties.java:733)
	at org.joda.time.TestTimeOfDay_Properties.testPropertySetTextMinute(TestTimeOfDay_Properties.java:378)

testWithers(org.joda.time.TestYearMonthDay_Basics)  Time elapsed: 0.001 sec  <<< FAILURE!
junit.framework.AssertionFailedError: expected:<6> but was:<12>
	at junit.framework.Assert.fail(Assert.java:47)
	at junit.framework.Assert.failNotEquals(Assert.java:280)
	at junit.framework.Assert.assertEquals(Assert.java:64)
	at junit.framework.Assert.assertEquals(Assert.java:198)
	at junit.framework.Assert.assertEquals(Assert.java:204)
	at org.joda.time.TestYearMonthDay_Basics.check(TestYearMonthDay_Basics.java:829)
	at org.joda.time.TestYearMonthDay_Basics.testWithers(TestYearMonthDay_Basics.java:746)

testWithField1(org.joda.time.TestYearMonthDay_Basics)  Time elapsed: 0 sec  <<< FAILURE!
junit.framework.AssertionFailedError: expected:<2006-06-09> but was:<2006-12-31>
	at junit.framework.Assert.fail(Assert.java:47)
	at junit.framework.Assert.failNotEquals(Assert.java:280)
	at junit.framework.Assert.assertEquals(Assert.java:64)
	at junit.framework.Assert.assertEquals(Assert.java:71)
	at org.joda.time.TestYearMonthDay_Basics.testWithField1(TestYearMonthDay_Basics.java:379)

testWithFieldAdded1(org.joda.time.TestYearMonthDay_Basics)  Time elapsed: 0.001 sec  <<< FAILURE!
junit.framework.AssertionFailedError: expected:<2010-06-09> but was:<2010-12-31>
	at junit.framework.Assert.fail(Assert.java:47)
	at junit.framework.Assert.failNotEquals(Assert.java:280)
	at junit.framework.Assert.assertEquals(Assert.java:64)
	at junit.framework.Assert.assertEquals(Assert.java:71)
	at org.joda.time.TestYearMonthDay_Basics.testWithFieldAdded1(TestYearMonthDay_Basics.java:411)

testPlus_RP(org.joda.time.TestYearMonthDay_Basics)  Time elapsed: 0.001 sec  <<< FAILURE!
junit.framework.AssertionFailedError: expected:<2003-07-07> but was:<2004-03-04>
	at junit.framework.Assert.fail(Assert.java:47)
	at junit.framework.Assert.failNotEquals(Assert.java:280)
	at junit.framework.Assert.assertEquals(Assert.java:64)
	at junit.framework.Assert.assertEquals(Assert.java:71)
	at org.joda.time.TestYearMonthDay_Basics.testPlus_RP(TestYearMonthDay_Basics.java:449)

testPlusYears_int(org.joda.time.TestYearMonthDay_Basics)  Time elapsed: 0.001 sec  <<< FAILURE!
junit.framework.AssertionFailedError: expected:<2003-05-03> but was:<2003-12-31>
	at junit.framework.Assert.fail(Assert.java:47)
	at junit.framework.Assert.failNotEquals(Assert.java:280)
	at junit.framework.Assert.assertEquals(Assert.java:64)
	at junit.framework.Assert.assertEquals(Assert.java:71)
	at org.joda.time.TestYearMonthDay_Basics.testPlusYears_int(TestYearMonthDay_Basics.java:459)

testPlusMonths_int(org.joda.time.TestYearMonthDay_Basics)  Time elapsed: 0 sec  <<< FAILURE!
junit.framework.AssertionFailedError: expected:<2002-06-03> but was:<2002-06-31>
	at junit.framework.Assert.fail(Assert.java:47)
	at junit.framework.Assert.failNotEquals(Assert.java:280)
	at junit.framework.Assert.assertEquals(Assert.java:64)
	at junit.framework.Assert.assertEquals(Assert.java:71)
	at org.joda.time.TestYearMonthDay_Basics.testPlusMonths_int(TestYearMonthDay_Basics.java:469)

testMinus_RP(org.joda.time.TestYearMonthDay_Basics)  Time elapsed: 0.001 sec  <<< FAILURE!
junit.framework.AssertionFailedError: expected:<2001-04-02> but was:<2001-11-30>
	at junit.framework.Assert.fail(Assert.java:47)
	at junit.framework.Assert.failNotEquals(Assert.java:280)
	at junit.framework.Assert.assertEquals(Assert.java:64)
	at junit.framework.Assert.assertEquals(Assert.java:71)
	at org.joda.time.TestYearMonthDay_Basics.testMinus_RP(TestYearMonthDay_Basics.java:490)

testMinusYears_int(org.joda.time.TestYearMonthDay_Basics)  Time elapsed: 0 sec  <<< FAILURE!
junit.framework.AssertionFailedError: expected:<2001-05-03> but was:<2001-12-31>
	at junit.framework.Assert.fail(Assert.java:47)
	at junit.framework.Assert.failNotEquals(Assert.java:280)
	at junit.framework.Assert.assertEquals(Assert.java:64)
	at junit.framework.Assert.assertEquals(Assert.java:71)
	at org.joda.time.TestYearMonthDay_Basics.testMinusYears_int(TestYearMonthDay_Basics.java:500)

testMinusMonths_int(org.joda.time.TestYearMonthDay_Basics)  Time elapsed: 0.001 sec  <<< FAILURE!
junit.framework.AssertionFailedError: expected:<2002-04-03> but was:<2002-04-31>
	at junit.framework.Assert.fail(Assert.java:47)
	at junit.framework.Assert.failNotEquals(Assert.java:280)
	at junit.framework.Assert.assertEquals(Assert.java:64)
	at junit.framework.Assert.assertEquals(Assert.java:71)
	at org.joda.time.TestYearMonthDay_Basics.testMinusMonths_int(TestYearMonthDay_Basics.java:510)

testPropertyAddYear(org.joda.time.TestYearMonthDay_Properties)  Time elapsed: 0.001 sec  <<< FAILURE!
junit.framework.AssertionFailedError: expected:<6> but was:<12>
	at junit.framework.Assert.fail(Assert.java:47)
	at junit.framework.Assert.failNotEquals(Assert.java:280)
	at junit.framework.Assert.assertEquals(Assert.java:64)
	at junit.framework.Assert.assertEquals(Assert.java:198)
	at junit.framework.Assert.assertEquals(Assert.java:204)
	at org.joda.time.TestYearMonthDay_Properties.check(TestYearMonthDay_Properties.java:556)
	at org.joda.time.TestYearMonthDay_Properties.testPropertyAddYear(TestYearMonthDay_Properties.java:115)

testPropertyAddWrapFieldYear(org.joda.time.TestYearMonthDay_Properties)  Time elapsed: 0 sec  <<< FAILURE!
junit.framework.AssertionFailedError: expected:<6> but was:<12>
	at junit.framework.Assert.fail(Assert.java:47)
	at junit.framework.Assert.failNotEquals(Assert.java:280)
	at junit.framework.Assert.assertEquals(Assert.java:64)
	at junit.framework.Assert.assertEquals(Assert.java:198)
	at junit.framework.Assert.assertEquals(Assert.java:204)
	at org.joda.time.TestYearMonthDay_Properties.check(TestYearMonthDay_Properties.java:556)
	at org.joda.time.TestYearMonthDay_Properties.testPropertyAddWrapFieldYear(TestYearMonthDay_Properties.java:146)

testPropertySetYear(org.joda.time.TestYearMonthDay_Properties)  Time elapsed: 0 sec  <<< FAILURE!
junit.framework.AssertionFailedError: expected:<6> but was:<12>
	at junit.framework.Assert.fail(Assert.java:47)
	at junit.framework.Assert.failNotEquals(Assert.java:280)
	at junit.framework.Assert.assertEquals(Assert.java:64)
	at junit.framework.Assert.assertEquals(Assert.java:198)
	at junit.framework.Assert.assertEquals(Assert.java:204)
	at org.joda.time.TestYearMonthDay_Properties.check(TestYearMonthDay_Properties.java:556)
	at org.joda.time.TestYearMonthDay_Properties.testPropertySetYear(TestYearMonthDay_Properties.java:162)

testPropertySetTextYear(org.joda.time.TestYearMonthDay_Properties)  Time elapsed: 0.002 sec  <<< FAILURE!
junit.framework.AssertionFailedError: expected:<6> but was:<12>
	at junit.framework.Assert.fail(Assert.java:47)
	at junit.framework.Assert.failNotEquals(Assert.java:280)
	at junit.framework.Assert.assertEquals(Assert.java:64)
	at junit.framework.Assert.assertEquals(Assert.java:198)
	at junit.framework.Assert.assertEquals(Assert.java:204)
	at org.joda.time.TestYearMonthDay_Properties.check(TestYearMonthDay_Properties.java:556)
	at org.joda.time.TestYearMonthDay_Properties.testPropertySetTextYear(TestYearMonthDay_Properties.java:169)

testPropertyAddWrapFieldMonth(org.joda.time.TestYearMonthDay_Properties)  Time elapsed: 0 sec  <<< FAILURE!
junit.framework.AssertionFailedError: expected:<9> but was:<31>
	at junit.framework.Assert.fail(Assert.java:47)
	at junit.framework.Assert.failNotEquals(Assert.java:280)
	at junit.framework.Assert.assertEquals(Assert.java:64)
	at junit.framework.Assert.assertEquals(Assert.java:198)
	at junit.framework.Assert.assertEquals(Assert.java:204)
	at org.joda.time.TestYearMonthDay_Properties.check(TestYearMonthDay_Properties.java:557)
	at org.joda.time.TestYearMonthDay_Properties.testPropertyAddWrapFieldMonth(TestYearMonthDay_Properties.java:259)

testPropertySetMonth(org.joda.time.TestYearMonthDay_Properties)  Time elapsed: 0.001 sec  <<< FAILURE!
junit.framework.AssertionFailedError: expected:<9> but was:<31>
	at junit.framework.Assert.fail(Assert.java:47)
	at junit.framework.Assert.failNotEquals(Assert.java:280)
	at junit.framework.Assert.assertEquals(Assert.java:64)
	at junit.framework.Assert.assertEquals(Assert.java:198)
	at junit.framework.Assert.assertEquals(Assert.java:204)
	at org.joda.time.TestYearMonthDay_Properties.check(TestYearMonthDay_Properties.java:557)
	at org.joda.time.TestYearMonthDay_Properties.testPropertySetMonth(TestYearMonthDay_Properties.java:286)

testPropertySetTextMonth(org.joda.time.TestYearMonthDay_Properties)  Time elapsed: 0 sec  <<< FAILURE!
junit.framework.AssertionFailedError: expected:<9> but was:<31>
	at junit.framework.Assert.fail(Assert.java:47)
	at junit.framework.Assert.failNotEquals(Assert.java:280)
	at junit.framework.Assert.assertEquals(Assert.java:64)
	at junit.framework.Assert.assertEquals(Assert.java:198)
	at junit.framework.Assert.assertEquals(Assert.java:204)
	at org.joda.time.TestYearMonthDay_Properties.check(TestYearMonthDay_Properties.java:557)
	at org.joda.time.TestYearMonthDay_Properties.testPropertySetTextMonth(TestYearMonthDay_Properties.java:306)

testWithers(org.joda.time.TestYearMonth_Basics)  Time elapsed: 0 sec  <<< FAILURE!
junit.framework.AssertionFailedError: expected:<6> but was:<12>
	at junit.framework.Assert.fail(Assert.java:47)
	at junit.framework.Assert.failNotEquals(Assert.java:280)
	at junit.framework.Assert.assertEquals(Assert.java:64)
	at junit.framework.Assert.assertEquals(Assert.java:198)
	at junit.framework.Assert.assertEquals(Assert.java:204)
	at org.joda.time.TestYearMonth_Basics.check(TestYearMonth_Basics.java:653)
	at org.joda.time.TestYearMonth_Basics.testWithers(TestYearMonth_Basics.java:572)

testPlus_RP(org.joda.time.TestYearMonth_Basics)  Time elapsed: 0.001 sec  <<< FAILURE!
junit.framework.AssertionFailedError: expected:<2003-07> but was:<2004-02>
	at junit.framework.Assert.fail(Assert.java:47)
	at junit.framework.Assert.failNotEquals(Assert.java:280)
	at junit.framework.Assert.assertEquals(Assert.java:64)
	at junit.framework.Assert.assertEquals(Assert.java:71)
	at org.joda.time.TestYearMonth_Basics.testPlus_RP(TestYearMonth_Basics.java:443)

testPlusYears_int(org.joda.time.TestYearMonth_Basics)  Time elapsed: 0 sec  <<< FAILURE!
junit.framework.AssertionFailedError: expected:<2003-05> but was:<2003-12>
	at junit.framework.Assert.fail(Assert.java:47)
	at junit.framework.Assert.failNotEquals(Assert.java:280)
	at junit.framework.Assert.assertEquals(Assert.java:64)
	at junit.framework.Assert.assertEquals(Assert.java:71)
	at org.joda.time.TestYearMonth_Basics.testPlusYears_int(TestYearMonth_Basics.java:453)

testMinus_RP(org.joda.time.TestYearMonth_Basics)  Time elapsed: 0.001 sec  <<< FAILURE!
junit.framework.AssertionFailedError: expected:<2001-04> but was:<2001-11>
	at junit.framework.Assert.fail(Assert.java:47)
	at junit.framework.Assert.failNotEquals(Assert.java:280)
	at junit.framework.Assert.assertEquals(Assert.java:64)
	at junit.framework.Assert.assertEquals(Assert.java:71)
	at org.joda.time.TestYearMonth_Basics.testMinus_RP(TestYearMonth_Basics.java:474)

testMinusYears_int(org.joda.time.TestYearMonth_Basics)  Time elapsed: 0.001 sec  <<< FAILURE!
junit.framework.AssertionFailedError: expected:<2001-05> but was:<2001-12>
	at junit.framework.Assert.fail(Assert.java:47)
	at junit.framework.Assert.failNotEquals(Assert.java:280)
	at junit.framework.Assert.assertEquals(Assert.java:64)
	at junit.framework.Assert.assertEquals(Assert.java:71)
	at org.joda.time.TestYearMonth_Basics.testMinusYears_int(TestYearMonth_Basics.java:484)

testWithFieldAdded(org.joda.time.TestYearMonth_Basics)  Time elapsed: 0 sec  <<< FAILURE!
junit.framework.AssertionFailedError: expected:<2010-06> but was:<2010-12>
	at junit.framework.Assert.fail(Assert.java:47)
	at junit.framework.Assert.failNotEquals(Assert.java:280)
	at junit.framework.Assert.assertEquals(Assert.java:64)
	at junit.framework.Assert.assertEquals(Assert.java:71)
	at org.joda.time.TestYearMonth_Basics.testWithFieldAdded(TestYearMonth_Basics.java:405)

testWithField(org.joda.time.TestYearMonth_Basics)  Time elapsed: 0.001 sec  <<< FAILURE!
junit.framework.AssertionFailedError: expected:<2006-06> but was:<2006-12>
	at junit.framework.Assert.fail(Assert.java:47)
	at junit.framework.Assert.failNotEquals(Assert.java:280)
	at junit.framework.Assert.assertEquals(Assert.java:64)
	at junit.framework.Assert.assertEquals(Assert.java:71)
	at org.joda.time.TestYearMonth_Basics.testWithField(TestYearMonth_Basics.java:373)

testPropertyAddYear(org.joda.time.TestYearMonth_Properties)  Time elapsed: 0.001 sec  <<< FAILURE!
junit.framework.AssertionFailedError: expected:<6> but was:<12>
	at junit.framework.Assert.fail(Assert.java:47)
	at junit.framework.Assert.failNotEquals(Assert.java:280)
	at junit.framework.Assert.assertEquals(Assert.java:64)
	at junit.framework.Assert.assertEquals(Assert.java:198)
	at junit.framework.Assert.assertEquals(Assert.java:204)
	at org.joda.time.TestYearMonth_Properties.check(TestYearMonth_Properties.java:364)
	at org.joda.time.TestYearMonth_Properties.testPropertyAddYear(TestYearMonth_Properties.java:114)

testPropertyAddWrapFieldYear(org.joda.time.TestYearMonth_Properties)  Time elapsed: 0 sec  <<< FAILURE!
junit.framework.AssertionFailedError: expected:<6> but was:<12>
	at junit.framework.Assert.fail(Assert.java:47)
	at junit.framework.Assert.failNotEquals(Assert.java:280)
	at junit.framework.Assert.assertEquals(Assert.java:64)
	at junit.framework.Assert.assertEquals(Assert.java:198)
	at junit.framework.Assert.assertEquals(Assert.java:204)
	at org.joda.time.TestYearMonth_Properties.check(TestYearMonth_Properties.java:364)
	at org.joda.time.TestYearMonth_Properties.testPropertyAddWrapFieldYear(TestYearMonth_Properties.java:145)

testPropertySetYear(org.joda.time.TestYearMonth_Properties)  Time elapsed: 0.001 sec  <<< FAILURE!
junit.framework.AssertionFailedError: expected:<6> but was:<12>
	at junit.framework.Assert.fail(Assert.java:47)
	at junit.framework.Assert.failNotEquals(Assert.java:280)
	at junit.framework.Assert.assertEquals(Assert.java:64)
	at junit.framework.Assert.assertEquals(Assert.java:198)
	at junit.framework.Assert.assertEquals(Assert.java:204)
	at org.joda.time.TestYearMonth_Properties.check(TestYearMonth_Properties.java:364)
	at org.joda.time.TestYearMonth_Properties.testPropertySetYear(TestYearMonth_Properties.java:161)

testPropertySetTextYear(org.joda.time.TestYearMonth_Properties)  Time elapsed: 0 sec  <<< FAILURE!
junit.framework.AssertionFailedError: expected:<6> but was:<12>
	at junit.framework.Assert.fail(Assert.java:47)
	at junit.framework.Assert.failNotEquals(Assert.java:280)
	at junit.framework.Assert.assertEquals(Assert.java:64)
	at junit.framework.Assert.assertEquals(Assert.java:198)
	at junit.framework.Assert.assertEquals(Assert.java:204)
	at org.joda.time.TestYearMonth_Properties.check(TestYearMonth_Properties.java:364)
	at org.joda.time.TestYearMonth_Properties.testPropertySetTextYear(TestYearMonth_Properties.java:168)

testWithers(org.joda.time.TestMonthDay_Basics)  Time elapsed: 0.001 sec  <<< FAILURE!
junit.framework.AssertionFailedError: expected:<6> but was:<31>
	at junit.framework.Assert.fail(Assert.java:47)
	at junit.framework.Assert.failNotEquals(Assert.java:280)
	at junit.framework.Assert.assertEquals(Assert.java:64)
	at junit.framework.Assert.assertEquals(Assert.java:198)
	at junit.framework.Assert.assertEquals(Assert.java:204)
	at org.joda.time.TestMonthDay_Basics.check(TestMonthDay_Basics.java:819)
	at org.joda.time.TestMonthDay_Basics.testWithers(TestMonthDay_Basics.java:738)

testPlus_RP(org.joda.time.TestMonthDay_Basics)  Time elapsed: 0 sec  <<< FAILURE!
junit.framework.AssertionFailedError: expected:<--08-09> but was:<--09-04>
	at junit.framework.Assert.fail(Assert.java:47)
	at junit.framework.Assert.failNotEquals(Assert.java:280)
	at junit.framework.Assert.assertEquals(Assert.java:64)
	at junit.framework.Assert.assertEquals(Assert.java:71)
	at org.joda.time.TestMonthDay_Basics.testPlus_RP(TestMonthDay_Basics.java:438)

testPlusMonths_int(org.joda.time.TestMonthDay_Basics)  Time elapsed: 0.001 sec  <<< FAILURE!
junit.framework.AssertionFailedError: expected:<--07-05> but was:<--07-31>
	at junit.framework.Assert.fail(Assert.java:47)
	at junit.framework.Assert.failNotEquals(Assert.java:280)
	at junit.framework.Assert.assertEquals(Assert.java:64)
	at junit.framework.Assert.assertEquals(Assert.java:71)
	at org.joda.time.TestMonthDay_Basics.testPlusMonths_int(TestMonthDay_Basics.java:448)

testMinus_RP(org.joda.time.TestMonthDay_Basics)  Time elapsed: 0.001 sec  <<< FAILURE!
junit.framework.AssertionFailedError: expected:<--05-04> but was:<--05-30>
	at junit.framework.Assert.fail(Assert.java:47)
	at junit.framework.Assert.failNotEquals(Assert.java:280)
	at junit.framework.Assert.assertEquals(Assert.java:64)
	at junit.framework.Assert.assertEquals(Assert.java:71)
	at org.joda.time.TestMonthDay_Basics.testMinus_RP(TestMonthDay_Basics.java:574)

testMinusMonths_int(org.joda.time.TestMonthDay_Basics)  Time elapsed: 0.001 sec  <<< FAILURE!
junit.framework.AssertionFailedError: expected:<--05-05> but was:<--05-31>
	at junit.framework.Assert.fail(Assert.java:47)
	at junit.framework.Assert.failNotEquals(Assert.java:280)
	at junit.framework.Assert.assertEquals(Assert.java:64)
	at junit.framework.Assert.assertEquals(Assert.java:71)
	at org.joda.time.TestMonthDay_Basics.testMinusMonths_int(TestMonthDay_Basics.java:584)

testPlusMonths_int_fromLeap(org.joda.time.TestMonthDay_Basics)  Time elapsed: 0.001 sec  <<< FAILURE!
junit.framework.AssertionFailedError: expected:<--03-29> but was:<--03-31>
	at junit.framework.Assert.fail(Assert.java:47)
	at junit.framework.Assert.failNotEquals(Assert.java:280)
	at junit.framework.Assert.assertEquals(Assert.java:64)
	at junit.framework.Assert.assertEquals(Assert.java:71)
	at org.joda.time.TestMonthDay_Basics.testPlusMonths_int_fromLeap(TestMonthDay_Basics.java:455)

testWithFieldAdded(org.joda.time.TestMonthDay_Basics)  Time elapsed: 0.001 sec  <<< FAILURE!
junit.framework.AssertionFailedError: expected:<--10-06> but was:<--10-31>
	at junit.framework.Assert.fail(Assert.java:47)
	at junit.framework.Assert.failNotEquals(Assert.java:280)
	at junit.framework.Assert.assertEquals(Assert.java:64)
	at junit.framework.Assert.assertEquals(Assert.java:71)
	at org.joda.time.TestMonthDay_Basics.testWithFieldAdded(TestMonthDay_Basics.java:400)

testPlusMonths_int_negativeFromLeap(org.joda.time.TestMonthDay_Basics)  Time elapsed: 0.001 sec  <<< FAILURE!
junit.framework.AssertionFailedError: expected:<--01-29> but was:<--01-31>
	at junit.framework.Assert.fail(Assert.java:47)
	at junit.framework.Assert.failNotEquals(Assert.java:280)
	at junit.framework.Assert.assertEquals(Assert.java:64)
	at junit.framework.Assert.assertEquals(Assert.java:71)
	at org.joda.time.TestMonthDay_Basics.testPlusMonths_int_negativeFromLeap(TestMonthDay_Basics.java:462)

testPlusMonths_int_endOfMonthAdjust(org.joda.time.TestMonthDay_Basics)  Time elapsed: 0 sec  <<< FAILURE!
junit.framework.AssertionFailedError: expected:<--04-30> but was:<--04-31>
	at junit.framework.Assert.fail(Assert.java:47)
	at junit.framework.Assert.failNotEquals(Assert.java:280)
	at junit.framework.Assert.assertEquals(Assert.java:64)
	at junit.framework.Assert.assertEquals(Assert.java:71)
	at org.joda.time.TestMonthDay_Basics.testPlusMonths_int_endOfMonthAdjust(TestMonthDay_Basics.java:469)

testPlusMonths_int_negativeEndOfMonthAdjust(org.joda.time.TestMonthDay_Basics)  Time elapsed: 0.001 sec  <<< FAILURE!
junit.framework.AssertionFailedError: expected:<--02-29> but was:<--02-31>
	at junit.framework.Assert.fail(Assert.java:47)
	at junit.framework.Assert.failNotEquals(Assert.java:280)
	at junit.framework.Assert.assertEquals(Assert.java:64)
	at junit.framework.Assert.assertEquals(Assert.java:71)
	at org.joda.time.TestMonthDay_Basics.testPlusMonths_int_negativeEndOfMonthAdjust(TestMonthDay_Basics.java:476)

testPlusMonths_int_wrap(org.joda.time.TestMonthDay_Basics)  Time elapsed: 0.001 sec  <<< FAILURE!
junit.framework.AssertionFailedError: expected:<--04-05> but was:<--04-30>
	at junit.framework.Assert.fail(Assert.java:47)
	at junit.framework.Assert.failNotEquals(Assert.java:280)
	at junit.framework.Assert.assertEquals(Assert.java:64)
	at junit.framework.Assert.assertEquals(Assert.java:71)
	at org.joda.time.TestMonthDay_Basics.testPlusMonths_int_wrap(TestMonthDay_Basics.java:489)

testPlusMonths_int_adjust(org.joda.time.TestMonthDay_Basics)  Time elapsed: 0 sec  <<< FAILURE!
junit.framework.AssertionFailedError: expected:<--09-30> but was:<--09-31>
	at junit.framework.Assert.fail(Assert.java:47)
	at junit.framework.Assert.failNotEquals(Assert.java:280)
	at junit.framework.Assert.assertEquals(Assert.java:64)
	at junit.framework.Assert.assertEquals(Assert.java:71)
	at org.joda.time.TestMonthDay_Basics.testPlusMonths_int_adjust(TestMonthDay_Basics.java:496)

testWithField(org.joda.time.TestMonthDay_Basics)  Time elapsed: 0.001 sec  <<< FAILURE!
junit.framework.AssertionFailedError: expected:<--10-06> but was:<--10-31>
	at junit.framework.Assert.fail(Assert.java:47)
	at junit.framework.Assert.failNotEquals(Assert.java:280)
	at junit.framework.Assert.assertEquals(Assert.java:64)
	at junit.framework.Assert.assertEquals(Assert.java:71)
	at org.joda.time.TestMonthDay_Basics.testWithField(TestMonthDay_Basics.java:368)

testMinusMonths_int_fromLeap(org.joda.time.TestMonthDay_Basics)  Time elapsed: 0 sec  <<< FAILURE!
junit.framework.AssertionFailedError: expected:<--01-29> but was:<--01-31>
	at junit.framework.Assert.fail(Assert.java:47)
	at junit.framework.Assert.failNotEquals(Assert.java:280)
	at junit.framework.Assert.assertEquals(Assert.java:64)
	at junit.framework.Assert.assertEquals(Assert.java:71)
	at org.joda.time.TestMonthDay_Basics.testMinusMonths_int_fromLeap(TestMonthDay_Basics.java:591)

testMinusMonths_int_negativeFromLeap(org.joda.time.TestMonthDay_Basics)  Time elapsed: 0 sec  <<< FAILURE!
junit.framework.AssertionFailedError: expected:<--03-29> but was:<--03-31>
	at junit.framework.Assert.fail(Assert.java:47)
	at junit.framework.Assert.failNotEquals(Assert.java:280)
	at junit.framework.Assert.assertEquals(Assert.java:64)
	at junit.framework.Assert.assertEquals(Assert.java:71)
	at org.joda.time.TestMonthDay_Basics.testMinusMonths_int_negativeFromLeap(TestMonthDay_Basics.java:598)

testMinusMonths_int_endOfMonthAdjust(org.joda.time.TestMonthDay_Basics)  Time elapsed: 0.001 sec  <<< FAILURE!
junit.framework.AssertionFailedError: expected:<--02-29> but was:<--02-31>
	at junit.framework.Assert.fail(Assert.java:47)
	at junit.framework.Assert.failNotEquals(Assert.java:280)
	at junit.framework.Assert.assertEquals(Assert.java:64)
	at junit.framework.Assert.assertEquals(Assert.java:71)
	at org.joda.time.TestMonthDay_Basics.testMinusMonths_int_endOfMonthAdjust(TestMonthDay_Basics.java:605)

testMinusMonths_int_negativeEndOfMonthAdjust(org.joda.time.TestMonthDay_Basics)  Time elapsed: 0 sec  <<< FAILURE!
junit.framework.AssertionFailedError: expected:<--04-30> but was:<--04-31>
	at junit.framework.Assert.fail(Assert.java:47)
	at junit.framework.Assert.failNotEquals(Assert.java:280)
	at junit.framework.Assert.assertEquals(Assert.java:64)
	at junit.framework.Assert.assertEquals(Assert.java:71)
	at org.joda.time.TestMonthDay_Basics.testMinusMonths_int_negativeEndOfMonthAdjust(TestMonthDay_Basics.java:612)

testMinusMonths_int_wrap(org.joda.time.TestMonthDay_Basics)  Time elapsed: 0 sec  <<< FAILURE!
junit.framework.AssertionFailedError: expected:<--08-05> but was:<--08-31>
	at junit.framework.Assert.fail(Assert.java:47)
	at junit.framework.Assert.failNotEquals(Assert.java:280)
	at junit.framework.Assert.assertEquals(Assert.java:64)
	at junit.framework.Assert.assertEquals(Assert.java:71)
	at org.joda.time.TestMonthDay_Basics.testMinusMonths_int_wrap(TestMonthDay_Basics.java:625)

testMinusMonths_int_adjust(org.joda.time.TestMonthDay_Basics)  Time elapsed: 0.001 sec  <<< FAILURE!
junit.framework.AssertionFailedError: expected:<--04-30> but was:<--04-31>
	at junit.framework.Assert.fail(Assert.java:47)
	at junit.framework.Assert.failNotEquals(Assert.java:280)
	at junit.framework.Assert.assertEquals(Assert.java:64)
	at junit.framework.Assert.assertEquals(Assert.java:71)
	at org.joda.time.TestMonthDay_Basics.testMinusMonths_int_adjust(TestMonthDay_Basics.java:632)

testPropertyAddMonthOfYear(org.joda.time.TestMonthDay_Properties)  Time elapsed: 0.001 sec  <<< FAILURE!
junit.framework.AssertionFailedError: expected:<6> but was:<31>
	at junit.framework.Assert.fail(Assert.java:47)
	at junit.framework.Assert.failNotEquals(Assert.java:280)
	at junit.framework.Assert.assertEquals(Assert.java:64)
	at junit.framework.Assert.assertEquals(Assert.java:198)
	at junit.framework.Assert.assertEquals(Assert.java:204)
	at org.joda.time.TestMonthDay_Properties.check(TestMonthDay_Properties.java:346)
	at org.joda.time.TestMonthDay_Properties.testPropertyAddMonthOfYear(TestMonthDay_Properties.java:111)

testPropertyAddWrapFieldMonthOfYear(org.joda.time.TestMonthDay_Properties)  Time elapsed: 0 sec  <<< FAILURE!
junit.framework.AssertionFailedError: expected:<6> but was:<31>
	at junit.framework.Assert.fail(Assert.java:47)
	at junit.framework.Assert.failNotEquals(Assert.java:280)
	at junit.framework.Assert.assertEquals(Assert.java:64)
	at junit.framework.Assert.assertEquals(Assert.java:198)
	at junit.framework.Assert.assertEquals(Assert.java:204)
	at org.joda.time.TestMonthDay_Properties.check(TestMonthDay_Properties.java:346)
	at org.joda.time.TestMonthDay_Properties.testPropertyAddWrapFieldMonthOfYear(TestMonthDay_Properties.java:127)

testPropertySetMonthOfYear(org.joda.time.TestMonthDay_Properties)  Time elapsed: 0.001 sec  <<< FAILURE!
junit.framework.AssertionFailedError: expected:<6> but was:<31>
	at junit.framework.Assert.fail(Assert.java:47)
	at junit.framework.Assert.failNotEquals(Assert.java:280)
	at junit.framework.Assert.assertEquals(Assert.java:64)
	at junit.framework.Assert.assertEquals(Assert.java:198)
	at junit.framework.Assert.assertEquals(Assert.java:204)
	at org.joda.time.TestMonthDay_Properties.check(TestMonthDay_Properties.java:346)
	at org.joda.time.TestMonthDay_Properties.testPropertySetMonthOfYear(TestMonthDay_Properties.java:143)

testPropertySetTextMonthOfYear(org.joda.time.TestMonthDay_Properties)  Time elapsed: 0 sec  <<< FAILURE!
junit.framework.AssertionFailedError: expected:<6> but was:<31>
	at junit.framework.Assert.fail(Assert.java:47)
	at junit.framework.Assert.failNotEquals(Assert.java:280)
	at junit.framework.Assert.assertEquals(Assert.java:64)
	at junit.framework.Assert.assertEquals(Assert.java:198)
	at junit.framework.Assert.assertEquals(Assert.java:204)
	at org.joda.time.TestMonthDay_Properties.check(TestMonthDay_Properties.java:346)
	at org.joda.time.TestMonthDay_Properties.testPropertySetTextMonthOfYear(TestMonthDay_Properties.java:150)

testWithField1(org.joda.time.TestPartial_Basics)  Time elapsed: 0.001 sec  <<< FAILURE!
junit.framework.AssertionFailedError: 15:59 expected:<20> but was:<59>
	at junit.framework.Assert.fail(Assert.java:47)
	at junit.framework.Assert.failNotEquals(Assert.java:280)
	at junit.framework.Assert.assertEquals(Assert.java:64)
	at junit.framework.Assert.assertEquals(Assert.java:198)
	at org.joda.time.TestPartial_Basics.check(TestPartial_Basics.java:928)
	at org.joda.time.TestPartial_Basics.testWithField1(TestPartial_Basics.java:522)

testWithFieldAdded1(org.joda.time.TestPartial_Basics)  Time elapsed: 0.001 sec  <<< FAILURE!
junit.framework.AssertionFailedError: 16:59 expected:<20> but was:<59>
	at junit.framework.Assert.fail(Assert.java:47)
	at junit.framework.Assert.failNotEquals(Assert.java:280)
	at junit.framework.Assert.assertEquals(Assert.java:64)
	at junit.framework.Assert.assertEquals(Assert.java:198)
	at org.joda.time.TestPartial_Basics.check(TestPartial_Basics.java:928)
	at org.joda.time.TestPartial_Basics.testWithFieldAdded1(TestPartial_Basics.java:556)

testPlus_RP(org.joda.time.TestPartial_Basics)  Time elapsed: 0.001 sec  <<< FAILURE!
junit.framework.AssertionFailedError: 16:05 expected:<15> but was:<16>
	at junit.framework.Assert.fail(Assert.java:47)
	at junit.framework.Assert.failNotEquals(Assert.java:280)
	at junit.framework.Assert.assertEquals(Assert.java:64)
	at junit.framework.Assert.assertEquals(Assert.java:198)
	at org.joda.time.TestPartial_Basics.check(TestPartial_Basics.java:927)
	at org.joda.time.TestPartial_Basics.testPlus_RP(TestPartial_Basics.java:724)

testMinus_RP(org.joda.time.TestPartial_Basics)  Time elapsed: 0.001 sec  <<< FAILURE!
junit.framework.AssertionFailedError: 09:58 expected:<19> but was:<58>
	at junit.framework.Assert.fail(Assert.java:47)
	at junit.framework.Assert.failNotEquals(Assert.java:280)
	at junit.framework.Assert.assertEquals(Assert.java:64)
	at junit.framework.Assert.assertEquals(Assert.java:198)
	at org.joda.time.TestPartial_Basics.check(TestPartial_Basics.java:928)
	at org.joda.time.TestPartial_Basics.testMinus_RP(TestPartial_Basics.java:735)

testWithFieldAddWrapped1(org.joda.time.TestPartial_Basics)  Time elapsed: 0 sec  <<< FAILURE!
junit.framework.AssertionFailedError: 16:59 expected:<20> but was:<59>
	at junit.framework.Assert.fail(Assert.java:47)
	at junit.framework.Assert.failNotEquals(Assert.java:280)
	at junit.framework.Assert.assertEquals(Assert.java:64)
	at junit.framework.Assert.assertEquals(Assert.java:198)
	at org.joda.time.TestPartial_Basics.check(TestPartial_Basics.java:928)
	at org.joda.time.TestPartial_Basics.testWithFieldAddWrapped1(TestPartial_Basics.java:650)

testWithFieldAddWrapped6(org.joda.time.TestPartial_Basics)  Time elapsed: 0.001 sec  <<< FAILURE!
junit.framework.AssertionFailedError: 02:59 expected:<20> but was:<59>
	at junit.framework.Assert.fail(Assert.java:47)
	at junit.framework.Assert.failNotEquals(Assert.java:280)
	at junit.framework.Assert.assertEquals(Assert.java:64)
	at junit.framework.Assert.assertEquals(Assert.java:198)
	at org.joda.time.TestPartial_Basics.check(TestPartial_Basics.java:928)
	at org.joda.time.TestPartial_Basics.testWithFieldAddWrapped6(TestPartial_Basics.java:692)

testWith1(org.joda.time.TestPartial_Basics)  Time elapsed: 0 sec  <<< FAILURE!
junit.framework.AssertionFailedError: 15:59 expected:<20> but was:<59>
	at junit.framework.Assert.fail(Assert.java:47)
	at junit.framework.Assert.failNotEquals(Assert.java:280)
	at junit.framework.Assert.assertEquals(Assert.java:64)
	at junit.framework.Assert.assertEquals(Assert.java:198)
	at org.joda.time.TestPartial_Basics.check(TestPartial_Basics.java:928)
	at org.joda.time.TestPartial_Basics.testWith1(TestPartial_Basics.java:348)

testWithFieldAddWrapped8(org.joda.time.TestPartial_Basics)  Time elapsed: 0 sec  <<< FAILURE!
junit.framework.AssertionFailedError: 23:59 expected:<0> but was:<59>
	at junit.framework.Assert.fail(Assert.java:47)
	at junit.framework.Assert.failNotEquals(Assert.java:280)
	at junit.framework.Assert.assertEquals(Assert.java:64)
	at junit.framework.Assert.assertEquals(Assert.java:198)
	at org.joda.time.TestPartial_Basics.check(TestPartial_Basics.java:928)
	at org.joda.time.TestPartial_Basics.testWithFieldAddWrapped8(TestPartial_Basics.java:716)

testPropertyAddWrapFieldHour(org.joda.time.TestPartial_Properties)  Time elapsed: 0 sec  <<< FAILURE!
junit.framework.AssertionFailedError: expected:<20> but was:<59>
	at junit.framework.Assert.fail(Assert.java:47)
	at junit.framework.Assert.failNotEquals(Assert.java:280)
	at junit.framework.Assert.assertEquals(Assert.java:64)
	at junit.framework.Assert.assertEquals(Assert.java:198)
	at junit.framework.Assert.assertEquals(Assert.java:204)
	at org.joda.time.TestPartial_Properties.check(TestPartial_Properties.java:412)
	at org.joda.time.TestPartial_Properties.testPropertyAddWrapFieldHour(TestPartial_Properties.java:166)

testPropertyAddMinute(org.joda.time.TestPartial_Properties)  Time elapsed: 0.001 sec  <<< FAILURE!
junit.framework.AssertionFailedError: expected:<30> but was:<59>
	at junit.framework.Assert.fail(Assert.java:47)
	at junit.framework.Assert.failNotEquals(Assert.java:280)
	at junit.framework.Assert.assertEquals(Assert.java:64)
	at junit.framework.Assert.assertEquals(Assert.java:198)
	at junit.framework.Assert.assertEquals(Assert.java:204)
	at org.joda.time.TestPartial_Properties.check(TestPartial_Properties.java:413)
	at org.joda.time.TestPartial_Properties.testPropertyAddMinute(TestPartial_Properties.java:309)

testPropertyAddWrapFieldMinute(org.joda.time.TestPartial_Properties)  Time elapsed: 0 sec  <<< FAILURE!
junit.framework.AssertionFailedError: expected:<30> but was:<59>
	at junit.framework.Assert.fail(Assert.java:47)
	at junit.framework.Assert.failNotEquals(Assert.java:280)
	at junit.framework.Assert.assertEquals(Assert.java:64)
	at junit.framework.Assert.assertEquals(Assert.java:198)
	at junit.framework.Assert.assertEquals(Assert.java:204)
	at org.joda.time.TestPartial_Properties.check(TestPartial_Properties.java:413)
	at org.joda.time.TestPartial_Properties.testPropertyAddWrapFieldMinute(TestPartial_Properties.java:355)

testPropertyAddHour(org.joda.time.TestPartial_Properties)  Time elapsed: 0.001 sec  <<< FAILURE!
junit.framework.AssertionFailedError: expected:<20> but was:<59>
	at junit.framework.Assert.fail(Assert.java:47)
	at junit.framework.Assert.failNotEquals(Assert.java:280)
	at junit.framework.Assert.assertEquals(Assert.java:64)
	at junit.framework.Assert.assertEquals(Assert.java:198)
	at junit.framework.Assert.assertEquals(Assert.java:204)
	at org.joda.time.TestPartial_Properties.check(TestPartial_Properties.java:412)
	at org.joda.time.TestPartial_Properties.testPropertyAddHour(TestPartial_Properties.java:138)

testPropertySetHour(org.joda.time.TestPartial_Properties)  Time elapsed: 0.001 sec  <<< FAILURE!
junit.framework.AssertionFailedError: expected:<20> but was:<59>
	at junit.framework.Assert.fail(Assert.java:47)
	at junit.framework.Assert.failNotEquals(Assert.java:280)
	at junit.framework.Assert.assertEquals(Assert.java:64)
	at junit.framework.Assert.assertEquals(Assert.java:198)
	at junit.framework.Assert.assertEquals(Assert.java:204)
	at org.joda.time.TestPartial_Properties.check(TestPartial_Properties.java:412)
	at org.joda.time.TestPartial_Properties.testPropertySetHour(TestPartial_Properties.java:182)

testPropertySetTextHour(org.joda.time.TestPartial_Properties)  Time elapsed: 0 sec  <<< FAILURE!
junit.framework.AssertionFailedError: expected:<20> but was:<59>
	at junit.framework.Assert.fail(Assert.java:47)
	at junit.framework.Assert.failNotEquals(Assert.java:280)
	at junit.framework.Assert.assertEquals(Assert.java:64)
	at junit.framework.Assert.assertEquals(Assert.java:198)
	at junit.framework.Assert.assertEquals(Assert.java:204)
	at org.joda.time.TestPartial_Properties.check(TestPartial_Properties.java:412)
	at org.joda.time.TestPartial_Properties.testPropertySetTextHour(TestPartial_Properties.java:198)

testPropertyWithMaximumValueHour(org.joda.time.TestPartial_Properties)  Time elapsed: 0.001 sec  <<< FAILURE!
junit.framework.AssertionFailedError: expected:<20> but was:<59>
	at junit.framework.Assert.fail(Assert.java:47)
	at junit.framework.Assert.failNotEquals(Assert.java:280)
	at junit.framework.Assert.assertEquals(Assert.java:64)
	at junit.framework.Assert.assertEquals(Assert.java:198)
	at junit.framework.Assert.assertEquals(Assert.java:204)
	at org.joda.time.TestPartial_Properties.check(TestPartial_Properties.java:412)
	at org.joda.time.TestPartial_Properties.testPropertyWithMaximumValueHour(TestPartial_Properties.java:205)

testPropertyWithMinimumValueHour(org.joda.time.TestPartial_Properties)  Time elapsed: 0 sec  <<< FAILURE!
junit.framework.AssertionFailedError: expected:<20> but was:<59>
	at junit.framework.Assert.fail(Assert.java:47)
	at junit.framework.Assert.failNotEquals(Assert.java:280)
	at junit.framework.Assert.assertEquals(Assert.java:64)
	at junit.framework.Assert.assertEquals(Assert.java:198)
	at junit.framework.Assert.assertEquals(Assert.java:204)
	at org.joda.time.TestPartial_Properties.check(TestPartial_Properties.java:412)
	at org.joda.time.TestPartial_Properties.testPropertyWithMinimumValueHour(TestPartial_Properties.java:212)

testPropertySetMinute(org.joda.time.TestPartial_Properties)  Time elapsed: 0 sec  <<< FAILURE!
junit.framework.AssertionFailedError: expected:<30> but was:<59>
	at junit.framework.Assert.fail(Assert.java:47)
	at junit.framework.Assert.failNotEquals(Assert.java:280)
	at junit.framework.Assert.assertEquals(Assert.java:64)
	at junit.framework.Assert.assertEquals(Assert.java:198)
	at junit.framework.Assert.assertEquals(Assert.java:204)
	at org.joda.time.TestPartial_Properties.check(TestPartial_Properties.java:413)
	at org.joda.time.TestPartial_Properties.testPropertySetMinute(TestPartial_Properties.java:368)

testPropertySetTextMinute(org.joda.time.TestPartial_Properties)  Time elapsed: 0.001 sec  <<< FAILURE!
junit.framework.AssertionFailedError: expected:<30> but was:<59>
	at junit.framework.Assert.fail(Assert.java:47)
	at junit.framework.Assert.failNotEquals(Assert.java:280)
	at junit.framework.Assert.assertEquals(Assert.java:64)
	at junit.framework.Assert.assertEquals(Assert.java:198)
	at junit.framework.Assert.assertEquals(Assert.java:204)
	at org.joda.time.TestPartial_Properties.check(TestPartial_Properties.java:413)
	at org.joda.time.TestPartial_Properties.testPropertySetTextMinute(TestPartial_Properties.java:384)

testSetMethods(org.joda.time.TestBasePartial)  Time elapsed: 0.001 sec  <<< FAILURE!
junit.framework.AssertionFailedError: expected:<1> but was:<12>
	at junit.framework.Assert.fail(Assert.java:47)
	at junit.framework.Assert.failNotEquals(Assert.java:280)
	at junit.framework.Assert.assertEquals(Assert.java:64)
	at junit.framework.Assert.assertEquals(Assert.java:198)
	at junit.framework.Assert.assertEquals(Assert.java:204)
	at org.joda.time.TestBasePartial.testSetMethods(TestBasePartial.java:79)

testTimeOfDayAdd(org.joda.time.chrono.TestGJChronology)  Time elapsed: 0 sec  <<< FAILURE!
junit.framework.AssertionFailedError: expected:<T10:30:00.000> but was:<T10:59:59.999>
	at junit.framework.Assert.fail(Assert.java:47)
	at junit.framework.Assert.failNotEquals(Assert.java:280)
	at junit.framework.Assert.assertEquals(Assert.java:64)
	at junit.framework.Assert.assertEquals(Assert.java:71)
	at org.joda.time.chrono.TestGJChronology.testTimeOfDayAdd(TestGJChronology.java:504)

testCutoverAddYears(org.joda.time.chrono.TestISOChronology)  Time elapsed: 0.002 sec  <<< FAILURE!
junit.framework.AssertionFailedError: expected:<1583-01-01> but was:<1583-12-31>
	at junit.framework.Assert.fail(Assert.java:47)
	at junit.framework.Assert.failNotEquals(Assert.java:280)
	at junit.framework.Assert.assertEquals(Assert.java:64)
	at junit.framework.Assert.assertEquals(Assert.java:71)
	at org.joda.time.chrono.TestISOChronology.testAdd(TestISOChronology.java:425)
	at org.joda.time.chrono.TestISOChronology.testCutoverAddYears(TestISOChronology.java:376)

testTimeOfDayAdd(org.joda.time.chrono.TestISOChronology)  Time elapsed: 0 sec  <<< FAILURE!
junit.framework.AssertionFailedError: expected:<T10:30:00.000> but was:<T10:59:59.999>
	at junit.framework.Assert.fail(Assert.java:47)
	at junit.framework.Assert.failNotEquals(Assert.java:280)
	at junit.framework.Assert.assertEquals(Assert.java:64)
	at junit.framework.Assert.assertEquals(Assert.java:71)
	at org.joda.time.chrono.TestISOChronology.testTimeOfDayAdd(TestISOChronology.java:433)

test_set_RP_int_intarray_String_Locale(org.joda.time.field.TestBaseDateTimeField)  Time elapsed: 0.001 sec  <<< FAILURE!
junit.framework.AssertionFailedError: expected:<true> but was:<false>
	at junit.framework.Assert.fail(Assert.java:47)
	at junit.framework.Assert.failNotEquals(Assert.java:280)
	at junit.framework.Assert.assertEquals(Assert.java:64)
	at junit.framework.Assert.assertEquals(Assert.java:146)
	at junit.framework.Assert.assertEquals(Assert.java:152)
	at org.joda.time.field.TestBaseDateTimeField.test_set_RP_int_intarray_String_Locale(TestBaseDateTimeField.java:321)

test_add_RP_int_intarray_int(org.joda.time.field.TestBaseDateTimeField)  Time elapsed: 0.001 sec  <<< FAILURE!
junit.framework.AssertionFailedError: expected:<true> but was:<false>
	at junit.framework.Assert.fail(Assert.java:47)
	at junit.framework.Assert.failNotEquals(Assert.java:280)
	at junit.framework.Assert.assertEquals(Assert.java:64)
	at junit.framework.Assert.assertEquals(Assert.java:146)
	at junit.framework.Assert.assertEquals(Assert.java:152)
	at org.joda.time.field.TestBaseDateTimeField.test_add_RP_int_intarray_int(TestBaseDateTimeField.java:180)

test_addWrapField_RP_int_intarray_int(org.joda.time.field.TestBaseDateTimeField)  Time elapsed: 0 sec  <<< FAILURE!
junit.framework.AssertionFailedError: expected:<true> but was:<false>
	at junit.framework.Assert.fail(Assert.java:47)
	at junit.framework.Assert.failNotEquals(Assert.java:280)
	at junit.framework.Assert.assertEquals(Assert.java:64)
	at junit.framework.Assert.assertEquals(Assert.java:146)
	at junit.framework.Assert.assertEquals(Assert.java:152)
	at org.joda.time.field.TestBaseDateTimeField.test_addWrapField_RP_int_intarray_int(TestBaseDateTimeField.java:235)

test_set_RP_int_intarray_int(org.joda.time.field.TestBaseDateTimeField)  Time elapsed: 0 sec  <<< FAILURE!
junit.framework.AssertionFailedError: expected:<true> but was:<false>
	at junit.framework.Assert.fail(Assert.java:47)
	at junit.framework.Assert.failNotEquals(Assert.java:280)
	at junit.framework.Assert.assertEquals(Assert.java:64)
	at junit.framework.Assert.assertEquals(Assert.java:146)
	at junit.framework.Assert.assertEquals(Assert.java:152)
	at org.joda.time.field.TestBaseDateTimeField.test_set_RP_int_intarray_int(TestBaseDateTimeField.java:280)

test_set_RP_int_intarray_String_Locale(org.joda.time.field.TestOffsetDateTimeField)  Time elapsed: 0 sec  <<< FAILURE!
junit.framework.AssertionFailedError: expected:<true> but was:<false>
	at junit.framework.Assert.fail(Assert.java:47)
	at junit.framework.Assert.failNotEquals(Assert.java:280)
	at junit.framework.Assert.assertEquals(Assert.java:64)
	at junit.framework.Assert.assertEquals(Assert.java:146)
	at junit.framework.Assert.assertEquals(Assert.java:152)
	at org.joda.time.field.TestOffsetDateTimeField.test_set_RP_int_intarray_String_Locale(TestOffsetDateTimeField.java:354)

test_add_RP_int_intarray_int(org.joda.time.field.TestOffsetDateTimeField)  Time elapsed: 0 sec  <<< FAILURE!
junit.framework.AssertionFailedError: expected:<true> but was:<false>
	at junit.framework.Assert.fail(Assert.java:47)
	at junit.framework.Assert.failNotEquals(Assert.java:280)
	at junit.framework.Assert.assertEquals(Assert.java:64)
	at junit.framework.Assert.assertEquals(Assert.java:146)
	at junit.framework.Assert.assertEquals(Assert.java:152)
	at org.joda.time.field.TestOffsetDateTimeField.test_add_RP_int_intarray_int(TestOffsetDateTimeField.java:228)

test_addWrapField_RP_int_intarray_int(org.joda.time.field.TestOffsetDateTimeField)  Time elapsed: 0 sec  <<< FAILURE!
junit.framework.AssertionFailedError: expected:<true> but was:<false>
	at junit.framework.Assert.fail(Assert.java:47)
	at junit.framework.Assert.failNotEquals(Assert.java:280)
	at junit.framework.Assert.assertEquals(Assert.java:64)
	at junit.framework.Assert.assertEquals(Assert.java:146)
	at junit.framework.Assert.assertEquals(Assert.java:152)
	at org.joda.time.field.TestOffsetDateTimeField.test_addWrapField_RP_int_intarray_int(TestOffsetDateTimeField.java:276)

test_set_RP_int_intarray_int(org.joda.time.field.TestOffsetDateTimeField)  Time elapsed: 0.001 sec  <<< FAILURE!
junit.framework.AssertionFailedError: expected:<true> but was:<false>
	at junit.framework.Assert.fail(Assert.java:47)
	at junit.framework.Assert.failNotEquals(Assert.java:280)
	at junit.framework.Assert.assertEquals(Assert.java:64)
	at junit.framework.Assert.assertEquals(Assert.java:146)
	at junit.framework.Assert.assertEquals(Assert.java:152)
	at org.joda.time.field.TestOffsetDateTimeField.test_set_RP_int_intarray_int(TestOffsetDateTimeField.java:313)

test_set_RP_int_intarray_String_Locale(org.joda.time.field.TestPreciseDurationDateTimeField)  Time elapsed: 0 sec  <<< FAILURE!
junit.framework.AssertionFailedError: expected:<true> but was:<false>
	at junit.framework.Assert.fail(Assert.java:47)
	at junit.framework.Assert.failNotEquals(Assert.java:280)
	at junit.framework.Assert.assertEquals(Assert.java:64)
	at junit.framework.Assert.assertEquals(Assert.java:146)
	at junit.framework.Assert.assertEquals(Assert.java:152)
	at org.joda.time.field.TestPreciseDurationDateTimeField.test_set_RP_int_intarray_String_Locale(TestPreciseDurationDateTimeField.java:326)

test_add_RP_int_intarray_int(org.joda.time.field.TestPreciseDurationDateTimeField)  Time elapsed: 0 sec  <<< FAILURE!
junit.framework.AssertionFailedError: expected:<true> but was:<false>
	at junit.framework.Assert.fail(Assert.java:47)
	at junit.framework.Assert.failNotEquals(Assert.java:280)
	at junit.framework.Assert.assertEquals(Assert.java:64)
	at junit.framework.Assert.assertEquals(Assert.java:146)
	at junit.framework.Assert.assertEquals(Assert.java:152)
	at org.joda.time.field.TestPreciseDurationDateTimeField.test_add_RP_int_intarray_int(TestPreciseDurationDateTimeField.java:197)

test_addWrapField_RP_int_intarray_int(org.joda.time.field.TestPreciseDurationDateTimeField)  Time elapsed: 0 sec  <<< FAILURE!
junit.framework.AssertionFailedError: expected:<true> but was:<false>
	at junit.framework.Assert.fail(Assert.java:47)
	at junit.framework.Assert.failNotEquals(Assert.java:280)
	at junit.framework.Assert.assertEquals(Assert.java:64)
	at junit.framework.Assert.assertEquals(Assert.java:146)
	at junit.framework.Assert.assertEquals(Assert.java:152)
	at org.joda.time.field.TestPreciseDurationDateTimeField.test_addWrapField_RP_int_intarray_int(TestPreciseDurationDateTimeField.java:240)

test_set_RP_int_intarray_int(org.joda.time.field.TestPreciseDurationDateTimeField)  Time elapsed: 0.001 sec  <<< FAILURE!
junit.framework.AssertionFailedError: expected:<true> but was:<false>
	at junit.framework.Assert.fail(Assert.java:47)
	at junit.framework.Assert.failNotEquals(Assert.java:280)
	at junit.framework.Assert.assertEquals(Assert.java:64)
	at junit.framework.Assert.assertEquals(Assert.java:146)
	at junit.framework.Assert.assertEquals(Assert.java:152)
	at org.joda.time.field.TestPreciseDurationDateTimeField.test_set_RP_int_intarray_int(TestPreciseDurationDateTimeField.java:285)

test_set_RP_int_intarray_String_Locale(org.joda.time.field.TestPreciseDateTimeField)  Time elapsed: 0.001 sec  <<< FAILURE!
junit.framework.AssertionFailedError: expected:<true> but was:<false>
	at junit.framework.Assert.fail(Assert.java:47)
	at junit.framework.Assert.failNotEquals(Assert.java:280)
	at junit.framework.Assert.assertEquals(Assert.java:64)
	at junit.framework.Assert.assertEquals(Assert.java:146)
	at junit.framework.Assert.assertEquals(Assert.java:152)
	at org.joda.time.field.TestPreciseDateTimeField.test_set_RP_int_intarray_String_Locale(TestPreciseDateTimeField.java:355)

test_add_RP_int_intarray_int(org.joda.time.field.TestPreciseDateTimeField)  Time elapsed: 0.001 sec  <<< FAILURE!
junit.framework.AssertionFailedError: expected:<true> but was:<false>
	at junit.framework.Assert.fail(Assert.java:47)
	at junit.framework.Assert.failNotEquals(Assert.java:280)
	at junit.framework.Assert.assertEquals(Assert.java:64)
	at junit.framework.Assert.assertEquals(Assert.java:146)
	at junit.framework.Assert.assertEquals(Assert.java:152)
	at org.joda.time.field.TestPreciseDateTimeField.test_add_RP_int_intarray_int(TestPreciseDateTimeField.java:226)

test_addWrapField_RP_int_intarray_int(org.joda.time.field.TestPreciseDateTimeField)  Time elapsed: 0 sec  <<< FAILURE!
junit.framework.AssertionFailedError: expected:<true> but was:<false>
	at junit.framework.Assert.fail(Assert.java:47)
	at junit.framework.Assert.failNotEquals(Assert.java:280)
	at junit.framework.Assert.assertEquals(Assert.java:64)
	at junit.framework.Assert.assertEquals(Assert.java:146)
	at junit.framework.Assert.assertEquals(Assert.java:152)
	at org.joda.time.field.TestPreciseDateTimeField.test_addWrapField_RP_int_intarray_int(TestPreciseDateTimeField.java:269)

test_set_RP_int_intarray_int(org.joda.time.field.TestPreciseDateTimeField)  Time elapsed: 0 sec  <<< FAILURE!
junit.framework.AssertionFailedError: expected:<true> but was:<false>
	at junit.framework.Assert.fail(Assert.java:47)
	at junit.framework.Assert.failNotEquals(Assert.java:280)
	at junit.framework.Assert.assertEquals(Assert.java:64)
	at junit.framework.Assert.assertEquals(Assert.java:146)
	at junit.framework.Assert.assertEquals(Assert.java:152)
	at org.joda.time.field.TestPreciseDateTimeField.test_set_RP_int_intarray_int(TestPreciseDateTimeField.java:314)


Results :

Failed tests: 
  org.joda.time.TestBasePartial#testSetMethods AssertionFailedError expected:<1>...
  org.joda.time.TestMonthDay_Basics#testMinusMonths_int AssertionFailedError exp...
  org.joda.time.TestMonthDay_Basics#testMinusMonths_int_adjust AssertionFailedError
  org.joda.time.TestMonthDay_Basics#testMinusMonths_int_endOfMonthAdjust AssertionFailedError
  org.joda.time.TestMonthDay_Basics#testMinusMonths_int_fromLeap AssertionFailedError
  org.joda.time.TestMonthDay_Basics#testMinusMonths_int_negativeEndOfMonthAdjust AssertionFailedError
  org.joda.time.TestMonthDay_Basics#testMinusMonths_int_negativeFromLeap AssertionFailedError
  org.joda.time.TestMonthDay_Basics#testMinusMonths_int_wrap AssertionFailedError
  org.joda.time.TestMonthDay_Basics#testMinus_RP AssertionFailedError expected:<...
  org.joda.time.TestMonthDay_Basics#testPlusMonths_int AssertionFailedError expe...
  org.joda.time.TestMonthDay_Basics#testPlusMonths_int_adjust AssertionFailedError
  org.joda.time.TestMonthDay_Basics#testPlusMonths_int_endOfMonthAdjust AssertionFailedError
  org.joda.time.TestMonthDay_Basics#testPlusMonths_int_fromLeap AssertionFailedError
  org.joda.time.TestMonthDay_Basics#testPlusMonths_int_negativeEndOfMonthAdjust AssertionFailedError
  org.joda.time.TestMonthDay_Basics#testPlusMonths_int_negativeFromLeap AssertionFailedError
  org.joda.time.TestMonthDay_Basics#testPlusMonths_int_wrap AssertionFailedError
  org.joda.time.TestMonthDay_Basics#testPlus_RP AssertionFailedError expected:<-...
  org.joda.time.TestMonthDay_Basics#testWithField AssertionFailedError expected:...
  org.joda.time.TestMonthDay_Basics#testWithFieldAdded AssertionFailedError expe...
  org.joda.time.TestMonthDay_Basics#testWithers AssertionFailedError expected:<6...
  org.joda.time.TestMonthDay_Properties#testPropertyAddMonthOfYear AssertionFailedError
  org.joda.time.TestMonthDay_Properties#testPropertyAddWrapFieldMonthOfYear AssertionFailedError
  org.joda.time.TestMonthDay_Properties#testPropertySetMonthOfYear AssertionFailedError
  org.joda.time.TestMonthDay_Properties#testPropertySetTextMonthOfYear AssertionFailedError
  org.joda.time.TestPartial_Basics#testMinus_RP AssertionFailedError 09:58 expec...
  org.joda.time.TestPartial_Basics#testPlus_RP AssertionFailedError 16:05 expect...
  org.joda.time.TestPartial_Basics#testWith1 AssertionFailedError 15:59 expected...
  org.joda.time.TestPartial_Basics#testWithField1 AssertionFailedError 15:59 exp...
  org.joda.time.TestPartial_Basics#testWithFieldAddWrapped1 AssertionFailedError
  org.joda.time.TestPartial_Basics#testWithFieldAddWrapped6 AssertionFailedError
  org.joda.time.TestPartial_Basics#testWithFieldAddWrapped8 AssertionFailedError
  org.joda.time.TestPartial_Basics#testWithFieldAdded1 AssertionFailedError 16:5...
  org.joda.time.TestPartial_Properties#testPropertyAddHour AssertionFailedError ...
  org.joda.time.TestPartial_Properties#testPropertyAddMinute AssertionFailedError
  org.joda.time.TestPartial_Properties#testPropertyAddWrapFieldHour AssertionFailedError
  org.joda.time.TestPartial_Properties#testPropertyAddWrapFieldMinute AssertionFailedError
  org.joda.time.TestPartial_Properties#testPropertySetHour AssertionFailedError ...
  org.joda.time.TestPartial_Properties#testPropertySetMinute AssertionFailedError
  org.joda.time.TestPartial_Properties#testPropertySetTextHour AssertionFailedError
  org.joda.time.TestPartial_Properties#testPropertySetTextMinute AssertionFailedError
  org.joda.time.TestPartial_Properties#testPropertyWithMaximumValueHour AssertionFailedError
  org.joda.time.TestPartial_Properties#testPropertyWithMinimumValueHour AssertionFailedError
  org.joda.time.TestTimeOfDay_Basics#testMinusHours_int AssertionFailedError exp...
  org.joda.time.TestTimeOfDay_Basics#testMinusMinutes_int AssertionFailedError e...
  org.joda.time.TestTimeOfDay_Basics#testMinusSeconds_int AssertionFailedError e...
  org.joda.time.TestTimeOfDay_Basics#testMinus_RP AssertionFailedError expected:...
  org.joda.time.TestTimeOfDay_Basics#testPlusHours_int AssertionFailedError expe...
  org.joda.time.TestTimeOfDay_Basics#testPlusMinutes_int AssertionFailedError ex...
  org.joda.time.TestTimeOfDay_Basics#testPlusSeconds_int AssertionFailedError ex...
  org.joda.time.TestTimeOfDay_Basics#testPlus_RP AssertionFailedError expected:<...
  org.joda.time.TestTimeOfDay_Basics#testWithField1 AssertionFailedError expecte...
  org.joda.time.TestTimeOfDay_Basics#testWithFieldAdded1 AssertionFailedError ex...
  org.joda.time.TestTimeOfDay_Basics#testWithFieldAdded6 AssertionFailedError ex...
  org.joda.time.TestTimeOfDay_Basics#testWithFieldAdded8 AssertionFailedError ex...
  org.joda.time.TestTimeOfDay_Basics#testWithers AssertionFailedError expected:<...
  org.joda.time.TestTimeOfDay_Properties#testPropertyAddHour AssertionFailedError
  org.joda.time.TestTimeOfDay_Properties#testPropertyAddMinute AssertionFailedError
  org.joda.time.TestTimeOfDay_Properties#testPropertyAddNoWrapHour AssertionFailedError
  org.joda.time.TestTimeOfDay_Properties#testPropertyAddNoWrapMinute AssertionFailedError
  org.joda.time.TestTimeOfDay_Properties#testPropertyAddNoWrapSecond AssertionFailedError
  org.joda.time.TestTimeOfDay_Properties#testPropertyAddSecond AssertionFailedError
  org.joda.time.TestTimeOfDay_Properties#testPropertyAddWrapFieldHour AssertionFailedError
  org.joda.time.TestTimeOfDay_Properties#testPropertyAddWrapFieldMinute AssertionFailedError
  org.joda.time.TestTimeOfDay_Properties#testPropertyAddWrapFieldSecond AssertionFailedError
  org.joda.time.TestTimeOfDay_Properties#testPropertySetHour AssertionFailedError
  org.joda.time.TestTimeOfDay_Properties#testPropertySetMinute AssertionFailedError
  org.joda.time.TestTimeOfDay_Properties#testPropertySetSecond AssertionFailedError
  org.joda.time.TestTimeOfDay_Properties#testPropertySetTextHour AssertionFailedError
  org.joda.time.TestTimeOfDay_Properties#testPropertySetTextMinute AssertionFailedError
  org.joda.time.TestTimeOfDay_Properties#testPropertySetTextSecond AssertionFailedError
  org.joda.time.TestTimeOfDay_Properties#testPropertyWithMaximumValueHour AssertionFailedError
  org.joda.time.TestTimeOfDay_Properties#testPropertyWithMinimumValueHour AssertionFailedError
  org.joda.time.TestYearMonthDay_Basics#testMinusMonths_int AssertionFailedError
  org.joda.time.TestYearMonthDay_Basics#testMinusYears_int AssertionFailedError ...
  org.joda.time.TestYearMonthDay_Basics#testMinus_RP AssertionFailedError expect...
  org.joda.time.TestYearMonthDay_Basics#testPlusMonths_int AssertionFailedError ...
  org.joda.time.TestYearMonthDay_Basics#testPlusYears_int AssertionFailedError e...
  org.joda.time.TestYearMonthDay_Basics#testPlus_RP AssertionFailedError expecte...
  org.joda.time.TestYearMonthDay_Basics#testWithField1 AssertionFailedError expe...
  org.joda.time.TestYearMonthDay_Basics#testWithFieldAdded1 AssertionFailedError
  org.joda.time.TestYearMonthDay_Basics#testWithers AssertionFailedError expecte...
  org.joda.time.TestYearMonthDay_Properties#testPropertyAddWrapFieldMonth AssertionFailedError
  org.joda.time.TestYearMonthDay_Properties#testPropertyAddWrapFieldYear AssertionFailedError
  org.joda.time.TestYearMonthDay_Properties#testPropertyAddYear AssertionFailedError
  org.joda.time.TestYearMonthDay_Properties#testPropertySetMonth AssertionFailedError
  org.joda.time.TestYearMonthDay_Properties#testPropertySetTextMonth AssertionFailedError
  org.joda.time.TestYearMonthDay_Properties#testPropertySetTextYear AssertionFailedError
  org.joda.time.TestYearMonthDay_Properties#testPropertySetYear AssertionFailedError
  org.joda.time.TestYearMonth_Basics#testMinusYears_int AssertionFailedError exp...
  org.joda.time.TestYearMonth_Basics#testMinus_RP AssertionFailedError expected:...
  org.joda.time.TestYearMonth_Basics#testPlusYears_int AssertionFailedError expe...
  org.joda.time.TestYearMonth_Basics#testPlus_RP AssertionFailedError expected:<...
  org.joda.time.TestYearMonth_Basics#testWithField AssertionFailedError expected...
  org.joda.time.TestYearMonth_Basics#testWithFieldAdded AssertionFailedError exp...
  org.joda.time.TestYearMonth_Basics#testWithers AssertionFailedError expected:<...
  org.joda.time.TestYearMonth_Properties#testPropertyAddWrapFieldYear AssertionFailedError
  org.joda.time.TestYearMonth_Properties#testPropertyAddYear AssertionFailedError
  org.joda.time.TestYearMonth_Properties#testPropertySetTextYear AssertionFailedError
  org.joda.time.TestYearMonth_Properties#testPropertySetYear AssertionFailedError
  org.joda.time.chrono.TestGJChronology#testTimeOfDayAdd AssertionFailedError ex...
  org.joda.time.chrono.TestISOChronology#testCutoverAddYears AssertionFailedError
  org.joda.time.chrono.TestISOChronology#testTimeOfDayAdd AssertionFailedError e...
  org.joda.time.field.TestBaseDateTimeField#test_addWrapField_RP_int_intarray_int AssertionFailedError
  org.joda.time.field.TestBaseDateTimeField#test_add_RP_int_intarray_int AssertionFailedError
  org.joda.time.field.TestBaseDateTimeField#test_set_RP_int_intarray_String_Locale AssertionFailedError
  org.joda.time.field.TestBaseDateTimeField#test_set_RP_int_intarray_int AssertionFailedError
  org.joda.time.field.TestOffsetDateTimeField#test_addWrapField_RP_int_intarray_int AssertionFailedError
  org.joda.time.field.TestOffsetDateTimeField#test_add_RP_int_intarray_int AssertionFailedError
  org.joda.time.field.TestOffsetDateTimeField#test_set_RP_int_intarray_String_Locale AssertionFailedError
  org.joda.time.field.TestOffsetDateTimeField#test_set_RP_int_intarray_int AssertionFailedError
  org.joda.time.field.TestPreciseDateTimeField#test_addWrapField_RP_int_intarray_int AssertionFailedError
  org.joda.time.field.TestPreciseDateTimeField#test_add_RP_int_intarray_int AssertionFailedError
  org.joda.time.field.TestPreciseDateTimeField#test_set_RP_int_intarray_String_Locale AssertionFailedError
  org.joda.time.field.TestPreciseDateTimeField#test_set_RP_int_intarray_int AssertionFailedError
  org.joda.time.field.TestPreciseDurationDateTimeField#test_addWrapField_RP_int_intarray_int AssertionFailedError
  org.joda.time.field.TestPreciseDurationDateTimeField#test_add_RP_int_intarray_int AssertionFailedError
  org.joda.time.field.TestPreciseDurationDateTimeField#test_set_RP_int_intarray_String_Locale AssertionFailedError
  org.joda.time.field.TestPreciseDurationDateTimeField#test_set_RP_int_intarray_int AssertionFailedError

Tests run: 4157, Failures: 118, Errors: 0, Skipped: 0

[INFO] ------------------------------------------------------------------------
[INFO] BUILD FAILURE
[INFO] ------------------------------------------------------------------------
[INFO] Total time: 16.198s
[INFO] Finished at: Thu Aug 06 04:04:01 BST 2015
[INFO] Final Memory: 8M/213M
[INFO] ------------------------------------------------------------------------
[ERROR] Failed to execute goal org.apache.maven.plugins:maven-surefire-plugin:2.18.1:test (default-test) on project joda-time: There are test failures.
[ERROR] 
[ERROR] Please refer to /home/perham/Study/LittleDarwin/Cases/joda-time-2.8.1/target/surefire-reports for the individual test results.
[ERROR] -> [Help 1]
[ERROR] 
[ERROR] To see the full stack trace of the errors, re-run Maven with the -e switch.
[ERROR] Re-run Maven using the -X switch to enable full debug logging.
[ERROR] 
[ERROR] For more information about the errors and possible solutions, please read the following articles:
[ERROR] [Help 1] http://cwiki.apache.org/confluence/display/MAVEN/MojoFailureException
