[INFO] Scanning for projects...
[INFO]                                                                         
[INFO] ------------------------------------------------------------------------
[INFO] Building Joda-Time 2.8.1
[INFO] ------------------------------------------------------------------------
[INFO] 
[INFO] --- maven-resources-plugin:2.7:resources (default-resources) @ joda-time ---
[INFO] Using 'UTF-8' encoding to copy filtered resources.
[INFO] Copying 2 resources to META-INF
[INFO] Copying 10 resources
[INFO] 
[INFO] --- maven-compiler-plugin:3.3:compile (default-compile) @ joda-time ---
[INFO] Changes detected - recompiling the module!
[INFO] Compiling 166 source files to /home/perham/Study/LittleDarwin/Cases/joda-time-2.8.1/target/classes
[INFO] 
[INFO] --- exec-maven-plugin:1.4.0:java (compile-tzdb) @ joda-time ---
Writing zoneinfo files
Writing ZoneInfoMap
[INFO] 
[INFO] --- maven-resources-plugin:2.7:testResources (default-testResources) @ joda-time ---
[INFO] Using 'UTF-8' encoding to copy filtered resources.
[INFO] Copying 34 resources
[INFO] 
[INFO] --- maven-compiler-plugin:3.3:testCompile (default-testCompile) @ joda-time ---
[INFO] Nothing to compile - all classes are up to date
[INFO] 
[INFO] --- maven-surefire-plugin:2.18.1:test (default-test) @ joda-time ---
[INFO] Surefire report directory: /home/perham/Study/LittleDarwin/Cases/joda-time-2.8.1/target/surefire-reports

-------------------------------------------------------
 T E S T S
-------------------------------------------------------
Running org.joda.time.TestAllPackages

TestBuddhistChronology.testCalendar

TestCopticChronology.testCalendar

TestEthiopicChronology.testCalendar

TestIslamicChronology.testCalendar

Testing Gregorian chronology over 1000 iterations
100% complete (i=1000)

Testing Julian chronology over 1000 iterations
100% complete (i=1000)
Writing zoneinfo files
Writing ZoneInfoMap
Tests run: 4157, Failures: 0, Errors: 136, Skipped: 0, Time elapsed: 5.09 sec <<< FAILURE! - in org.joda.time.TestAllPackages
testWithField1(org.joda.time.TestTimeOfDay_Basics)  Time elapsed: 0.003 sec  <<< ERROR!
java.lang.IndexOutOfBoundsException: Invalid index: -1
	at org.joda.time.TimeOfDay.getField(TimeOfDay.java:452)
	at org.joda.time.base.AbstractPartial.getField(AbstractPartial.java:105)
	at org.joda.time.field.BaseDateTimeField.set(BaseDateTimeField.java:98)
	at org.joda.time.TimeOfDay.withField(TimeOfDay.java:529)
	at org.joda.time.TestTimeOfDay_Basics.testWithField1(TestTimeOfDay_Basics.java:375)

testWithFieldAdded1(org.joda.time.TestTimeOfDay_Basics)  Time elapsed: 0 sec  <<< ERROR!
java.lang.IndexOutOfBoundsException: Invalid index: -1
	at org.joda.time.TimeOfDay.getField(TimeOfDay.java:452)
	at org.joda.time.base.AbstractPartial.getField(AbstractPartial.java:105)
	at org.joda.time.field.BaseDateTimeField.set(BaseDateTimeField.java:98)
	at org.joda.time.field.BaseDateTimeField.addWrapPartial(BaseDateTimeField.java:84)
	at org.joda.time.TimeOfDay.withFieldAdded(TimeOfDay.java:558)
	at org.joda.time.TestTimeOfDay_Basics.testWithFieldAdded1(TestTimeOfDay_Basics.java:406)

testPlus_RP(org.joda.time.TestTimeOfDay_Basics)  Time elapsed: 0.002 sec  <<< ERROR!
java.lang.IndexOutOfBoundsException: Invalid index: -1
	at org.joda.time.TimeOfDay.getField(TimeOfDay.java:452)
	at org.joda.time.base.AbstractPartial.getField(AbstractPartial.java:105)
	at org.joda.time.field.BaseDateTimeField.set(BaseDateTimeField.java:98)
	at org.joda.time.field.BaseDateTimeField.addWrapPartial(BaseDateTimeField.java:84)
	at org.joda.time.TimeOfDay.withPeriodAdded(TimeOfDay.java:588)
	at org.joda.time.TimeOfDay.plus(TimeOfDay.java:611)
	at org.joda.time.TestTimeOfDay_Basics.testPlus_RP(TestTimeOfDay_Basics.java:489)

testWithers(org.joda.time.TestTimeOfDay_Basics)  Time elapsed: 0.005 sec  <<< ERROR!
java.lang.IndexOutOfBoundsException: Invalid index: -1
	at org.joda.time.TimeOfDay.getField(TimeOfDay.java:452)
	at org.joda.time.base.AbstractPartial.getField(AbstractPartial.java:105)
	at org.joda.time.field.BaseDateTimeField.set(BaseDateTimeField.java:98)
	at org.joda.time.TimeOfDay.withHourOfDay(TimeOfDay.java:902)
	at org.joda.time.TestTimeOfDay_Basics.testWithers(TestTimeOfDay_Basics.java:818)

testPlusHours_int(org.joda.time.TestTimeOfDay_Basics)  Time elapsed: 0.001 sec  <<< ERROR!
java.lang.IndexOutOfBoundsException: Invalid index: -1
	at org.joda.time.TimeOfDay.getField(TimeOfDay.java:452)
	at org.joda.time.base.AbstractPartial.getField(AbstractPartial.java:105)
	at org.joda.time.field.BaseDateTimeField.set(BaseDateTimeField.java:98)
	at org.joda.time.field.BaseDateTimeField.addWrapPartial(BaseDateTimeField.java:84)
	at org.joda.time.TimeOfDay.withFieldAdded(TimeOfDay.java:558)
	at org.joda.time.TimeOfDay.plusHours(TimeOfDay.java:632)
	at org.joda.time.TestTimeOfDay_Basics.testPlusHours_int(TestTimeOfDay_Basics.java:499)

testPlusMinutes_int(org.joda.time.TestTimeOfDay_Basics)  Time elapsed: 0 sec  <<< ERROR!
java.lang.IndexOutOfBoundsException: Invalid index: -1
	at org.joda.time.TimeOfDay.getField(TimeOfDay.java:452)
	at org.joda.time.base.AbstractPartial.getField(AbstractPartial.java:105)
	at org.joda.time.field.BaseDateTimeField.set(BaseDateTimeField.java:98)
	at org.joda.time.field.BaseDateTimeField.addWrapPartial(BaseDateTimeField.java:84)
	at org.joda.time.TimeOfDay.withFieldAdded(TimeOfDay.java:558)
	at org.joda.time.TimeOfDay.plusMinutes(TimeOfDay.java:652)
	at org.joda.time.TestTimeOfDay_Basics.testPlusMinutes_int(TestTimeOfDay_Basics.java:509)

testPlusSeconds_int(org.joda.time.TestTimeOfDay_Basics)  Time elapsed: 0 sec  <<< ERROR!
java.lang.IndexOutOfBoundsException: Invalid index: -1
	at org.joda.time.TimeOfDay.getField(TimeOfDay.java:452)
	at org.joda.time.base.AbstractPartial.getField(AbstractPartial.java:105)
	at org.joda.time.field.BaseDateTimeField.set(BaseDateTimeField.java:98)
	at org.joda.time.field.BaseDateTimeField.addWrapPartial(BaseDateTimeField.java:84)
	at org.joda.time.TimeOfDay.withFieldAdded(TimeOfDay.java:558)
	at org.joda.time.TimeOfDay.plusSeconds(TimeOfDay.java:672)
	at org.joda.time.TestTimeOfDay_Basics.testPlusSeconds_int(TestTimeOfDay_Basics.java:519)

testMinus_RP(org.joda.time.TestTimeOfDay_Basics)  Time elapsed: 0 sec  <<< ERROR!
java.lang.IndexOutOfBoundsException: Invalid index: -1
	at org.joda.time.TimeOfDay.getField(TimeOfDay.java:452)
	at org.joda.time.base.AbstractPartial.getField(AbstractPartial.java:105)
	at org.joda.time.field.BaseDateTimeField.set(BaseDateTimeField.java:98)
	at org.joda.time.field.BaseDateTimeField.addWrapPartial(BaseDateTimeField.java:84)
	at org.joda.time.TimeOfDay.withPeriodAdded(TimeOfDay.java:588)
	at org.joda.time.TimeOfDay.minus(TimeOfDay.java:711)
	at org.joda.time.TestTimeOfDay_Basics.testMinus_RP(TestTimeOfDay_Basics.java:540)

testMinusHours_int(org.joda.time.TestTimeOfDay_Basics)  Time elapsed: 0 sec  <<< ERROR!
java.lang.IndexOutOfBoundsException: Invalid index: -1
	at org.joda.time.TimeOfDay.getField(TimeOfDay.java:452)
	at org.joda.time.base.AbstractPartial.getField(AbstractPartial.java:105)
	at org.joda.time.field.BaseDateTimeField.set(BaseDateTimeField.java:98)
	at org.joda.time.field.BaseDateTimeField.addWrapPartial(BaseDateTimeField.java:84)
	at org.joda.time.TimeOfDay.withFieldAdded(TimeOfDay.java:558)
	at org.joda.time.TimeOfDay.minusHours(TimeOfDay.java:732)
	at org.joda.time.TestTimeOfDay_Basics.testMinusHours_int(TestTimeOfDay_Basics.java:550)

testMinusMinutes_int(org.joda.time.TestTimeOfDay_Basics)  Time elapsed: 0 sec  <<< ERROR!
java.lang.IndexOutOfBoundsException: Invalid index: -1
	at org.joda.time.TimeOfDay.getField(TimeOfDay.java:452)
	at org.joda.time.base.AbstractPartial.getField(AbstractPartial.java:105)
	at org.joda.time.field.BaseDateTimeField.set(BaseDateTimeField.java:98)
	at org.joda.time.field.BaseDateTimeField.addWrapPartial(BaseDateTimeField.java:84)
	at org.joda.time.TimeOfDay.withFieldAdded(TimeOfDay.java:558)
	at org.joda.time.TimeOfDay.minusMinutes(TimeOfDay.java:752)
	at org.joda.time.TestTimeOfDay_Basics.testMinusMinutes_int(TestTimeOfDay_Basics.java:560)

testMinusSeconds_int(org.joda.time.TestTimeOfDay_Basics)  Time elapsed: 0.002 sec  <<< ERROR!
java.lang.IndexOutOfBoundsException: Invalid index: -1
	at org.joda.time.TimeOfDay.getField(TimeOfDay.java:452)
	at org.joda.time.base.AbstractPartial.getField(AbstractPartial.java:105)
	at org.joda.time.field.BaseDateTimeField.set(BaseDateTimeField.java:98)
	at org.joda.time.field.BaseDateTimeField.addWrapPartial(BaseDateTimeField.java:84)
	at org.joda.time.TimeOfDay.withFieldAdded(TimeOfDay.java:558)
	at org.joda.time.TimeOfDay.minusSeconds(TimeOfDay.java:772)
	at org.joda.time.TestTimeOfDay_Basics.testMinusSeconds_int(TestTimeOfDay_Basics.java:570)

testWithFieldAdded6(org.joda.time.TestTimeOfDay_Basics)  Time elapsed: 0.001 sec  <<< ERROR!
java.lang.IndexOutOfBoundsException: Invalid index: -1
	at org.joda.time.TimeOfDay.getField(TimeOfDay.java:452)
	at org.joda.time.base.AbstractPartial.getField(AbstractPartial.java:105)
	at org.joda.time.field.BaseDateTimeField.set(BaseDateTimeField.java:98)
	at org.joda.time.field.BaseDateTimeField.addWrapPartial(BaseDateTimeField.java:84)
	at org.joda.time.TimeOfDay.withFieldAdded(TimeOfDay.java:558)
	at org.joda.time.TestTimeOfDay_Basics.testWithFieldAdded6(TestTimeOfDay_Basics.java:444)

testWithFieldAdded7(org.joda.time.TestTimeOfDay_Basics)  Time elapsed: 0 sec  <<< ERROR!
java.lang.IndexOutOfBoundsException: Invalid index: -1
	at org.joda.time.TimeOfDay.getField(TimeOfDay.java:452)
	at org.joda.time.base.AbstractPartial.getField(AbstractPartial.java:105)
	at org.joda.time.field.BaseDateTimeField.set(BaseDateTimeField.java:98)
	at org.joda.time.field.BaseDateTimeField.addWrapPartial(BaseDateTimeField.java:84)
	at org.joda.time.field.BaseDateTimeField.addWrapPartial(BaseDateTimeField.java:70)
	at org.joda.time.field.BaseDateTimeField.addWrapPartial(BaseDateTimeField.java:70)
	at org.joda.time.field.BaseDateTimeField.addWrapPartial(BaseDateTimeField.java:70)
	at org.joda.time.TimeOfDay.withFieldAdded(TimeOfDay.java:558)
	at org.joda.time.TestTimeOfDay_Basics.testWithFieldAdded7(TestTimeOfDay_Basics.java:452)

testWithFieldAdded8(org.joda.time.TestTimeOfDay_Basics)  Time elapsed: 0 sec  <<< ERROR!
java.lang.IndexOutOfBoundsException: Invalid index: -1
	at org.joda.time.TimeOfDay.getField(TimeOfDay.java:452)
	at org.joda.time.base.AbstractPartial.getField(AbstractPartial.java:105)
	at org.joda.time.field.BaseDateTimeField.set(BaseDateTimeField.java:98)
	at org.joda.time.field.BaseDateTimeField.addWrapPartial(BaseDateTimeField.java:84)
	at org.joda.time.field.BaseDateTimeField.addWrapPartial(BaseDateTimeField.java:82)
	at org.joda.time.field.BaseDateTimeField.addWrapPartial(BaseDateTimeField.java:82)
	at org.joda.time.field.BaseDateTimeField.addWrapPartial(BaseDateTimeField.java:82)
	at org.joda.time.TimeOfDay.withFieldAdded(TimeOfDay.java:558)
	at org.joda.time.TestTimeOfDay_Basics.testWithFieldAdded8(TestTimeOfDay_Basics.java:470)

testPropertySetSecond(org.joda.time.TestTimeOfDay_Properties)  Time elapsed: 0 sec  <<< ERROR!
java.lang.IndexOutOfBoundsException: Invalid index: -1
	at org.joda.time.TimeOfDay.getField(TimeOfDay.java:452)
	at org.joda.time.base.AbstractPartial.getField(AbstractPartial.java:105)
	at org.joda.time.field.BaseDateTimeField.set(BaseDateTimeField.java:98)
	at org.joda.time.TimeOfDay$Property.setCopy(TimeOfDay.java:1165)
	at org.joda.time.TestTimeOfDay_Properties.testPropertySetSecond(TestTimeOfDay_Properties.java:526)

testPropertySetTextSecond(org.joda.time.TestTimeOfDay_Properties)  Time elapsed: 0.01 sec  <<< ERROR!
java.lang.IndexOutOfBoundsException: Invalid index: -1
	at org.joda.time.TimeOfDay.getField(TimeOfDay.java:452)
	at org.joda.time.base.AbstractPartial.getField(AbstractPartial.java:105)
	at org.joda.time.field.BaseDateTimeField.set(BaseDateTimeField.java:98)
	at org.joda.time.field.BaseDateTimeField.set(BaseDateTimeField.java:106)
	at org.joda.time.TimeOfDay$Property.setCopy(TimeOfDay.java:1182)
	at org.joda.time.TimeOfDay$Property.setCopy(TimeOfDay.java:1197)
	at org.joda.time.TestTimeOfDay_Properties.testPropertySetTextSecond(TestTimeOfDay_Properties.java:542)

testPropertyAddNoWrapHour(org.joda.time.TestTimeOfDay_Properties)  Time elapsed: 0.001 sec  <<< ERROR!
java.lang.IndexOutOfBoundsException: Invalid index: -1
	at org.joda.time.TimeOfDay.getField(TimeOfDay.java:452)
	at org.joda.time.base.AbstractPartial.getField(AbstractPartial.java:105)
	at org.joda.time.field.BaseDateTimeField.set(BaseDateTimeField.java:98)
	at org.joda.time.field.BaseDateTimeField.add(BaseDateTimeField.java:57)
	at org.joda.time.TimeOfDay$Property.addNoWrapToCopy(TimeOfDay.java:1124)
	at org.joda.time.TestTimeOfDay_Properties.testPropertyAddNoWrapHour(TestTimeOfDay_Properties.java:130)

testPropertyAddWrapFieldHour(org.joda.time.TestTimeOfDay_Properties)  Time elapsed: 0 sec  <<< ERROR!
java.lang.IndexOutOfBoundsException: Invalid index: -1
	at org.joda.time.TimeOfDay.getField(TimeOfDay.java:452)
	at org.joda.time.base.AbstractPartial.getField(AbstractPartial.java:105)
	at org.joda.time.field.BaseDateTimeField.set(BaseDateTimeField.java:98)
	at org.joda.time.field.BaseDateTimeField.addWrapField(BaseDateTimeField.java:90)
	at org.joda.time.TimeOfDay$Property.addWrapFieldToCopy(TimeOfDay.java:1148)
	at org.joda.time.TestTimeOfDay_Properties.testPropertyAddWrapFieldHour(TestTimeOfDay_Properties.java:158)

testPropertyAddMinute(org.joda.time.TestTimeOfDay_Properties)  Time elapsed: 0.001 sec  <<< ERROR!
java.lang.IndexOutOfBoundsException: Invalid index: -1
	at org.joda.time.TimeOfDay.getField(TimeOfDay.java:452)
	at org.joda.time.base.AbstractPartial.getField(AbstractPartial.java:105)
	at org.joda.time.field.BaseDateTimeField.set(BaseDateTimeField.java:98)
	at org.joda.time.field.BaseDateTimeField.addWrapPartial(BaseDateTimeField.java:84)
	at org.joda.time.TimeOfDay$Property.addToCopy(TimeOfDay.java:1098)
	at org.joda.time.TestTimeOfDay_Properties.testPropertyAddMinute(TestTimeOfDay_Properties.java:261)

testPropertyAddNoWrapMinute(org.joda.time.TestTimeOfDay_Properties)  Time elapsed: 0.001 sec  <<< ERROR!
java.lang.IndexOutOfBoundsException: Invalid index: -1
	at org.joda.time.TimeOfDay.getField(TimeOfDay.java:452)
	at org.joda.time.base.AbstractPartial.getField(AbstractPartial.java:105)
	at org.joda.time.field.BaseDateTimeField.set(BaseDateTimeField.java:98)
	at org.joda.time.field.BaseDateTimeField.add(BaseDateTimeField.java:57)
	at org.joda.time.TimeOfDay$Property.addNoWrapToCopy(TimeOfDay.java:1124)
	at org.joda.time.TestTimeOfDay_Properties.testPropertyAddNoWrapMinute(TestTimeOfDay_Properties.java:301)

testPropertyAddWrapFieldMinute(org.joda.time.TestTimeOfDay_Properties)  Time elapsed: 0 sec  <<< ERROR!
java.lang.IndexOutOfBoundsException: Invalid index: -1
	at org.joda.time.TimeOfDay.getField(TimeOfDay.java:452)
	at org.joda.time.base.AbstractPartial.getField(AbstractPartial.java:105)
	at org.joda.time.field.BaseDateTimeField.set(BaseDateTimeField.java:98)
	at org.joda.time.field.BaseDateTimeField.addWrapField(BaseDateTimeField.java:90)
	at org.joda.time.TimeOfDay$Property.addWrapFieldToCopy(TimeOfDay.java:1148)
	at org.joda.time.TestTimeOfDay_Properties.testPropertyAddWrapFieldMinute(TestTimeOfDay_Properties.java:347)

testPropertyAddSecond(org.joda.time.TestTimeOfDay_Properties)  Time elapsed: 0.001 sec  <<< ERROR!
java.lang.IndexOutOfBoundsException: Invalid index: -1
	at org.joda.time.TimeOfDay.getField(TimeOfDay.java:452)
	at org.joda.time.base.AbstractPartial.getField(AbstractPartial.java:105)
	at org.joda.time.field.BaseDateTimeField.set(BaseDateTimeField.java:98)
	at org.joda.time.field.BaseDateTimeField.addWrapPartial(BaseDateTimeField.java:84)
	at org.joda.time.TimeOfDay$Property.addToCopy(TimeOfDay.java:1098)
	at org.joda.time.TestTimeOfDay_Properties.testPropertyAddSecond(TestTimeOfDay_Properties.java:433)

testPropertyAddNoWrapSecond(org.joda.time.TestTimeOfDay_Properties)  Time elapsed: 0.001 sec  <<< ERROR!
java.lang.IndexOutOfBoundsException: Invalid index: -1
	at org.joda.time.TimeOfDay.getField(TimeOfDay.java:452)
	at org.joda.time.base.AbstractPartial.getField(AbstractPartial.java:105)
	at org.joda.time.field.BaseDateTimeField.set(BaseDateTimeField.java:98)
	at org.joda.time.field.BaseDateTimeField.add(BaseDateTimeField.java:57)
	at org.joda.time.TimeOfDay$Property.addNoWrapToCopy(TimeOfDay.java:1124)
	at org.joda.time.TestTimeOfDay_Properties.testPropertyAddNoWrapSecond(TestTimeOfDay_Properties.java:470)

testPropertyAddWrapFieldSecond(org.joda.time.TestTimeOfDay_Properties)  Time elapsed: 0 sec  <<< ERROR!
java.lang.IndexOutOfBoundsException: Invalid index: -1
	at org.joda.time.TimeOfDay.getField(TimeOfDay.java:452)
	at org.joda.time.base.AbstractPartial.getField(AbstractPartial.java:105)
	at org.joda.time.field.BaseDateTimeField.set(BaseDateTimeField.java:98)
	at org.joda.time.field.BaseDateTimeField.addWrapField(BaseDateTimeField.java:90)
	at org.joda.time.TimeOfDay$Property.addWrapFieldToCopy(TimeOfDay.java:1148)
	at org.joda.time.TestTimeOfDay_Properties.testPropertyAddWrapFieldSecond(TestTimeOfDay_Properties.java:513)

testPropertyAddMilli(org.joda.time.TestTimeOfDay_Properties)  Time elapsed: 0.001 sec  <<< ERROR!
java.lang.IndexOutOfBoundsException: Invalid index: -1
	at org.joda.time.TimeOfDay.getField(TimeOfDay.java:452)
	at org.joda.time.base.AbstractPartial.getField(AbstractPartial.java:105)
	at org.joda.time.field.BaseDateTimeField.set(BaseDateTimeField.java:98)
	at org.joda.time.field.BaseDateTimeField.addWrapPartial(BaseDateTimeField.java:84)
	at org.joda.time.field.BaseDateTimeField.addWrapPartial(BaseDateTimeField.java:70)
	at org.joda.time.TimeOfDay$Property.addToCopy(TimeOfDay.java:1098)
	at org.joda.time.TestTimeOfDay_Properties.testPropertyAddMilli(TestTimeOfDay_Properties.java:606)

testPropertyAddNoWrapMilli(org.joda.time.TestTimeOfDay_Properties)  Time elapsed: 0.001 sec  <<< ERROR!
java.lang.IndexOutOfBoundsException: Invalid index: -1
	at org.joda.time.TimeOfDay.getField(TimeOfDay.java:452)
	at org.joda.time.base.AbstractPartial.getField(AbstractPartial.java:105)
	at org.joda.time.field.BaseDateTimeField.set(BaseDateTimeField.java:98)
	at org.joda.time.field.BaseDateTimeField.add(BaseDateTimeField.java:57)
	at org.joda.time.field.BaseDateTimeField.add(BaseDateTimeField.java:45)
	at org.joda.time.TimeOfDay$Property.addNoWrapToCopy(TimeOfDay.java:1124)
	at org.joda.time.TestTimeOfDay_Properties.testPropertyAddNoWrapMilli(TestTimeOfDay_Properties.java:640)

testPropertyAddHour(org.joda.time.TestTimeOfDay_Properties)  Time elapsed: 0.001 sec  <<< ERROR!
java.lang.IndexOutOfBoundsException: Invalid index: -1
	at org.joda.time.TimeOfDay.getField(TimeOfDay.java:452)
	at org.joda.time.base.AbstractPartial.getField(AbstractPartial.java:105)
	at org.joda.time.field.BaseDateTimeField.set(BaseDateTimeField.java:98)
	at org.joda.time.field.BaseDateTimeField.addWrapPartial(BaseDateTimeField.java:84)
	at org.joda.time.TimeOfDay$Property.addToCopy(TimeOfDay.java:1098)
	at org.joda.time.TestTimeOfDay_Properties.testPropertyAddHour(TestTimeOfDay_Properties.java:108)

testPropertySetHour(org.joda.time.TestTimeOfDay_Properties)  Time elapsed: 0.001 sec  <<< ERROR!
java.lang.IndexOutOfBoundsException: Invalid index: -1
	at org.joda.time.TimeOfDay.getField(TimeOfDay.java:452)
	at org.joda.time.base.AbstractPartial.getField(AbstractPartial.java:105)
	at org.joda.time.field.BaseDateTimeField.set(BaseDateTimeField.java:98)
	at org.joda.time.TimeOfDay$Property.setCopy(TimeOfDay.java:1165)
	at org.joda.time.TestTimeOfDay_Properties.testPropertySetHour(TestTimeOfDay_Properties.java:174)

testPropertySetTextHour(org.joda.time.TestTimeOfDay_Properties)  Time elapsed: 0 sec  <<< ERROR!
java.lang.IndexOutOfBoundsException: Invalid index: -1
	at org.joda.time.TimeOfDay.getField(TimeOfDay.java:452)
	at org.joda.time.base.AbstractPartial.getField(AbstractPartial.java:105)
	at org.joda.time.field.BaseDateTimeField.set(BaseDateTimeField.java:98)
	at org.joda.time.field.BaseDateTimeField.set(BaseDateTimeField.java:106)
	at org.joda.time.TimeOfDay$Property.setCopy(TimeOfDay.java:1182)
	at org.joda.time.TimeOfDay$Property.setCopy(TimeOfDay.java:1197)
	at org.joda.time.TestTimeOfDay_Properties.testPropertySetTextHour(TestTimeOfDay_Properties.java:190)

testPropertyWithMaximumValueHour(org.joda.time.TestTimeOfDay_Properties)  Time elapsed: 0.001 sec  <<< ERROR!
java.lang.IndexOutOfBoundsException: Invalid index: -1
	at org.joda.time.TimeOfDay.getField(TimeOfDay.java:452)
	at org.joda.time.base.AbstractPartial.getField(AbstractPartial.java:105)
	at org.joda.time.field.BaseDateTimeField.set(BaseDateTimeField.java:98)
	at org.joda.time.TimeOfDay$Property.setCopy(TimeOfDay.java:1165)
	at org.joda.time.TimeOfDay$Property.withMaximumValue(TimeOfDay.java:1211)
	at org.joda.time.TestTimeOfDay_Properties.testPropertyWithMaximumValueHour(TestTimeOfDay_Properties.java:197)

testPropertyWithMinimumValueHour(org.joda.time.TestTimeOfDay_Properties)  Time elapsed: 0.001 sec  <<< ERROR!
java.lang.IndexOutOfBoundsException: Invalid index: -1
	at org.joda.time.TimeOfDay.getField(TimeOfDay.java:452)
	at org.joda.time.base.AbstractPartial.getField(AbstractPartial.java:105)
	at org.joda.time.field.BaseDateTimeField.set(BaseDateTimeField.java:98)
	at org.joda.time.TimeOfDay$Property.setCopy(TimeOfDay.java:1165)
	at org.joda.time.TimeOfDay$Property.withMinimumValue(TimeOfDay.java:1224)
	at org.joda.time.TestTimeOfDay_Properties.testPropertyWithMinimumValueHour(TestTimeOfDay_Properties.java:204)

testPropertySetMinute(org.joda.time.TestTimeOfDay_Properties)  Time elapsed: 0.001 sec  <<< ERROR!
java.lang.IndexOutOfBoundsException: Invalid index: -1
	at org.joda.time.TimeOfDay.getField(TimeOfDay.java:452)
	at org.joda.time.base.AbstractPartial.getField(AbstractPartial.java:105)
	at org.joda.time.field.BaseDateTimeField.set(BaseDateTimeField.java:98)
	at org.joda.time.TimeOfDay$Property.setCopy(TimeOfDay.java:1165)
	at org.joda.time.TestTimeOfDay_Properties.testPropertySetMinute(TestTimeOfDay_Properties.java:360)

testPropertySetTextMinute(org.joda.time.TestTimeOfDay_Properties)  Time elapsed: 0.001 sec  <<< ERROR!
java.lang.IndexOutOfBoundsException: Invalid index: -1
	at org.joda.time.TimeOfDay.getField(TimeOfDay.java:452)
	at org.joda.time.base.AbstractPartial.getField(AbstractPartial.java:105)
	at org.joda.time.field.BaseDateTimeField.set(BaseDateTimeField.java:98)
	at org.joda.time.field.BaseDateTimeField.set(BaseDateTimeField.java:106)
	at org.joda.time.TimeOfDay$Property.setCopy(TimeOfDay.java:1182)
	at org.joda.time.TimeOfDay$Property.setCopy(TimeOfDay.java:1197)
	at org.joda.time.TestTimeOfDay_Properties.testPropertySetTextMinute(TestTimeOfDay_Properties.java:376)

testWithField1(org.joda.time.TestYearMonthDay_Basics)  Time elapsed: 0.001 sec  <<< ERROR!
java.lang.IndexOutOfBoundsException: Invalid index: -1
	at org.joda.time.YearMonthDay.getField(YearMonthDay.java:339)
	at org.joda.time.base.AbstractPartial.getField(AbstractPartial.java:105)
	at org.joda.time.field.BaseDateTimeField.set(BaseDateTimeField.java:98)
	at org.joda.time.YearMonthDay.withField(YearMonthDay.java:416)
	at org.joda.time.TestYearMonthDay_Basics.testWithField1(TestYearMonthDay_Basics.java:376)

testWithFieldAdded1(org.joda.time.TestYearMonthDay_Basics)  Time elapsed: 0.001 sec  <<< ERROR!
java.lang.IndexOutOfBoundsException: Invalid index: -1
	at org.joda.time.YearMonthDay.getField(YearMonthDay.java:339)
	at org.joda.time.base.AbstractPartial.getField(AbstractPartial.java:105)
	at org.joda.time.field.BaseDateTimeField.set(BaseDateTimeField.java:98)
	at org.joda.time.field.BaseDateTimeField.add(BaseDateTimeField.java:57)
	at org.joda.time.YearMonthDay.withFieldAdded(YearMonthDay.java:444)
	at org.joda.time.TestYearMonthDay_Basics.testWithFieldAdded1(TestYearMonthDay_Basics.java:408)

testPlus_RP(org.joda.time.TestYearMonthDay_Basics)  Time elapsed: 0.001 sec  <<< ERROR!
java.lang.IndexOutOfBoundsException: Invalid index: -1
	at org.joda.time.YearMonthDay.getField(YearMonthDay.java:339)
	at org.joda.time.base.AbstractPartial.getField(AbstractPartial.java:105)
	at org.joda.time.field.BaseDateTimeField.set(BaseDateTimeField.java:98)
	at org.joda.time.field.BaseDateTimeField.add(BaseDateTimeField.java:57)
	at org.joda.time.YearMonthDay.withPeriodAdded(YearMonthDay.java:473)
	at org.joda.time.YearMonthDay.plus(YearMonthDay.java:495)
	at org.joda.time.TestYearMonthDay_Basics.testPlus_RP(TestYearMonthDay_Basics.java:447)

testWithers(org.joda.time.TestYearMonthDay_Basics)  Time elapsed: 0.001 sec  <<< ERROR!
java.lang.IndexOutOfBoundsException: Invalid index: -1
	at org.joda.time.YearMonthDay.getField(YearMonthDay.java:339)
	at org.joda.time.base.AbstractPartial.getField(AbstractPartial.java:105)
	at org.joda.time.field.BaseDateTimeField.set(BaseDateTimeField.java:98)
	at org.joda.time.YearMonthDay.withYear(YearMonthDay.java:844)
	at org.joda.time.TestYearMonthDay_Basics.testWithers(TestYearMonthDay_Basics.java:746)

testPlusYears_int(org.joda.time.TestYearMonthDay_Basics)  Time elapsed: 0.001 sec  <<< ERROR!
java.lang.IndexOutOfBoundsException: Invalid index: -1
	at org.joda.time.YearMonthDay.getField(YearMonthDay.java:339)
	at org.joda.time.base.AbstractPartial.getField(AbstractPartial.java:105)
	at org.joda.time.field.BaseDateTimeField.set(BaseDateTimeField.java:98)
	at org.joda.time.field.BaseDateTimeField.add(BaseDateTimeField.java:57)
	at org.joda.time.YearMonthDay.withFieldAdded(YearMonthDay.java:444)
	at org.joda.time.YearMonthDay.plusYears(YearMonthDay.java:516)
	at org.joda.time.TestYearMonthDay_Basics.testPlusYears_int(TestYearMonthDay_Basics.java:457)

testPlusMonths_int(org.joda.time.TestYearMonthDay_Basics)  Time elapsed: 0 sec  <<< ERROR!
java.lang.IndexOutOfBoundsException: Invalid index: -1
	at org.joda.time.YearMonthDay.getField(YearMonthDay.java:339)
	at org.joda.time.base.AbstractPartial.getField(AbstractPartial.java:105)
	at org.joda.time.field.BaseDateTimeField.set(BaseDateTimeField.java:98)
	at org.joda.time.field.BaseDateTimeField.add(BaseDateTimeField.java:57)
	at org.joda.time.YearMonthDay.withFieldAdded(YearMonthDay.java:444)
	at org.joda.time.YearMonthDay.plusMonths(YearMonthDay.java:536)
	at org.joda.time.TestYearMonthDay_Basics.testPlusMonths_int(TestYearMonthDay_Basics.java:467)

testMinus_RP(org.joda.time.TestYearMonthDay_Basics)  Time elapsed: 0 sec  <<< ERROR!
java.lang.IndexOutOfBoundsException: Invalid index: -1
	at org.joda.time.YearMonthDay.getField(YearMonthDay.java:339)
	at org.joda.time.base.AbstractPartial.getField(AbstractPartial.java:105)
	at org.joda.time.field.BaseDateTimeField.set(BaseDateTimeField.java:98)
	at org.joda.time.field.BaseDateTimeField.add(BaseDateTimeField.java:57)
	at org.joda.time.YearMonthDay.withPeriodAdded(YearMonthDay.java:473)
	at org.joda.time.YearMonthDay.minus(YearMonthDay.java:574)
	at org.joda.time.TestYearMonthDay_Basics.testMinus_RP(TestYearMonthDay_Basics.java:488)

testMinusYears_int(org.joda.time.TestYearMonthDay_Basics)  Time elapsed: 0 sec  <<< ERROR!
java.lang.IndexOutOfBoundsException: Invalid index: -1
	at org.joda.time.YearMonthDay.getField(YearMonthDay.java:339)
	at org.joda.time.base.AbstractPartial.getField(AbstractPartial.java:105)
	at org.joda.time.field.BaseDateTimeField.set(BaseDateTimeField.java:98)
	at org.joda.time.field.BaseDateTimeField.add(BaseDateTimeField.java:57)
	at org.joda.time.YearMonthDay.withFieldAdded(YearMonthDay.java:444)
	at org.joda.time.YearMonthDay.minusYears(YearMonthDay.java:595)
	at org.joda.time.TestYearMonthDay_Basics.testMinusYears_int(TestYearMonthDay_Basics.java:498)

testMinusMonths_int(org.joda.time.TestYearMonthDay_Basics)  Time elapsed: 0 sec  <<< ERROR!
java.lang.IndexOutOfBoundsException: Invalid index: -1
	at org.joda.time.YearMonthDay.getField(YearMonthDay.java:339)
	at org.joda.time.base.AbstractPartial.getField(AbstractPartial.java:105)
	at org.joda.time.field.BaseDateTimeField.set(BaseDateTimeField.java:98)
	at org.joda.time.field.BaseDateTimeField.add(BaseDateTimeField.java:57)
	at org.joda.time.YearMonthDay.withFieldAdded(YearMonthDay.java:444)
	at org.joda.time.YearMonthDay.minusMonths(YearMonthDay.java:615)
	at org.joda.time.TestYearMonthDay_Basics.testMinusMonths_int(TestYearMonthDay_Basics.java:508)

testPropertyAddYear(org.joda.time.TestYearMonthDay_Properties)  Time elapsed: 0.001 sec  <<< ERROR!
java.lang.IndexOutOfBoundsException: Invalid index: -1
	at org.joda.time.YearMonthDay.getField(YearMonthDay.java:339)
	at org.joda.time.base.AbstractPartial.getField(AbstractPartial.java:105)
	at org.joda.time.field.BaseDateTimeField.set(BaseDateTimeField.java:98)
	at org.joda.time.field.BaseDateTimeField.add(BaseDateTimeField.java:57)
	at org.joda.time.YearMonthDay$Property.addToCopy(YearMonthDay.java:1011)
	at org.joda.time.TestYearMonthDay_Properties.testPropertyAddYear(TestYearMonthDay_Properties.java:113)

testPropertyAddWrapFieldYear(org.joda.time.TestYearMonthDay_Properties)  Time elapsed: 0 sec  <<< ERROR!
java.lang.IndexOutOfBoundsException: Invalid index: -1
	at org.joda.time.YearMonthDay.getField(YearMonthDay.java:339)
	at org.joda.time.base.AbstractPartial.getField(AbstractPartial.java:105)
	at org.joda.time.field.BaseDateTimeField.set(BaseDateTimeField.java:98)
	at org.joda.time.field.BaseDateTimeField.addWrapField(BaseDateTimeField.java:90)
	at org.joda.time.YearMonthDay$Property.addWrapFieldToCopy(YearMonthDay.java:1035)
	at org.joda.time.TestYearMonthDay_Properties.testPropertyAddWrapFieldYear(TestYearMonthDay_Properties.java:144)

testPropertySetYear(org.joda.time.TestYearMonthDay_Properties)  Time elapsed: 0 sec  <<< ERROR!
java.lang.IndexOutOfBoundsException: Invalid index: -1
	at org.joda.time.YearMonthDay.getField(YearMonthDay.java:339)
	at org.joda.time.base.AbstractPartial.getField(AbstractPartial.java:105)
	at org.joda.time.field.BaseDateTimeField.set(BaseDateTimeField.java:98)
	at org.joda.time.YearMonthDay$Property.setCopy(YearMonthDay.java:1052)
	at org.joda.time.TestYearMonthDay_Properties.testPropertySetYear(TestYearMonthDay_Properties.java:160)

testPropertySetTextYear(org.joda.time.TestYearMonthDay_Properties)  Time elapsed: 0.001 sec  <<< ERROR!
java.lang.IndexOutOfBoundsException: Invalid index: -1
	at org.joda.time.YearMonthDay.getField(YearMonthDay.java:339)
	at org.joda.time.base.AbstractPartial.getField(AbstractPartial.java:105)
	at org.joda.time.field.BaseDateTimeField.set(BaseDateTimeField.java:98)
	at org.joda.time.field.BaseDateTimeField.set(BaseDateTimeField.java:106)
	at org.joda.time.YearMonthDay$Property.setCopy(YearMonthDay.java:1069)
	at org.joda.time.YearMonthDay$Property.setCopy(YearMonthDay.java:1084)
	at org.joda.time.TestYearMonthDay_Properties.testPropertySetTextYear(TestYearMonthDay_Properties.java:167)

testPropertyAddWrapFieldMonth(org.joda.time.TestYearMonthDay_Properties)  Time elapsed: 0 sec  <<< ERROR!
java.lang.IndexOutOfBoundsException: Invalid index: -1
	at org.joda.time.YearMonthDay.getField(YearMonthDay.java:339)
	at org.joda.time.base.AbstractPartial.getField(AbstractPartial.java:105)
	at org.joda.time.field.BaseDateTimeField.set(BaseDateTimeField.java:98)
	at org.joda.time.field.BaseDateTimeField.addWrapField(BaseDateTimeField.java:90)
	at org.joda.time.YearMonthDay$Property.addWrapFieldToCopy(YearMonthDay.java:1035)
	at org.joda.time.TestYearMonthDay_Properties.testPropertyAddWrapFieldMonth(TestYearMonthDay_Properties.java:257)

testPropertySetMonth(org.joda.time.TestYearMonthDay_Properties)  Time elapsed: 0.001 sec  <<< ERROR!
java.lang.IndexOutOfBoundsException: Invalid index: -1
	at org.joda.time.YearMonthDay.getField(YearMonthDay.java:339)
	at org.joda.time.base.AbstractPartial.getField(AbstractPartial.java:105)
	at org.joda.time.field.BaseDateTimeField.set(BaseDateTimeField.java:98)
	at org.joda.time.YearMonthDay$Property.setCopy(YearMonthDay.java:1052)
	at org.joda.time.TestYearMonthDay_Properties.testPropertySetMonth(TestYearMonthDay_Properties.java:284)

testPropertySetTextMonth(org.joda.time.TestYearMonthDay_Properties)  Time elapsed: 0 sec  <<< ERROR!
java.lang.IndexOutOfBoundsException: Invalid index: -1
	at org.joda.time.YearMonthDay.getField(YearMonthDay.java:339)
	at org.joda.time.base.AbstractPartial.getField(AbstractPartial.java:105)
	at org.joda.time.field.BaseDateTimeField.set(BaseDateTimeField.java:98)
	at org.joda.time.field.BaseDateTimeField.set(BaseDateTimeField.java:106)
	at org.joda.time.YearMonthDay$Property.setCopy(YearMonthDay.java:1069)
	at org.joda.time.YearMonthDay$Property.setCopy(YearMonthDay.java:1084)
	at org.joda.time.TestYearMonthDay_Properties.testPropertySetTextMonth(TestYearMonthDay_Properties.java:304)

testPlus_RP(org.joda.time.TestYearMonth_Basics)  Time elapsed: 0.001 sec  <<< ERROR!
java.lang.IndexOutOfBoundsException: Invalid index: -1
	at org.joda.time.YearMonth.getField(YearMonth.java:406)
	at org.joda.time.base.AbstractPartial.getField(AbstractPartial.java:105)
	at org.joda.time.field.BaseDateTimeField.set(BaseDateTimeField.java:98)
	at org.joda.time.field.BaseDateTimeField.add(BaseDateTimeField.java:57)
	at org.joda.time.YearMonth.withPeriodAdded(YearMonth.java:540)
	at org.joda.time.YearMonth.plus(YearMonth.java:562)
	at org.joda.time.TestYearMonth_Basics.testPlus_RP(TestYearMonth_Basics.java:441)

testWithers(org.joda.time.TestYearMonth_Basics)  Time elapsed: 0 sec  <<< ERROR!
java.lang.IndexOutOfBoundsException: Invalid index: -1
	at org.joda.time.YearMonth.getField(YearMonth.java:406)
	at org.joda.time.base.AbstractPartial.getField(AbstractPartial.java:105)
	at org.joda.time.field.BaseDateTimeField.set(BaseDateTimeField.java:98)
	at org.joda.time.YearMonth.withYear(YearMonth.java:736)
	at org.joda.time.TestYearMonth_Basics.testWithers(TestYearMonth_Basics.java:572)

testPlusYears_int(org.joda.time.TestYearMonth_Basics)  Time elapsed: 0 sec  <<< ERROR!
java.lang.IndexOutOfBoundsException: Invalid index: -1
	at org.joda.time.YearMonth.getField(YearMonth.java:406)
	at org.joda.time.base.AbstractPartial.getField(AbstractPartial.java:105)
	at org.joda.time.field.BaseDateTimeField.set(BaseDateTimeField.java:98)
	at org.joda.time.field.BaseDateTimeField.add(BaseDateTimeField.java:57)
	at org.joda.time.YearMonth.withFieldAdded(YearMonth.java:511)
	at org.joda.time.YearMonth.plusYears(YearMonth.java:582)
	at org.joda.time.TestYearMonth_Basics.testPlusYears_int(TestYearMonth_Basics.java:451)

testMinus_RP(org.joda.time.TestYearMonth_Basics)  Time elapsed: 0 sec  <<< ERROR!
java.lang.IndexOutOfBoundsException: Invalid index: -1
	at org.joda.time.YearMonth.getField(YearMonth.java:406)
	at org.joda.time.base.AbstractPartial.getField(AbstractPartial.java:105)
	at org.joda.time.field.BaseDateTimeField.set(BaseDateTimeField.java:98)
	at org.joda.time.field.BaseDateTimeField.add(BaseDateTimeField.java:57)
	at org.joda.time.YearMonth.withPeriodAdded(YearMonth.java:540)
	at org.joda.time.YearMonth.minus(YearMonth.java:619)
	at org.joda.time.TestYearMonth_Basics.testMinus_RP(TestYearMonth_Basics.java:472)

testMinusYears_int(org.joda.time.TestYearMonth_Basics)  Time elapsed: 0.001 sec  <<< ERROR!
java.lang.IndexOutOfBoundsException: Invalid index: -1
	at org.joda.time.YearMonth.getField(YearMonth.java:406)
	at org.joda.time.base.AbstractPartial.getField(AbstractPartial.java:105)
	at org.joda.time.field.BaseDateTimeField.set(BaseDateTimeField.java:98)
	at org.joda.time.field.BaseDateTimeField.add(BaseDateTimeField.java:57)
	at org.joda.time.YearMonth.withFieldAdded(YearMonth.java:511)
	at org.joda.time.YearMonth.minusYears(YearMonth.java:639)
	at org.joda.time.TestYearMonth_Basics.testMinusYears_int(TestYearMonth_Basics.java:482)

testWithFieldAdded(org.joda.time.TestYearMonth_Basics)  Time elapsed: 0 sec  <<< ERROR!
java.lang.IndexOutOfBoundsException: Invalid index: -1
	at org.joda.time.YearMonth.getField(YearMonth.java:406)
	at org.joda.time.base.AbstractPartial.getField(AbstractPartial.java:105)
	at org.joda.time.field.BaseDateTimeField.set(BaseDateTimeField.java:98)
	at org.joda.time.field.BaseDateTimeField.add(BaseDateTimeField.java:57)
	at org.joda.time.YearMonth.withFieldAdded(YearMonth.java:511)
	at org.joda.time.TestYearMonth_Basics.testWithFieldAdded(TestYearMonth_Basics.java:402)

testWithField(org.joda.time.TestYearMonth_Basics)  Time elapsed: 0 sec  <<< ERROR!
java.lang.IndexOutOfBoundsException: Invalid index: -1
	at org.joda.time.YearMonth.getField(YearMonth.java:406)
	at org.joda.time.base.AbstractPartial.getField(AbstractPartial.java:105)
	at org.joda.time.field.BaseDateTimeField.set(BaseDateTimeField.java:98)
	at org.joda.time.YearMonth.withField(YearMonth.java:483)
	at org.joda.time.TestYearMonth_Basics.testWithField(TestYearMonth_Basics.java:370)

testPropertyAddYear(org.joda.time.TestYearMonth_Properties)  Time elapsed: 0.001 sec  <<< ERROR!
java.lang.IndexOutOfBoundsException: Invalid index: -1
	at org.joda.time.YearMonth.getField(YearMonth.java:406)
	at org.joda.time.base.AbstractPartial.getField(AbstractPartial.java:105)
	at org.joda.time.field.BaseDateTimeField.set(BaseDateTimeField.java:98)
	at org.joda.time.field.BaseDateTimeField.add(BaseDateTimeField.java:57)
	at org.joda.time.YearMonth$Property.addToCopy(YearMonth.java:914)
	at org.joda.time.TestYearMonth_Properties.testPropertyAddYear(TestYearMonth_Properties.java:112)

testPropertyAddWrapFieldYear(org.joda.time.TestYearMonth_Properties)  Time elapsed: 0 sec  <<< ERROR!
java.lang.IndexOutOfBoundsException: Invalid index: -1
	at org.joda.time.YearMonth.getField(YearMonth.java:406)
	at org.joda.time.base.AbstractPartial.getField(AbstractPartial.java:105)
	at org.joda.time.field.BaseDateTimeField.set(BaseDateTimeField.java:98)
	at org.joda.time.field.BaseDateTimeField.addWrapField(BaseDateTimeField.java:90)
	at org.joda.time.YearMonth$Property.addWrapFieldToCopy(YearMonth.java:938)
	at org.joda.time.TestYearMonth_Properties.testPropertyAddWrapFieldYear(TestYearMonth_Properties.java:143)

testPropertySetYear(org.joda.time.TestYearMonth_Properties)  Time elapsed: 0.001 sec  <<< ERROR!
java.lang.IndexOutOfBoundsException: Invalid index: -1
	at org.joda.time.YearMonth.getField(YearMonth.java:406)
	at org.joda.time.base.AbstractPartial.getField(AbstractPartial.java:105)
	at org.joda.time.field.BaseDateTimeField.set(BaseDateTimeField.java:98)
	at org.joda.time.YearMonth$Property.setCopy(YearMonth.java:955)
	at org.joda.time.TestYearMonth_Properties.testPropertySetYear(TestYearMonth_Properties.java:159)

testPropertySetTextYear(org.joda.time.TestYearMonth_Properties)  Time elapsed: 0 sec  <<< ERROR!
java.lang.IndexOutOfBoundsException: Invalid index: -1
	at org.joda.time.YearMonth.getField(YearMonth.java:406)
	at org.joda.time.base.AbstractPartial.getField(AbstractPartial.java:105)
	at org.joda.time.field.BaseDateTimeField.set(BaseDateTimeField.java:98)
	at org.joda.time.field.BaseDateTimeField.set(BaseDateTimeField.java:106)
	at org.joda.time.YearMonth$Property.setCopy(YearMonth.java:972)
	at org.joda.time.YearMonth$Property.setCopy(YearMonth.java:987)
	at org.joda.time.TestYearMonth_Properties.testPropertySetTextYear(TestYearMonth_Properties.java:166)

testPlus_RP(org.joda.time.TestMonthDay_Basics)  Time elapsed: 0.001 sec  <<< ERROR!
java.lang.IndexOutOfBoundsException: Invalid index: -1
	at org.joda.time.MonthDay.getField(MonthDay.java:414)
	at org.joda.time.base.AbstractPartial.getField(AbstractPartial.java:105)
	at org.joda.time.field.BaseDateTimeField.set(BaseDateTimeField.java:98)
	at org.joda.time.field.BaseDateTimeField.add(BaseDateTimeField.java:57)
	at org.joda.time.MonthDay.withPeriodAdded(MonthDay.java:548)
	at org.joda.time.MonthDay.plus(MonthDay.java:570)
	at org.joda.time.TestMonthDay_Basics.testPlus_RP(TestMonthDay_Basics.java:436)

testWithers(org.joda.time.TestMonthDay_Basics)  Time elapsed: 0 sec  <<< ERROR!
java.lang.IndexOutOfBoundsException: Invalid index: -1
	at org.joda.time.MonthDay.getField(MonthDay.java:414)
	at org.joda.time.base.AbstractPartial.getField(AbstractPartial.java:105)
	at org.joda.time.field.BaseDateTimeField.set(BaseDateTimeField.java:98)
	at org.joda.time.MonthDay.withMonthOfYear(MonthDay.java:722)
	at org.joda.time.TestMonthDay_Basics.testWithers(TestMonthDay_Basics.java:738)

testPlusMonths_int(org.joda.time.TestMonthDay_Basics)  Time elapsed: 0 sec  <<< ERROR!
java.lang.IndexOutOfBoundsException: Invalid index: -1
	at org.joda.time.MonthDay.getField(MonthDay.java:414)
	at org.joda.time.base.AbstractPartial.getField(AbstractPartial.java:105)
	at org.joda.time.field.BaseDateTimeField.set(BaseDateTimeField.java:98)
	at org.joda.time.field.BaseDateTimeField.add(BaseDateTimeField.java:57)
	at org.joda.time.MonthDay.withFieldAdded(MonthDay.java:519)
	at org.joda.time.MonthDay.plusMonths(MonthDay.java:592)
	at org.joda.time.TestMonthDay_Basics.testPlusMonths_int(TestMonthDay_Basics.java:446)

testMinus_RP(org.joda.time.TestMonthDay_Basics)  Time elapsed: 0 sec  <<< ERROR!
java.lang.IndexOutOfBoundsException: Invalid index: -1
	at org.joda.time.MonthDay.getField(MonthDay.java:414)
	at org.joda.time.base.AbstractPartial.getField(AbstractPartial.java:105)
	at org.joda.time.field.BaseDateTimeField.set(BaseDateTimeField.java:98)
	at org.joda.time.field.BaseDateTimeField.add(BaseDateTimeField.java:57)
	at org.joda.time.MonthDay.withPeriodAdded(MonthDay.java:548)
	at org.joda.time.MonthDay.minus(MonthDay.java:633)
	at org.joda.time.TestMonthDay_Basics.testMinus_RP(TestMonthDay_Basics.java:572)

testMinusMonths_int(org.joda.time.TestMonthDay_Basics)  Time elapsed: 0 sec  <<< ERROR!
java.lang.IndexOutOfBoundsException: Invalid index: -1
	at org.joda.time.MonthDay.getField(MonthDay.java:414)
	at org.joda.time.base.AbstractPartial.getField(AbstractPartial.java:105)
	at org.joda.time.field.BaseDateTimeField.set(BaseDateTimeField.java:98)
	at org.joda.time.field.BaseDateTimeField.add(BaseDateTimeField.java:57)
	at org.joda.time.MonthDay.withFieldAdded(MonthDay.java:519)
	at org.joda.time.MonthDay.minusMonths(MonthDay.java:655)
	at org.joda.time.TestMonthDay_Basics.testMinusMonths_int(TestMonthDay_Basics.java:582)

testPlusMonths_int_negativeEndOfMonthAdjust(org.joda.time.TestMonthDay_Basics)  Time elapsed: 0.001 sec  <<< ERROR!
java.lang.IndexOutOfBoundsException: Invalid index: -1
	at org.joda.time.MonthDay.getField(MonthDay.java:414)
	at org.joda.time.base.AbstractPartial.getField(AbstractPartial.java:105)
	at org.joda.time.field.BaseDateTimeField.set(BaseDateTimeField.java:98)
	at org.joda.time.chrono.BasicMonthOfYearDateTimeField.add(BasicMonthOfYearDateTimeField.java:214)
	at org.joda.time.MonthDay.withFieldAdded(MonthDay.java:519)
	at org.joda.time.MonthDay.plusMonths(MonthDay.java:592)
	at org.joda.time.TestMonthDay_Basics.testPlusMonths_int_negativeEndOfMonthAdjust(TestMonthDay_Basics.java:474)

testPlusMonths_int_wrap(org.joda.time.TestMonthDay_Basics)  Time elapsed: 0 sec  <<< ERROR!
java.lang.IndexOutOfBoundsException: Invalid index: -1
	at org.joda.time.MonthDay.getField(MonthDay.java:414)
	at org.joda.time.base.AbstractPartial.getField(AbstractPartial.java:105)
	at org.joda.time.field.BaseDateTimeField.set(BaseDateTimeField.java:98)
	at org.joda.time.chrono.BasicMonthOfYearDateTimeField.add(BasicMonthOfYearDateTimeField.java:214)
	at org.joda.time.MonthDay.withFieldAdded(MonthDay.java:519)
	at org.joda.time.MonthDay.plusMonths(MonthDay.java:592)
	at org.joda.time.TestMonthDay_Basics.testPlusMonths_int_wrap(TestMonthDay_Basics.java:487)

testPlusMonths_int_adjust(org.joda.time.TestMonthDay_Basics)  Time elapsed: 0 sec  <<< ERROR!
java.lang.IndexOutOfBoundsException: Invalid index: -1
	at org.joda.time.MonthDay.getField(MonthDay.java:414)
	at org.joda.time.base.AbstractPartial.getField(AbstractPartial.java:105)
	at org.joda.time.field.BaseDateTimeField.set(BaseDateTimeField.java:98)
	at org.joda.time.chrono.BasicMonthOfYearDateTimeField.add(BasicMonthOfYearDateTimeField.java:214)
	at org.joda.time.MonthDay.withFieldAdded(MonthDay.java:519)
	at org.joda.time.MonthDay.plusMonths(MonthDay.java:592)
	at org.joda.time.TestMonthDay_Basics.testPlusMonths_int_adjust(TestMonthDay_Basics.java:494)

testPlusDays_int_wrapMonth(org.joda.time.TestMonthDay_Basics)  Time elapsed: 0.002 sec  <<< ERROR!
java.lang.IndexOutOfBoundsException: Invalid index: -1
	at org.joda.time.MonthDay.getField(MonthDay.java:414)
	at org.joda.time.base.AbstractPartial.getField(AbstractPartial.java:105)
	at org.joda.time.field.BaseDateTimeField.set(BaseDateTimeField.java:98)
	at org.joda.time.chrono.BasicMonthOfYearDateTimeField.add(BasicMonthOfYearDateTimeField.java:214)
	at org.joda.time.field.BaseDateTimeField.add(BaseDateTimeField.java:45)
	at org.joda.time.MonthDay.withFieldAdded(MonthDay.java:519)
	at org.joda.time.MonthDay.plusDays(MonthDay.java:615)
	at org.joda.time.TestMonthDay_Basics.testPlusDays_int_wrapMonth(TestMonthDay_Basics.java:509)

testPlusDays_int_wrapMonthTwice(org.joda.time.TestMonthDay_Basics)  Time elapsed: 0 sec  <<< ERROR!
java.lang.IndexOutOfBoundsException: Invalid index: -1
	at org.joda.time.MonthDay.getField(MonthDay.java:414)
	at org.joda.time.base.AbstractPartial.getField(AbstractPartial.java:105)
	at org.joda.time.field.BaseDateTimeField.set(BaseDateTimeField.java:98)
	at org.joda.time.chrono.BasicMonthOfYearDateTimeField.add(BasicMonthOfYearDateTimeField.java:214)
	at org.joda.time.field.BaseDateTimeField.add(BaseDateTimeField.java:45)
	at org.joda.time.MonthDay.withFieldAdded(MonthDay.java:519)
	at org.joda.time.MonthDay.plusDays(MonthDay.java:615)
	at org.joda.time.TestMonthDay_Basics.testPlusDays_int_wrapMonthTwice(TestMonthDay_Basics.java:516)

testPlusDays_int_wrapMonthIntoNextYear(org.joda.time.TestMonthDay_Basics)  Time elapsed: 0 sec  <<< ERROR!
java.lang.IndexOutOfBoundsException: Invalid index: -1
	at org.joda.time.MonthDay.getField(MonthDay.java:414)
	at org.joda.time.base.AbstractPartial.getField(AbstractPartial.java:105)
	at org.joda.time.field.BaseDateTimeField.set(BaseDateTimeField.java:98)
	at org.joda.time.chrono.BasicMonthOfYearDateTimeField.add(BasicMonthOfYearDateTimeField.java:214)
	at org.joda.time.field.BaseDateTimeField.add(BaseDateTimeField.java:45)
	at org.joda.time.MonthDay.withFieldAdded(MonthDay.java:519)
	at org.joda.time.MonthDay.plusDays(MonthDay.java:615)
	at org.joda.time.TestMonthDay_Basics.testPlusDays_int_wrapMonthIntoNextYear(TestMonthDay_Basics.java:523)

testPlusDays_int_wrapMonthTwiceIntoNextYear(org.joda.time.TestMonthDay_Basics)  Time elapsed: 0 sec  <<< ERROR!
java.lang.IndexOutOfBoundsException: Invalid index: -1
	at org.joda.time.MonthDay.getField(MonthDay.java:414)
	at org.joda.time.base.AbstractPartial.getField(AbstractPartial.java:105)
	at org.joda.time.field.BaseDateTimeField.set(BaseDateTimeField.java:98)
	at org.joda.time.chrono.BasicMonthOfYearDateTimeField.add(BasicMonthOfYearDateTimeField.java:214)
	at org.joda.time.field.BaseDateTimeField.add(BaseDateTimeField.java:45)
	at org.joda.time.MonthDay.withFieldAdded(MonthDay.java:519)
	at org.joda.time.MonthDay.plusDays(MonthDay.java:615)
	at org.joda.time.TestMonthDay_Basics.testPlusDays_int_wrapMonthTwiceIntoNextYear(TestMonthDay_Basics.java:530)

testMinusDays_int_wrapMonth(org.joda.time.TestMonthDay_Basics)  Time elapsed: 0 sec  <<< ERROR!
java.lang.IndexOutOfBoundsException: Invalid index: -1
	at org.joda.time.MonthDay.getField(MonthDay.java:414)
	at org.joda.time.base.AbstractPartial.getField(AbstractPartial.java:105)
	at org.joda.time.field.BaseDateTimeField.set(BaseDateTimeField.java:98)
	at org.joda.time.chrono.BasicMonthOfYearDateTimeField.add(BasicMonthOfYearDateTimeField.java:214)
	at org.joda.time.field.BaseDateTimeField.add(BaseDateTimeField.java:55)
	at org.joda.time.MonthDay.withFieldAdded(MonthDay.java:519)
	at org.joda.time.MonthDay.minusDays(MonthDay.java:675)
	at org.joda.time.TestMonthDay_Basics.testMinusDays_int_wrapMonth(TestMonthDay_Basics.java:645)

testMinusDays_int_wrapMonthTwice(org.joda.time.TestMonthDay_Basics)  Time elapsed: 0.001 sec  <<< ERROR!
java.lang.IndexOutOfBoundsException: Invalid index: -1
	at org.joda.time.MonthDay.getField(MonthDay.java:414)
	at org.joda.time.base.AbstractPartial.getField(AbstractPartial.java:105)
	at org.joda.time.field.BaseDateTimeField.set(BaseDateTimeField.java:98)
	at org.joda.time.chrono.BasicMonthOfYearDateTimeField.add(BasicMonthOfYearDateTimeField.java:214)
	at org.joda.time.field.BaseDateTimeField.add(BaseDateTimeField.java:55)
	at org.joda.time.MonthDay.withFieldAdded(MonthDay.java:519)
	at org.joda.time.MonthDay.minusDays(MonthDay.java:675)
	at org.joda.time.TestMonthDay_Basics.testMinusDays_int_wrapMonthTwice(TestMonthDay_Basics.java:652)

testMinusDays_int_wrapMonthIntoLastYear(org.joda.time.TestMonthDay_Basics)  Time elapsed: 0 sec  <<< ERROR!
java.lang.IndexOutOfBoundsException: Invalid index: -1
	at org.joda.time.MonthDay.getField(MonthDay.java:414)
	at org.joda.time.base.AbstractPartial.getField(AbstractPartial.java:105)
	at org.joda.time.field.BaseDateTimeField.set(BaseDateTimeField.java:98)
	at org.joda.time.chrono.BasicMonthOfYearDateTimeField.add(BasicMonthOfYearDateTimeField.java:214)
	at org.joda.time.field.BaseDateTimeField.add(BaseDateTimeField.java:55)
	at org.joda.time.MonthDay.withFieldAdded(MonthDay.java:519)
	at org.joda.time.MonthDay.minusDays(MonthDay.java:675)
	at org.joda.time.TestMonthDay_Basics.testMinusDays_int_wrapMonthIntoLastYear(TestMonthDay_Basics.java:659)

testMinusDays_int_wrapMonthTwiceIntoLastYear(org.joda.time.TestMonthDay_Basics)  Time elapsed: 0 sec  <<< ERROR!
java.lang.IndexOutOfBoundsException: Invalid index: -1
	at org.joda.time.MonthDay.getField(MonthDay.java:414)
	at org.joda.time.base.AbstractPartial.getField(AbstractPartial.java:105)
	at org.joda.time.field.BaseDateTimeField.set(BaseDateTimeField.java:98)
	at org.joda.time.chrono.BasicMonthOfYearDateTimeField.add(BasicMonthOfYearDateTimeField.java:214)
	at org.joda.time.field.BaseDateTimeField.add(BaseDateTimeField.java:55)
	at org.joda.time.MonthDay.withFieldAdded(MonthDay.java:519)
	at org.joda.time.MonthDay.minusDays(MonthDay.java:675)
	at org.joda.time.TestMonthDay_Basics.testMinusDays_int_wrapMonthTwiceIntoLastYear(TestMonthDay_Basics.java:666)

testMinusDays_int_toLeap(org.joda.time.TestMonthDay_Basics)  Time elapsed: 0 sec  <<< ERROR!
java.lang.IndexOutOfBoundsException: Invalid index: -1
	at org.joda.time.MonthDay.getField(MonthDay.java:414)
	at org.joda.time.base.AbstractPartial.getField(AbstractPartial.java:105)
	at org.joda.time.field.BaseDateTimeField.set(BaseDateTimeField.java:98)
	at org.joda.time.chrono.BasicMonthOfYearDateTimeField.add(BasicMonthOfYearDateTimeField.java:214)
	at org.joda.time.field.BaseDateTimeField.add(BaseDateTimeField.java:55)
	at org.joda.time.MonthDay.withFieldAdded(MonthDay.java:519)
	at org.joda.time.MonthDay.minusDays(MonthDay.java:675)
	at org.joda.time.TestMonthDay_Basics.testMinusDays_int_toLeap(TestMonthDay_Basics.java:673)

testMinusDays_int_negativeFromLeap(org.joda.time.TestMonthDay_Basics)  Time elapsed: 0 sec  <<< ERROR!
java.lang.IndexOutOfBoundsException: Invalid index: -1
	at org.joda.time.MonthDay.getField(MonthDay.java:414)
	at org.joda.time.base.AbstractPartial.getField(AbstractPartial.java:105)
	at org.joda.time.field.BaseDateTimeField.set(BaseDateTimeField.java:98)
	at org.joda.time.chrono.BasicMonthOfYearDateTimeField.add(BasicMonthOfYearDateTimeField.java:214)
	at org.joda.time.field.BaseDateTimeField.add(BaseDateTimeField.java:45)
	at org.joda.time.MonthDay.withFieldAdded(MonthDay.java:519)
	at org.joda.time.MonthDay.minusDays(MonthDay.java:675)
	at org.joda.time.TestMonthDay_Basics.testMinusDays_int_negativeFromLeap(TestMonthDay_Basics.java:687)

testWithFieldAdded(org.joda.time.TestMonthDay_Basics)  Time elapsed: 0.001 sec  <<< ERROR!
java.lang.IndexOutOfBoundsException: Invalid index: -1
	at org.joda.time.MonthDay.getField(MonthDay.java:414)
	at org.joda.time.base.AbstractPartial.getField(AbstractPartial.java:105)
	at org.joda.time.field.BaseDateTimeField.set(BaseDateTimeField.java:98)
	at org.joda.time.chrono.BasicMonthOfYearDateTimeField.add(BasicMonthOfYearDateTimeField.java:214)
	at org.joda.time.MonthDay.withFieldAdded(MonthDay.java:519)
	at org.joda.time.TestMonthDay_Basics.testWithFieldAdded(TestMonthDay_Basics.java:397)

testWithField(org.joda.time.TestMonthDay_Basics)  Time elapsed: 0.001 sec  <<< ERROR!
java.lang.IndexOutOfBoundsException: Invalid index: -1
	at org.joda.time.MonthDay.getField(MonthDay.java:414)
	at org.joda.time.base.AbstractPartial.getField(AbstractPartial.java:105)
	at org.joda.time.field.BaseDateTimeField.set(BaseDateTimeField.java:98)
	at org.joda.time.MonthDay.withField(MonthDay.java:491)
	at org.joda.time.TestMonthDay_Basics.testWithField(TestMonthDay_Basics.java:365)

testPlusMonths_int_fromLeap(org.joda.time.TestMonthDay_Basics)  Time elapsed: 0.001 sec  <<< ERROR!
java.lang.IndexOutOfBoundsException: Invalid index: -1
	at org.joda.time.MonthDay.getField(MonthDay.java:414)
	at org.joda.time.base.AbstractPartial.getField(AbstractPartial.java:105)
	at org.joda.time.field.BaseDateTimeField.set(BaseDateTimeField.java:98)
	at org.joda.time.chrono.BasicMonthOfYearDateTimeField.add(BasicMonthOfYearDateTimeField.java:214)
	at org.joda.time.MonthDay.withFieldAdded(MonthDay.java:519)
	at org.joda.time.MonthDay.plusMonths(MonthDay.java:592)
	at org.joda.time.TestMonthDay_Basics.testPlusMonths_int_fromLeap(TestMonthDay_Basics.java:453)

testPlusMonths_int_negativeFromLeap(org.joda.time.TestMonthDay_Basics)  Time elapsed: 0 sec  <<< ERROR!
java.lang.IndexOutOfBoundsException: Invalid index: -1
	at org.joda.time.MonthDay.getField(MonthDay.java:414)
	at org.joda.time.base.AbstractPartial.getField(AbstractPartial.java:105)
	at org.joda.time.field.BaseDateTimeField.set(BaseDateTimeField.java:98)
	at org.joda.time.chrono.BasicMonthOfYearDateTimeField.add(BasicMonthOfYearDateTimeField.java:214)
	at org.joda.time.MonthDay.withFieldAdded(MonthDay.java:519)
	at org.joda.time.MonthDay.plusMonths(MonthDay.java:592)
	at org.joda.time.TestMonthDay_Basics.testPlusMonths_int_negativeFromLeap(TestMonthDay_Basics.java:460)

testPlusMonths_int_endOfMonthAdjust(org.joda.time.TestMonthDay_Basics)  Time elapsed: 0.001 sec  <<< ERROR!
java.lang.IndexOutOfBoundsException: Invalid index: -1
	at org.joda.time.MonthDay.getField(MonthDay.java:414)
	at org.joda.time.base.AbstractPartial.getField(AbstractPartial.java:105)
	at org.joda.time.field.BaseDateTimeField.set(BaseDateTimeField.java:98)
	at org.joda.time.chrono.BasicMonthOfYearDateTimeField.add(BasicMonthOfYearDateTimeField.java:214)
	at org.joda.time.MonthDay.withFieldAdded(MonthDay.java:519)
	at org.joda.time.MonthDay.plusMonths(MonthDay.java:592)
	at org.joda.time.TestMonthDay_Basics.testPlusMonths_int_endOfMonthAdjust(TestMonthDay_Basics.java:467)

testPlusDays_int_wrap50(org.joda.time.TestMonthDay_Basics)  Time elapsed: 0 sec  <<< ERROR!
java.lang.IndexOutOfBoundsException: Invalid index: -1
	at org.joda.time.MonthDay.getField(MonthDay.java:414)
	at org.joda.time.base.AbstractPartial.getField(AbstractPartial.java:105)
	at org.joda.time.field.BaseDateTimeField.set(BaseDateTimeField.java:98)
	at org.joda.time.chrono.BasicMonthOfYearDateTimeField.add(BasicMonthOfYearDateTimeField.java:214)
	at org.joda.time.field.BaseDateTimeField.add(BaseDateTimeField.java:45)
	at org.joda.time.MonthDay.withFieldAdded(MonthDay.java:519)
	at org.joda.time.MonthDay.plusDays(MonthDay.java:615)
	at org.joda.time.TestMonthDay_Basics.testPlusDays_int_wrap50(TestMonthDay_Basics.java:537)

testPlusDays_int_fromLeap(org.joda.time.TestMonthDay_Basics)  Time elapsed: 0 sec  <<< ERROR!
java.lang.IndexOutOfBoundsException: Invalid index: -1
	at org.joda.time.MonthDay.getField(MonthDay.java:414)
	at org.joda.time.base.AbstractPartial.getField(AbstractPartial.java:105)
	at org.joda.time.field.BaseDateTimeField.set(BaseDateTimeField.java:98)
	at org.joda.time.chrono.BasicMonthOfYearDateTimeField.add(BasicMonthOfYearDateTimeField.java:214)
	at org.joda.time.field.BaseDateTimeField.add(BaseDateTimeField.java:45)
	at org.joda.time.MonthDay.withFieldAdded(MonthDay.java:519)
	at org.joda.time.MonthDay.plusDays(MonthDay.java:615)
	at org.joda.time.TestMonthDay_Basics.testPlusDays_int_fromLeap(TestMonthDay_Basics.java:551)

testMinusMonths_int_fromLeap(org.joda.time.TestMonthDay_Basics)  Time elapsed: 0 sec  <<< ERROR!
java.lang.IndexOutOfBoundsException: Invalid index: -1
	at org.joda.time.MonthDay.getField(MonthDay.java:414)
	at org.joda.time.base.AbstractPartial.getField(AbstractPartial.java:105)
	at org.joda.time.field.BaseDateTimeField.set(BaseDateTimeField.java:98)
	at org.joda.time.chrono.BasicMonthOfYearDateTimeField.add(BasicMonthOfYearDateTimeField.java:214)
	at org.joda.time.MonthDay.withFieldAdded(MonthDay.java:519)
	at org.joda.time.MonthDay.minusMonths(MonthDay.java:655)
	at org.joda.time.TestMonthDay_Basics.testMinusMonths_int_fromLeap(TestMonthDay_Basics.java:589)

testMinusMonths_int_negativeFromLeap(org.joda.time.TestMonthDay_Basics)  Time elapsed: 0 sec  <<< ERROR!
java.lang.IndexOutOfBoundsException: Invalid index: -1
	at org.joda.time.MonthDay.getField(MonthDay.java:414)
	at org.joda.time.base.AbstractPartial.getField(AbstractPartial.java:105)
	at org.joda.time.field.BaseDateTimeField.set(BaseDateTimeField.java:98)
	at org.joda.time.chrono.BasicMonthOfYearDateTimeField.add(BasicMonthOfYearDateTimeField.java:214)
	at org.joda.time.MonthDay.withFieldAdded(MonthDay.java:519)
	at org.joda.time.MonthDay.minusMonths(MonthDay.java:655)
	at org.joda.time.TestMonthDay_Basics.testMinusMonths_int_negativeFromLeap(TestMonthDay_Basics.java:596)

testMinusMonths_int_endOfMonthAdjust(org.joda.time.TestMonthDay_Basics)  Time elapsed: 0.001 sec  <<< ERROR!
java.lang.IndexOutOfBoundsException: Invalid index: -1
	at org.joda.time.MonthDay.getField(MonthDay.java:414)
	at org.joda.time.base.AbstractPartial.getField(AbstractPartial.java:105)
	at org.joda.time.field.BaseDateTimeField.set(BaseDateTimeField.java:98)
	at org.joda.time.chrono.BasicMonthOfYearDateTimeField.add(BasicMonthOfYearDateTimeField.java:214)
	at org.joda.time.MonthDay.withFieldAdded(MonthDay.java:519)
	at org.joda.time.MonthDay.minusMonths(MonthDay.java:655)
	at org.joda.time.TestMonthDay_Basics.testMinusMonths_int_endOfMonthAdjust(TestMonthDay_Basics.java:603)

testMinusMonths_int_negativeEndOfMonthAdjust(org.joda.time.TestMonthDay_Basics)  Time elapsed: 0 sec  <<< ERROR!
java.lang.IndexOutOfBoundsException: Invalid index: -1
	at org.joda.time.MonthDay.getField(MonthDay.java:414)
	at org.joda.time.base.AbstractPartial.getField(AbstractPartial.java:105)
	at org.joda.time.field.BaseDateTimeField.set(BaseDateTimeField.java:98)
	at org.joda.time.chrono.BasicMonthOfYearDateTimeField.add(BasicMonthOfYearDateTimeField.java:214)
	at org.joda.time.MonthDay.withFieldAdded(MonthDay.java:519)
	at org.joda.time.MonthDay.minusMonths(MonthDay.java:655)
	at org.joda.time.TestMonthDay_Basics.testMinusMonths_int_negativeEndOfMonthAdjust(TestMonthDay_Basics.java:610)

testMinusMonths_int_wrap(org.joda.time.TestMonthDay_Basics)  Time elapsed: 0.001 sec  <<< ERROR!
java.lang.IndexOutOfBoundsException: Invalid index: -1
	at org.joda.time.MonthDay.getField(MonthDay.java:414)
	at org.joda.time.base.AbstractPartial.getField(AbstractPartial.java:105)
	at org.joda.time.field.BaseDateTimeField.set(BaseDateTimeField.java:98)
	at org.joda.time.chrono.BasicMonthOfYearDateTimeField.add(BasicMonthOfYearDateTimeField.java:214)
	at org.joda.time.MonthDay.withFieldAdded(MonthDay.java:519)
	at org.joda.time.MonthDay.minusMonths(MonthDay.java:655)
	at org.joda.time.TestMonthDay_Basics.testMinusMonths_int_wrap(TestMonthDay_Basics.java:623)

testMinusMonths_int_adjust(org.joda.time.TestMonthDay_Basics)  Time elapsed: 0 sec  <<< ERROR!
java.lang.IndexOutOfBoundsException: Invalid index: -1
	at org.joda.time.MonthDay.getField(MonthDay.java:414)
	at org.joda.time.base.AbstractPartial.getField(AbstractPartial.java:105)
	at org.joda.time.field.BaseDateTimeField.set(BaseDateTimeField.java:98)
	at org.joda.time.chrono.BasicMonthOfYearDateTimeField.add(BasicMonthOfYearDateTimeField.java:214)
	at org.joda.time.MonthDay.withFieldAdded(MonthDay.java:519)
	at org.joda.time.MonthDay.minusMonths(MonthDay.java:655)
	at org.joda.time.TestMonthDay_Basics.testMinusMonths_int_adjust(TestMonthDay_Basics.java:630)

testPropertyAddMonthOfYear(org.joda.time.TestMonthDay_Properties)  Time elapsed: 0.001 sec  <<< ERROR!
java.lang.IndexOutOfBoundsException: Invalid index: -1
	at org.joda.time.MonthDay.getField(MonthDay.java:414)
	at org.joda.time.base.AbstractPartial.getField(AbstractPartial.java:105)
	at org.joda.time.field.BaseDateTimeField.set(BaseDateTimeField.java:98)
	at org.joda.time.chrono.BasicMonthOfYearDateTimeField.add(BasicMonthOfYearDateTimeField.java:214)
	at org.joda.time.MonthDay$Property.addToCopy(MonthDay.java:900)
	at org.joda.time.TestMonthDay_Properties.testPropertyAddMonthOfYear(TestMonthDay_Properties.java:109)

testPropertyAddWrapFieldMonthOfYear(org.joda.time.TestMonthDay_Properties)  Time elapsed: 0 sec  <<< ERROR!
java.lang.IndexOutOfBoundsException: Invalid index: -1
	at org.joda.time.MonthDay.getField(MonthDay.java:414)
	at org.joda.time.base.AbstractPartial.getField(AbstractPartial.java:105)
	at org.joda.time.field.BaseDateTimeField.set(BaseDateTimeField.java:98)
	at org.joda.time.field.BaseDateTimeField.addWrapField(BaseDateTimeField.java:90)
	at org.joda.time.MonthDay$Property.addWrapFieldToCopy(MonthDay.java:924)
	at org.joda.time.TestMonthDay_Properties.testPropertyAddWrapFieldMonthOfYear(TestMonthDay_Properties.java:125)

testPropertySetMonthOfYear(org.joda.time.TestMonthDay_Properties)  Time elapsed: 0 sec  <<< ERROR!
java.lang.IndexOutOfBoundsException: Invalid index: -1
	at org.joda.time.MonthDay.getField(MonthDay.java:414)
	at org.joda.time.base.AbstractPartial.getField(AbstractPartial.java:105)
	at org.joda.time.field.BaseDateTimeField.set(BaseDateTimeField.java:98)
	at org.joda.time.MonthDay$Property.setCopy(MonthDay.java:941)
	at org.joda.time.TestMonthDay_Properties.testPropertySetMonthOfYear(TestMonthDay_Properties.java:141)

testPropertySetTextMonthOfYear(org.joda.time.TestMonthDay_Properties)  Time elapsed: 0.001 sec  <<< ERROR!
java.lang.IndexOutOfBoundsException: Invalid index: -1
	at org.joda.time.MonthDay.getField(MonthDay.java:414)
	at org.joda.time.base.AbstractPartial.getField(AbstractPartial.java:105)
	at org.joda.time.field.BaseDateTimeField.set(BaseDateTimeField.java:98)
	at org.joda.time.field.BaseDateTimeField.set(BaseDateTimeField.java:106)
	at org.joda.time.MonthDay$Property.setCopy(MonthDay.java:958)
	at org.joda.time.MonthDay$Property.setCopy(MonthDay.java:973)
	at org.joda.time.TestMonthDay_Properties.testPropertySetTextMonthOfYear(TestMonthDay_Properties.java:148)

testPropertyAddDayOfMonth(org.joda.time.TestMonthDay_Properties)  Time elapsed: 0.001 sec  <<< ERROR!
java.lang.IndexOutOfBoundsException: Invalid index: -1
	at org.joda.time.MonthDay.getField(MonthDay.java:414)
	at org.joda.time.base.AbstractPartial.getField(AbstractPartial.java:105)
	at org.joda.time.field.BaseDateTimeField.set(BaseDateTimeField.java:98)
	at org.joda.time.chrono.BasicMonthOfYearDateTimeField.add(BasicMonthOfYearDateTimeField.java:214)
	at org.joda.time.field.BaseDateTimeField.add(BaseDateTimeField.java:55)
	at org.joda.time.MonthDay$Property.addToCopy(MonthDay.java:900)
	at org.joda.time.TestMonthDay_Properties.testPropertyAddDayOfMonth(TestMonthDay_Properties.java:218)

testWithField1(org.joda.time.TestPartial_Basics)  Time elapsed: 0 sec  <<< ERROR!
java.lang.ArrayIndexOutOfBoundsException: -1
	at org.joda.time.Partial.getField(Partial.java:358)
	at org.joda.time.base.AbstractPartial.getField(AbstractPartial.java:105)
	at org.joda.time.field.BaseDateTimeField.set(BaseDateTimeField.java:98)
	at org.joda.time.Partial.withField(Partial.java:552)
	at org.joda.time.TestPartial_Basics.testWithField1(TestPartial_Basics.java:520)

testWithFieldAdded1(org.joda.time.TestPartial_Basics)  Time elapsed: 0 sec  <<< ERROR!
java.lang.ArrayIndexOutOfBoundsException: -1
	at org.joda.time.Partial.getField(Partial.java:358)
	at org.joda.time.base.AbstractPartial.getField(AbstractPartial.java:105)
	at org.joda.time.field.BaseDateTimeField.set(BaseDateTimeField.java:98)
	at org.joda.time.field.BaseDateTimeField.add(BaseDateTimeField.java:57)
	at org.joda.time.Partial.withFieldAdded(Partial.java:576)
	at org.joda.time.TestPartial_Basics.testWithFieldAdded1(TestPartial_Basics.java:552)

testPlus_RP(org.joda.time.TestPartial_Basics)  Time elapsed: 0 sec  <<< ERROR!
java.lang.ArrayIndexOutOfBoundsException: -1
	at org.joda.time.Partial.getField(Partial.java:358)
	at org.joda.time.base.AbstractPartial.getField(AbstractPartial.java:105)
	at org.joda.time.field.BaseDateTimeField.set(BaseDateTimeField.java:98)
	at org.joda.time.field.BaseDateTimeField.add(BaseDateTimeField.java:57)
	at org.joda.time.Partial.withPeriodAdded(Partial.java:628)
	at org.joda.time.Partial.plus(Partial.java:645)
	at org.joda.time.TestPartial_Basics.testPlus_RP(TestPartial_Basics.java:722)

testMinus_RP(org.joda.time.TestPartial_Basics)  Time elapsed: 0 sec  <<< ERROR!
java.lang.ArrayIndexOutOfBoundsException: -1
	at org.joda.time.Partial.getField(Partial.java:358)
	at org.joda.time.base.AbstractPartial.getField(AbstractPartial.java:105)
	at org.joda.time.field.BaseDateTimeField.set(BaseDateTimeField.java:98)
	at org.joda.time.field.BaseDateTimeField.add(BaseDateTimeField.java:57)
	at org.joda.time.Partial.withPeriodAdded(Partial.java:628)
	at org.joda.time.Partial.minus(Partial.java:658)
	at org.joda.time.TestPartial_Basics.testMinus_RP(TestPartial_Basics.java:733)

testWithFieldAddWrapped1(org.joda.time.TestPartial_Basics)  Time elapsed: 0.001 sec  <<< ERROR!
java.lang.ArrayIndexOutOfBoundsException: -1
	at org.joda.time.Partial.getField(Partial.java:358)
	at org.joda.time.base.AbstractPartial.getField(AbstractPartial.java:105)
	at org.joda.time.field.BaseDateTimeField.set(BaseDateTimeField.java:98)
	at org.joda.time.field.BaseDateTimeField.addWrapPartial(BaseDateTimeField.java:84)
	at org.joda.time.Partial.withFieldAddWrapped(Partial.java:600)
	at org.joda.time.TestPartial_Basics.testWithFieldAddWrapped1(TestPartial_Basics.java:646)

testWithFieldAddWrapped6(org.joda.time.TestPartial_Basics)  Time elapsed: 0 sec  <<< ERROR!
java.lang.ArrayIndexOutOfBoundsException: -1
	at org.joda.time.Partial.getField(Partial.java:358)
	at org.joda.time.base.AbstractPartial.getField(AbstractPartial.java:105)
	at org.joda.time.field.BaseDateTimeField.set(BaseDateTimeField.java:98)
	at org.joda.time.field.BaseDateTimeField.addWrapPartial(BaseDateTimeField.java:84)
	at org.joda.time.Partial.withFieldAddWrapped(Partial.java:600)
	at org.joda.time.TestPartial_Basics.testWithFieldAddWrapped6(TestPartial_Basics.java:688)

testWithFieldAddWrapped7(org.joda.time.TestPartial_Basics)  Time elapsed: 0.001 sec  <<< ERROR!
java.lang.ArrayIndexOutOfBoundsException: -1
	at org.joda.time.Partial.getField(Partial.java:358)
	at org.joda.time.base.AbstractPartial.getField(AbstractPartial.java:105)
	at org.joda.time.field.BaseDateTimeField.set(BaseDateTimeField.java:98)
	at org.joda.time.field.BaseDateTimeField.addWrapPartial(BaseDateTimeField.java:84)
	at org.joda.time.field.BaseDateTimeField.addWrapPartial(BaseDateTimeField.java:70)
	at org.joda.time.Partial.withFieldAddWrapped(Partial.java:600)
	at org.joda.time.TestPartial_Basics.testWithFieldAddWrapped7(TestPartial_Basics.java:697)

testWithFieldAddWrapped8(org.joda.time.TestPartial_Basics)  Time elapsed: 0 sec  <<< ERROR!
java.lang.ArrayIndexOutOfBoundsException: -1
	at org.joda.time.Partial.getField(Partial.java:358)
	at org.joda.time.base.AbstractPartial.getField(AbstractPartial.java:105)
	at org.joda.time.field.BaseDateTimeField.set(BaseDateTimeField.java:98)
	at org.joda.time.field.BaseDateTimeField.addWrapPartial(BaseDateTimeField.java:84)
	at org.joda.time.field.BaseDateTimeField.addWrapPartial(BaseDateTimeField.java:82)
	at org.joda.time.Partial.withFieldAddWrapped(Partial.java:600)
	at org.joda.time.TestPartial_Basics.testWithFieldAddWrapped8(TestPartial_Basics.java:709)

testWith1(org.joda.time.TestPartial_Basics)  Time elapsed: 0.001 sec  <<< ERROR!
java.lang.ArrayIndexOutOfBoundsException: -1
	at org.joda.time.Partial.getField(Partial.java:358)
	at org.joda.time.base.AbstractPartial.getField(AbstractPartial.java:105)
	at org.joda.time.field.BaseDateTimeField.set(BaseDateTimeField.java:98)
	at org.joda.time.Partial.with(Partial.java:503)
	at org.joda.time.TestPartial_Basics.testWith1(TestPartial_Basics.java:346)

testPropertyAddWrapFieldHour(org.joda.time.TestPartial_Properties)  Time elapsed: 0 sec  <<< ERROR!
java.lang.ArrayIndexOutOfBoundsException: -1
	at org.joda.time.Partial.getField(Partial.java:358)
	at org.joda.time.base.AbstractPartial.getField(AbstractPartial.java:105)
	at org.joda.time.field.BaseDateTimeField.set(BaseDateTimeField.java:98)
	at org.joda.time.field.BaseDateTimeField.addWrapField(BaseDateTimeField.java:90)
	at org.joda.time.Partial$Property.addWrapFieldToCopy(Partial.java:949)
	at org.joda.time.TestPartial_Properties.testPropertyAddWrapFieldHour(TestPartial_Properties.java:164)

testPropertyAddMinute(org.joda.time.TestPartial_Properties)  Time elapsed: 0 sec  <<< ERROR!
java.lang.ArrayIndexOutOfBoundsException: -1
	at org.joda.time.Partial.getField(Partial.java:358)
	at org.joda.time.base.AbstractPartial.getField(AbstractPartial.java:105)
	at org.joda.time.field.BaseDateTimeField.set(BaseDateTimeField.java:98)
	at org.joda.time.field.BaseDateTimeField.add(BaseDateTimeField.java:57)
	at org.joda.time.Partial$Property.addToCopy(Partial.java:925)
	at org.joda.time.TestPartial_Properties.testPropertyAddMinute(TestPartial_Properties.java:307)

testPropertyAddWrapFieldMinute(org.joda.time.TestPartial_Properties)  Time elapsed: 0 sec  <<< ERROR!
java.lang.ArrayIndexOutOfBoundsException: -1
	at org.joda.time.Partial.getField(Partial.java:358)
	at org.joda.time.base.AbstractPartial.getField(AbstractPartial.java:105)
	at org.joda.time.field.BaseDateTimeField.set(BaseDateTimeField.java:98)
	at org.joda.time.field.BaseDateTimeField.addWrapField(BaseDateTimeField.java:90)
	at org.joda.time.Partial$Property.addWrapFieldToCopy(Partial.java:949)
	at org.joda.time.TestPartial_Properties.testPropertyAddWrapFieldMinute(TestPartial_Properties.java:353)

testPropertyAddHour(org.joda.time.TestPartial_Properties)  Time elapsed: 0.001 sec  <<< ERROR!
java.lang.ArrayIndexOutOfBoundsException: -1
	at org.joda.time.Partial.getField(Partial.java:358)
	at org.joda.time.base.AbstractPartial.getField(AbstractPartial.java:105)
	at org.joda.time.field.BaseDateTimeField.set(BaseDateTimeField.java:98)
	at org.joda.time.field.BaseDateTimeField.add(BaseDateTimeField.java:57)
	at org.joda.time.Partial$Property.addToCopy(Partial.java:925)
	at org.joda.time.TestPartial_Properties.testPropertyAddHour(TestPartial_Properties.java:136)

testPropertySetHour(org.joda.time.TestPartial_Properties)  Time elapsed: 0 sec  <<< ERROR!
java.lang.ArrayIndexOutOfBoundsException: -1
	at org.joda.time.Partial.getField(Partial.java:358)
	at org.joda.time.base.AbstractPartial.getField(AbstractPartial.java:105)
	at org.joda.time.field.BaseDateTimeField.set(BaseDateTimeField.java:98)
	at org.joda.time.Partial$Property.setCopy(Partial.java:966)
	at org.joda.time.TestPartial_Properties.testPropertySetHour(TestPartial_Properties.java:180)

testPropertySetTextHour(org.joda.time.TestPartial_Properties)  Time elapsed: 0.001 sec  <<< ERROR!
java.lang.ArrayIndexOutOfBoundsException: -1
	at org.joda.time.Partial.getField(Partial.java:358)
	at org.joda.time.base.AbstractPartial.getField(AbstractPartial.java:105)
	at org.joda.time.field.BaseDateTimeField.set(BaseDateTimeField.java:98)
	at org.joda.time.field.BaseDateTimeField.set(BaseDateTimeField.java:106)
	at org.joda.time.Partial$Property.setCopy(Partial.java:983)
	at org.joda.time.Partial$Property.setCopy(Partial.java:998)
	at org.joda.time.TestPartial_Properties.testPropertySetTextHour(TestPartial_Properties.java:196)

testPropertyWithMaximumValueHour(org.joda.time.TestPartial_Properties)  Time elapsed: 0 sec  <<< ERROR!
java.lang.ArrayIndexOutOfBoundsException: -1
	at org.joda.time.Partial.getField(Partial.java:358)
	at org.joda.time.base.AbstractPartial.getField(AbstractPartial.java:105)
	at org.joda.time.field.BaseDateTimeField.set(BaseDateTimeField.java:98)
	at org.joda.time.Partial$Property.setCopy(Partial.java:966)
	at org.joda.time.Partial$Property.withMaximumValue(Partial.java:1012)
	at org.joda.time.TestPartial_Properties.testPropertyWithMaximumValueHour(TestPartial_Properties.java:203)

testPropertyWithMinimumValueHour(org.joda.time.TestPartial_Properties)  Time elapsed: 0 sec  <<< ERROR!
java.lang.ArrayIndexOutOfBoundsException: -1
	at org.joda.time.Partial.getField(Partial.java:358)
	at org.joda.time.base.AbstractPartial.getField(AbstractPartial.java:105)
	at org.joda.time.field.BaseDateTimeField.set(BaseDateTimeField.java:98)
	at org.joda.time.Partial$Property.setCopy(Partial.java:966)
	at org.joda.time.Partial$Property.withMinimumValue(Partial.java:1025)
	at org.joda.time.TestPartial_Properties.testPropertyWithMinimumValueHour(TestPartial_Properties.java:210)

testPropertySetMinute(org.joda.time.TestPartial_Properties)  Time elapsed: 0 sec  <<< ERROR!
java.lang.ArrayIndexOutOfBoundsException: -1
	at org.joda.time.Partial.getField(Partial.java:358)
	at org.joda.time.base.AbstractPartial.getField(AbstractPartial.java:105)
	at org.joda.time.field.BaseDateTimeField.set(BaseDateTimeField.java:98)
	at org.joda.time.Partial$Property.setCopy(Partial.java:966)
	at org.joda.time.TestPartial_Properties.testPropertySetMinute(TestPartial_Properties.java:366)

testPropertySetTextMinute(org.joda.time.TestPartial_Properties)  Time elapsed: 0.001 sec  <<< ERROR!
java.lang.ArrayIndexOutOfBoundsException: -1
	at org.joda.time.Partial.getField(Partial.java:358)
	at org.joda.time.base.AbstractPartial.getField(AbstractPartial.java:105)
	at org.joda.time.field.BaseDateTimeField.set(BaseDateTimeField.java:98)
	at org.joda.time.field.BaseDateTimeField.set(BaseDateTimeField.java:106)
	at org.joda.time.Partial$Property.setCopy(Partial.java:983)
	at org.joda.time.Partial$Property.setCopy(Partial.java:998)
	at org.joda.time.TestPartial_Properties.testPropertySetTextMinute(TestPartial_Properties.java:382)

testSetMethods(org.joda.time.TestBasePartial)  Time elapsed: 0.001 sec  <<< ERROR!
java.lang.IndexOutOfBoundsException
	at org.joda.time.TestBasePartial$MockPartial.getField(TestBasePartial.java:117)
	at org.joda.time.base.AbstractPartial.getField(AbstractPartial.java:105)
	at org.joda.time.field.BaseDateTimeField.set(BaseDateTimeField.java:98)
	at org.joda.time.base.BasePartial.setValue(BasePartial.java:266)
	at org.joda.time.TestBasePartial$MockPartial.setYear(TestBasePartial.java:130)
	at org.joda.time.TestBasePartial.testSetMethods(TestBasePartial.java:77)

testTimeOfDayAdd(org.joda.time.chrono.TestGJChronology)  Time elapsed: 0.001 sec  <<< ERROR!
java.lang.IndexOutOfBoundsException: Invalid index: -1
	at org.joda.time.TimeOfDay.getField(TimeOfDay.java:452)
	at org.joda.time.base.AbstractPartial.getField(AbstractPartial.java:105)
	at org.joda.time.field.BaseDateTimeField.set(BaseDateTimeField.java:98)
	at org.joda.time.field.BaseDateTimeField.addWrapPartial(BaseDateTimeField.java:84)
	at org.joda.time.TimeOfDay.withFieldAdded(TimeOfDay.java:558)
	at org.joda.time.TimeOfDay.plusHours(TimeOfDay.java:632)
	at org.joda.time.chrono.TestGJChronology.testTimeOfDayAdd(TestGJChronology.java:504)

testCutoverAddYears(org.joda.time.chrono.TestISOChronology)  Time elapsed: 0 sec  <<< ERROR!
java.lang.IndexOutOfBoundsException: Invalid index: -1
	at org.joda.time.YearMonthDay.getField(YearMonthDay.java:339)
	at org.joda.time.base.AbstractPartial.getField(AbstractPartial.java:105)
	at org.joda.time.field.BaseDateTimeField.set(BaseDateTimeField.java:98)
	at org.joda.time.field.BaseDateTimeField.add(BaseDateTimeField.java:57)
	at org.joda.time.YearMonthDay.withFieldAdded(YearMonthDay.java:444)
	at org.joda.time.chrono.TestISOChronology.testAdd(TestISOChronology.java:425)
	at org.joda.time.chrono.TestISOChronology.testCutoverAddYears(TestISOChronology.java:376)

testPartialDayOfYearAdd(org.joda.time.chrono.TestISOChronology)  Time elapsed: 0 sec  <<< ERROR!
java.lang.ArrayIndexOutOfBoundsException: -1
	at org.joda.time.Partial.getField(Partial.java:358)
	at org.joda.time.base.AbstractPartial.getField(AbstractPartial.java:105)
	at org.joda.time.field.BaseDateTimeField.set(BaseDateTimeField.java:98)
	at org.joda.time.field.BaseDateTimeField.add(BaseDateTimeField.java:57)
	at org.joda.time.field.BaseDateTimeField.add(BaseDateTimeField.java:45)
	at org.joda.time.Partial.withFieldAdded(Partial.java:576)
	at org.joda.time.chrono.TestISOChronology.testPartialDayOfYearAdd(TestISOChronology.java:442)

testTimeOfDayAdd(org.joda.time.chrono.TestISOChronology)  Time elapsed: 0.001 sec  <<< ERROR!
java.lang.IndexOutOfBoundsException: Invalid index: -1
	at org.joda.time.TimeOfDay.getField(TimeOfDay.java:452)
	at org.joda.time.base.AbstractPartial.getField(AbstractPartial.java:105)
	at org.joda.time.field.BaseDateTimeField.set(BaseDateTimeField.java:98)
	at org.joda.time.field.BaseDateTimeField.addWrapPartial(BaseDateTimeField.java:84)
	at org.joda.time.TimeOfDay.withFieldAdded(TimeOfDay.java:558)
	at org.joda.time.TimeOfDay.plusHours(TimeOfDay.java:632)
	at org.joda.time.chrono.TestISOChronology.testTimeOfDayAdd(TestISOChronology.java:433)

test_add_RP_int_intarray_int(org.joda.time.field.TestBaseDateTimeField)  Time elapsed: 0 sec  <<< ERROR!
java.lang.IndexOutOfBoundsException: Invalid index: -1
	at org.joda.time.TimeOfDay.getField(TimeOfDay.java:452)
	at org.joda.time.base.AbstractPartial.getField(AbstractPartial.java:105)
	at org.joda.time.field.BaseDateTimeField.set(BaseDateTimeField.java:98)
	at org.joda.time.field.BaseDateTimeField.add(BaseDateTimeField.java:57)
	at org.joda.time.field.TestBaseDateTimeField.test_add_RP_int_intarray_int(TestBaseDateTimeField.java:179)

test_addWrapField_RP_int_intarray_int(org.joda.time.field.TestBaseDateTimeField)  Time elapsed: 0.001 sec  <<< ERROR!
java.lang.IndexOutOfBoundsException: Invalid index: -1
	at org.joda.time.TimeOfDay.getField(TimeOfDay.java:452)
	at org.joda.time.base.AbstractPartial.getField(AbstractPartial.java:105)
	at org.joda.time.field.BaseDateTimeField.set(BaseDateTimeField.java:98)
	at org.joda.time.field.BaseDateTimeField.addWrapField(BaseDateTimeField.java:90)
	at org.joda.time.field.TestBaseDateTimeField.test_addWrapField_RP_int_intarray_int(TestBaseDateTimeField.java:234)

test_set_RP_int_intarray_int(org.joda.time.field.TestBaseDateTimeField)  Time elapsed: 0 sec  <<< ERROR!
java.lang.IndexOutOfBoundsException: Invalid index: -1
	at org.joda.time.TimeOfDay.getField(TimeOfDay.java:452)
	at org.joda.time.base.AbstractPartial.getField(AbstractPartial.java:105)
	at org.joda.time.field.BaseDateTimeField.set(BaseDateTimeField.java:98)
	at org.joda.time.field.TestBaseDateTimeField.test_set_RP_int_intarray_int(TestBaseDateTimeField.java:279)

test_set_RP_int_intarray_String_Locale(org.joda.time.field.TestBaseDateTimeField)  Time elapsed: 0.002 sec  <<< ERROR!
java.lang.IndexOutOfBoundsException: Invalid index: -1
	at org.joda.time.TimeOfDay.getField(TimeOfDay.java:452)
	at org.joda.time.base.AbstractPartial.getField(AbstractPartial.java:105)
	at org.joda.time.field.BaseDateTimeField.set(BaseDateTimeField.java:98)
	at org.joda.time.field.BaseDateTimeField.set(BaseDateTimeField.java:106)
	at org.joda.time.field.TestBaseDateTimeField.test_set_RP_int_intarray_String_Locale(TestBaseDateTimeField.java:320)

test_add_RP_int_intarray_int(org.joda.time.field.TestOffsetDateTimeField)  Time elapsed: 0 sec  <<< ERROR!
java.lang.IndexOutOfBoundsException: Invalid index: -1
	at org.joda.time.TimeOfDay.getField(TimeOfDay.java:452)
	at org.joda.time.base.AbstractPartial.getField(AbstractPartial.java:105)
	at org.joda.time.field.BaseDateTimeField.set(BaseDateTimeField.java:98)
	at org.joda.time.field.BaseDateTimeField.add(BaseDateTimeField.java:57)
	at org.joda.time.field.TestOffsetDateTimeField.test_add_RP_int_intarray_int(TestOffsetDateTimeField.java:227)

test_addWrapField_RP_int_intarray_int(org.joda.time.field.TestOffsetDateTimeField)  Time elapsed: 0.001 sec  <<< ERROR!
java.lang.IndexOutOfBoundsException: Invalid index: -1
	at org.joda.time.TimeOfDay.getField(TimeOfDay.java:452)
	at org.joda.time.base.AbstractPartial.getField(AbstractPartial.java:105)
	at org.joda.time.field.BaseDateTimeField.set(BaseDateTimeField.java:98)
	at org.joda.time.field.BaseDateTimeField.addWrapField(BaseDateTimeField.java:90)
	at org.joda.time.field.TestOffsetDateTimeField.test_addWrapField_RP_int_intarray_int(TestOffsetDateTimeField.java:275)

test_set_RP_int_intarray_int(org.joda.time.field.TestOffsetDateTimeField)  Time elapsed: 0 sec  <<< ERROR!
java.lang.IndexOutOfBoundsException: Invalid index: -1
	at org.joda.time.TimeOfDay.getField(TimeOfDay.java:452)
	at org.joda.time.base.AbstractPartial.getField(AbstractPartial.java:105)
	at org.joda.time.field.BaseDateTimeField.set(BaseDateTimeField.java:98)
	at org.joda.time.field.TestOffsetDateTimeField.test_set_RP_int_intarray_int(TestOffsetDateTimeField.java:312)

test_set_RP_int_intarray_String_Locale(org.joda.time.field.TestOffsetDateTimeField)  Time elapsed: 0 sec  <<< ERROR!
java.lang.IndexOutOfBoundsException: Invalid index: -1
	at org.joda.time.TimeOfDay.getField(TimeOfDay.java:452)
	at org.joda.time.base.AbstractPartial.getField(AbstractPartial.java:105)
	at org.joda.time.field.BaseDateTimeField.set(BaseDateTimeField.java:98)
	at org.joda.time.field.BaseDateTimeField.set(BaseDateTimeField.java:106)
	at org.joda.time.field.TestOffsetDateTimeField.test_set_RP_int_intarray_String_Locale(TestOffsetDateTimeField.java:353)

test_add_RP_int_intarray_int(org.joda.time.field.TestPreciseDurationDateTimeField)  Time elapsed: 0.001 sec  <<< ERROR!
java.lang.IndexOutOfBoundsException: Invalid index: -1
	at org.joda.time.TimeOfDay.getField(TimeOfDay.java:452)
	at org.joda.time.base.AbstractPartial.getField(AbstractPartial.java:105)
	at org.joda.time.field.BaseDateTimeField.set(BaseDateTimeField.java:98)
	at org.joda.time.field.BaseDateTimeField.add(BaseDateTimeField.java:57)
	at org.joda.time.field.TestPreciseDurationDateTimeField.test_add_RP_int_intarray_int(TestPreciseDurationDateTimeField.java:196)

test_addWrapField_RP_int_intarray_int(org.joda.time.field.TestPreciseDurationDateTimeField)  Time elapsed: 0.001 sec  <<< ERROR!
java.lang.IndexOutOfBoundsException: Invalid index: -1
	at org.joda.time.TimeOfDay.getField(TimeOfDay.java:452)
	at org.joda.time.base.AbstractPartial.getField(AbstractPartial.java:105)
	at org.joda.time.field.BaseDateTimeField.set(BaseDateTimeField.java:98)
	at org.joda.time.field.BaseDateTimeField.addWrapField(BaseDateTimeField.java:90)
	at org.joda.time.field.TestPreciseDurationDateTimeField.test_addWrapField_RP_int_intarray_int(TestPreciseDurationDateTimeField.java:239)

test_set_RP_int_intarray_int(org.joda.time.field.TestPreciseDurationDateTimeField)  Time elapsed: 0.001 sec  <<< ERROR!
java.lang.IndexOutOfBoundsException: Invalid index: -1
	at org.joda.time.TimeOfDay.getField(TimeOfDay.java:452)
	at org.joda.time.base.AbstractPartial.getField(AbstractPartial.java:105)
	at org.joda.time.field.BaseDateTimeField.set(BaseDateTimeField.java:98)
	at org.joda.time.field.TestPreciseDurationDateTimeField.test_set_RP_int_intarray_int(TestPreciseDurationDateTimeField.java:284)

test_set_RP_int_intarray_String_Locale(org.joda.time.field.TestPreciseDurationDateTimeField)  Time elapsed: 0.001 sec  <<< ERROR!
java.lang.IndexOutOfBoundsException: Invalid index: -1
	at org.joda.time.TimeOfDay.getField(TimeOfDay.java:452)
	at org.joda.time.base.AbstractPartial.getField(AbstractPartial.java:105)
	at org.joda.time.field.BaseDateTimeField.set(BaseDateTimeField.java:98)
	at org.joda.time.field.BaseDateTimeField.set(BaseDateTimeField.java:106)
	at org.joda.time.field.TestPreciseDurationDateTimeField.test_set_RP_int_intarray_String_Locale(TestPreciseDurationDateTimeField.java:325)

test_add_RP_int_intarray_int(org.joda.time.field.TestPreciseDateTimeField)  Time elapsed: 0.001 sec  <<< ERROR!
java.lang.IndexOutOfBoundsException: Invalid index: -1
	at org.joda.time.TimeOfDay.getField(TimeOfDay.java:452)
	at org.joda.time.base.AbstractPartial.getField(AbstractPartial.java:105)
	at org.joda.time.field.BaseDateTimeField.set(BaseDateTimeField.java:98)
	at org.joda.time.field.BaseDateTimeField.add(BaseDateTimeField.java:57)
	at org.joda.time.field.TestPreciseDateTimeField.test_add_RP_int_intarray_int(TestPreciseDateTimeField.java:225)

test_addWrapField_RP_int_intarray_int(org.joda.time.field.TestPreciseDateTimeField)  Time elapsed: 0 sec  <<< ERROR!
java.lang.IndexOutOfBoundsException: Invalid index: -1
	at org.joda.time.TimeOfDay.getField(TimeOfDay.java:452)
	at org.joda.time.base.AbstractPartial.getField(AbstractPartial.java:105)
	at org.joda.time.field.BaseDateTimeField.set(BaseDateTimeField.java:98)
	at org.joda.time.field.BaseDateTimeField.addWrapField(BaseDateTimeField.java:90)
	at org.joda.time.field.TestPreciseDateTimeField.test_addWrapField_RP_int_intarray_int(TestPreciseDateTimeField.java:268)

test_set_RP_int_intarray_int(org.joda.time.field.TestPreciseDateTimeField)  Time elapsed: 0 sec  <<< ERROR!
java.lang.IndexOutOfBoundsException: Invalid index: -1
	at org.joda.time.TimeOfDay.getField(TimeOfDay.java:452)
	at org.joda.time.base.AbstractPartial.getField(AbstractPartial.java:105)
	at org.joda.time.field.BaseDateTimeField.set(BaseDateTimeField.java:98)
	at org.joda.time.field.TestPreciseDateTimeField.test_set_RP_int_intarray_int(TestPreciseDateTimeField.java:313)

test_set_RP_int_intarray_String_Locale(org.joda.time.field.TestPreciseDateTimeField)  Time elapsed: 0 sec  <<< ERROR!
java.lang.IndexOutOfBoundsException: Invalid index: -1
	at org.joda.time.TimeOfDay.getField(TimeOfDay.java:452)
	at org.joda.time.base.AbstractPartial.getField(AbstractPartial.java:105)
	at org.joda.time.field.BaseDateTimeField.set(BaseDateTimeField.java:98)
	at org.joda.time.field.BaseDateTimeField.set(BaseDateTimeField.java:106)
	at org.joda.time.field.TestPreciseDateTimeField.test_set_RP_int_intarray_String_Locale(TestPreciseDateTimeField.java:354)


Results :

Tests in error: 
  org.joda.time.TestBasePartial#testSetMethods IndexOutOfBoundsException
  org.joda.time.TestMonthDay_Basics#testMinusDays_int_negativeFromLeap IndexOutOfBoundsException
  org.joda.time.TestMonthDay_Basics#testMinusDays_int_toLeap IndexOutOfBoundsException
  org.joda.time.TestMonthDay_Basics#testMinusDays_int_wrapMonth IndexOutOfBoundsException
  org.joda.time.TestMonthDay_Basics#testMinusDays_int_wrapMonthIntoLastYear IndexOutOfBoundsException
  org.joda.time.TestMonthDay_Basics#testMinusDays_int_wrapMonthTwice IndexOutOfBoundsException
  org.joda.time.TestMonthDay_Basics#testMinusDays_int_wrapMonthTwiceIntoLastYear IndexOutOfBoundsException
  org.joda.time.TestMonthDay_Basics#testMinusMonths_int IndexOutOfBoundsException
  org.joda.time.TestMonthDay_Basics#testMinusMonths_int_adjust IndexOutOfBoundsException
  org.joda.time.TestMonthDay_Basics#testMinusMonths_int_endOfMonthAdjust IndexOutOfBoundsException
  org.joda.time.TestMonthDay_Basics#testMinusMonths_int_fromLeap IndexOutOfBoundsException
  org.joda.time.TestMonthDay_Basics#testMinusMonths_int_negativeEndOfMonthAdjust IndexOutOfBoundsException
  org.joda.time.TestMonthDay_Basics#testMinusMonths_int_negativeFromLeap IndexOutOfBoundsException
  org.joda.time.TestMonthDay_Basics#testMinusMonths_int_wrap IndexOutOfBoundsException
  org.joda.time.TestMonthDay_Basics#testMinus_RP IndexOutOfBoundsException Inval...
  org.joda.time.TestMonthDay_Basics#testPlusDays_int_fromLeap IndexOutOfBoundsException
  org.joda.time.TestMonthDay_Basics#testPlusDays_int_wrap50 IndexOutOfBoundsException
  org.joda.time.TestMonthDay_Basics#testPlusDays_int_wrapMonth IndexOutOfBoundsException
  org.joda.time.TestMonthDay_Basics#testPlusDays_int_wrapMonthIntoNextYear IndexOutOfBoundsException
  org.joda.time.TestMonthDay_Basics#testPlusDays_int_wrapMonthTwice IndexOutOfBoundsException
  org.joda.time.TestMonthDay_Basics#testPlusDays_int_wrapMonthTwiceIntoNextYear IndexOutOfBoundsException
  org.joda.time.TestMonthDay_Basics#testPlusMonths_int IndexOutOfBoundsException
  org.joda.time.TestMonthDay_Basics#testPlusMonths_int_adjust IndexOutOfBoundsException
  org.joda.time.TestMonthDay_Basics#testPlusMonths_int_endOfMonthAdjust IndexOutOfBoundsException
  org.joda.time.TestMonthDay_Basics#testPlusMonths_int_fromLeap IndexOutOfBoundsException
  org.joda.time.TestMonthDay_Basics#testPlusMonths_int_negativeEndOfMonthAdjust IndexOutOfBoundsException
  org.joda.time.TestMonthDay_Basics#testPlusMonths_int_negativeFromLeap IndexOutOfBoundsException
  org.joda.time.TestMonthDay_Basics#testPlusMonths_int_wrap IndexOutOfBoundsException
  org.joda.time.TestMonthDay_Basics#testPlus_RP IndexOutOfBoundsException Invali...
  org.joda.time.TestMonthDay_Basics#testWithField IndexOutOfBoundsException Inva...
  org.joda.time.TestMonthDay_Basics#testWithFieldAdded IndexOutOfBoundsException
  org.joda.time.TestMonthDay_Basics#testWithers IndexOutOfBoundsException Invali...
  org.joda.time.TestMonthDay_Properties#testPropertyAddDayOfMonth IndexOutOfBoundsException
  org.joda.time.TestMonthDay_Properties#testPropertyAddMonthOfYear IndexOutOfBoundsException
  org.joda.time.TestMonthDay_Properties#testPropertyAddWrapFieldMonthOfYear IndexOutOfBoundsException
  org.joda.time.TestMonthDay_Properties#testPropertySetMonthOfYear IndexOutOfBoundsException
  org.joda.time.TestMonthDay_Properties#testPropertySetTextMonthOfYear IndexOutOfBoundsException
  org.joda.time.TestPartial_Basics#testMinus_RP ArrayIndexOutOfBoundsException -...
  org.joda.time.TestPartial_Basics#testPlus_RP ArrayIndexOutOfBoundsException -1
  org.joda.time.TestPartial_Basics#testWith1 ArrayIndexOutOfBoundsException -1
  org.joda.time.TestPartial_Basics#testWithField1 ArrayIndexOutOfBoundsException
  org.joda.time.TestPartial_Basics#testWithFieldAddWrapped1 ArrayIndexOutOfBoundsException
  org.joda.time.TestPartial_Basics#testWithFieldAddWrapped6 ArrayIndexOutOfBoundsException
  org.joda.time.TestPartial_Basics#testWithFieldAddWrapped7 ArrayIndexOutOfBoundsException
  org.joda.time.TestPartial_Basics#testWithFieldAddWrapped8 ArrayIndexOutOfBoundsException
  org.joda.time.TestPartial_Basics#testWithFieldAdded1 ArrayIndexOutOfBoundsException
  org.joda.time.TestPartial_Properties#testPropertyAddHour ArrayIndexOutOfBoundsException
  org.joda.time.TestPartial_Properties#testPropertyAddMinute ArrayIndexOutOfBoundsException
  org.joda.time.TestPartial_Properties#testPropertyAddWrapFieldHour ArrayIndexOutOfBoundsException
  org.joda.time.TestPartial_Properties#testPropertyAddWrapFieldMinute ArrayIndexOutOfBoundsException
  org.joda.time.TestPartial_Properties#testPropertySetHour ArrayIndexOutOfBoundsException
  org.joda.time.TestPartial_Properties#testPropertySetMinute ArrayIndexOutOfBoundsException
  org.joda.time.TestPartial_Properties#testPropertySetTextHour ArrayIndexOutOfBoundsException
  org.joda.time.TestPartial_Properties#testPropertySetTextMinute ArrayIndexOutOfBoundsException
  org.joda.time.TestPartial_Properties#testPropertyWithMaximumValueHour ArrayIndexOutOfBoundsException
  org.joda.time.TestPartial_Properties#testPropertyWithMinimumValueHour ArrayIndexOutOfBoundsException
  org.joda.time.TestTimeOfDay_Basics#testMinusHours_int IndexOutOfBoundsException
  org.joda.time.TestTimeOfDay_Basics#testMinusMinutes_int IndexOutOfBoundsException
  org.joda.time.TestTimeOfDay_Basics#testMinusSeconds_int IndexOutOfBoundsException
  org.joda.time.TestTimeOfDay_Basics#testMinus_RP IndexOutOfBoundsException Inva...
  org.joda.time.TestTimeOfDay_Basics#testPlusHours_int IndexOutOfBoundsException
  org.joda.time.TestTimeOfDay_Basics#testPlusMinutes_int IndexOutOfBoundsException
  org.joda.time.TestTimeOfDay_Basics#testPlusSeconds_int IndexOutOfBoundsException
  org.joda.time.TestTimeOfDay_Basics#testPlus_RP IndexOutOfBoundsException Inval...
  org.joda.time.TestTimeOfDay_Basics#testWithField1 IndexOutOfBoundsException In...
  org.joda.time.TestTimeOfDay_Basics#testWithFieldAdded1 IndexOutOfBoundsException
  org.joda.time.TestTimeOfDay_Basics#testWithFieldAdded6 IndexOutOfBoundsException
  org.joda.time.TestTimeOfDay_Basics#testWithFieldAdded7 IndexOutOfBoundsException
  org.joda.time.TestTimeOfDay_Basics#testWithFieldAdded8 IndexOutOfBoundsException
  org.joda.time.TestTimeOfDay_Basics#testWithers IndexOutOfBoundsException Inval...
  org.joda.time.TestTimeOfDay_Properties#testPropertyAddHour IndexOutOfBoundsException
  org.joda.time.TestTimeOfDay_Properties#testPropertyAddMilli IndexOutOfBoundsException
  org.joda.time.TestTimeOfDay_Properties#testPropertyAddMinute IndexOutOfBoundsException
  org.joda.time.TestTimeOfDay_Properties#testPropertyAddNoWrapHour IndexOutOfBoundsException
  org.joda.time.TestTimeOfDay_Properties#testPropertyAddNoWrapMilli IndexOutOfBoundsException
  org.joda.time.TestTimeOfDay_Properties#testPropertyAddNoWrapMinute IndexOutOfBoundsException
  org.joda.time.TestTimeOfDay_Properties#testPropertyAddNoWrapSecond IndexOutOfBoundsException
  org.joda.time.TestTimeOfDay_Properties#testPropertyAddSecond IndexOutOfBoundsException
  org.joda.time.TestTimeOfDay_Properties#testPropertyAddWrapFieldHour IndexOutOfBoundsException
  org.joda.time.TestTimeOfDay_Properties#testPropertyAddWrapFieldMinute IndexOutOfBoundsException
  org.joda.time.TestTimeOfDay_Properties#testPropertyAddWrapFieldSecond IndexOutOfBoundsException
  org.joda.time.TestTimeOfDay_Properties#testPropertySetHour IndexOutOfBoundsException
  org.joda.time.TestTimeOfDay_Properties#testPropertySetMinute IndexOutOfBoundsException
  org.joda.time.TestTimeOfDay_Properties#testPropertySetSecond IndexOutOfBoundsException
  org.joda.time.TestTimeOfDay_Properties#testPropertySetTextHour IndexOutOfBoundsException
  org.joda.time.TestTimeOfDay_Properties#testPropertySetTextMinute IndexOutOfBoundsException
  org.joda.time.TestTimeOfDay_Properties#testPropertySetTextSecond IndexOutOfBoundsException
  org.joda.time.TestTimeOfDay_Properties#testPropertyWithMaximumValueHour IndexOutOfBoundsException
  org.joda.time.TestTimeOfDay_Properties#testPropertyWithMinimumValueHour IndexOutOfBoundsException
  org.joda.time.TestYearMonthDay_Basics#testMinusMonths_int IndexOutOfBoundsException
  org.joda.time.TestYearMonthDay_Basics#testMinusYears_int IndexOutOfBoundsException
  org.joda.time.TestYearMonthDay_Basics#testMinus_RP IndexOutOfBoundsException I...
  org.joda.time.TestYearMonthDay_Basics#testPlusMonths_int IndexOutOfBoundsException
  org.joda.time.TestYearMonthDay_Basics#testPlusYears_int IndexOutOfBoundsException
  org.joda.time.TestYearMonthDay_Basics#testPlus_RP IndexOutOfBoundsException In...
  org.joda.time.TestYearMonthDay_Basics#testWithField1 IndexOutOfBoundsException
  org.joda.time.TestYearMonthDay_Basics#testWithFieldAdded1 IndexOutOfBoundsException
  org.joda.time.TestYearMonthDay_Basics#testWithers IndexOutOfBoundsException In...
  org.joda.time.TestYearMonthDay_Properties#testPropertyAddWrapFieldMonth IndexOutOfBoundsException
  org.joda.time.TestYearMonthDay_Properties#testPropertyAddWrapFieldYear IndexOutOfBoundsException
  org.joda.time.TestYearMonthDay_Properties#testPropertyAddYear IndexOutOfBoundsException
  org.joda.time.TestYearMonthDay_Properties#testPropertySetMonth IndexOutOfBoundsException
  org.joda.time.TestYearMonthDay_Properties#testPropertySetTextMonth IndexOutOfBoundsException
  org.joda.time.TestYearMonthDay_Properties#testPropertySetTextYear IndexOutOfBoundsException
  org.joda.time.TestYearMonthDay_Properties#testPropertySetYear IndexOutOfBoundsException
  org.joda.time.TestYearMonth_Basics#testMinusYears_int IndexOutOfBoundsException
  org.joda.time.TestYearMonth_Basics#testMinus_RP IndexOutOfBoundsException Inva...
  org.joda.time.TestYearMonth_Basics#testPlusYears_int IndexOutOfBoundsException
  org.joda.time.TestYearMonth_Basics#testPlus_RP IndexOutOfBoundsException Inval...
  org.joda.time.TestYearMonth_Basics#testWithField IndexOutOfBoundsException Inv...
  org.joda.time.TestYearMonth_Basics#testWithFieldAdded IndexOutOfBoundsException
  org.joda.time.TestYearMonth_Basics#testWithers IndexOutOfBoundsException Inval...
  org.joda.time.TestYearMonth_Properties#testPropertyAddWrapFieldYear IndexOutOfBoundsException
  org.joda.time.TestYearMonth_Properties#testPropertyAddYear IndexOutOfBoundsException
  org.joda.time.TestYearMonth_Properties#testPropertySetTextYear IndexOutOfBoundsException
  org.joda.time.TestYearMonth_Properties#testPropertySetYear IndexOutOfBoundsException
  org.joda.time.chrono.TestGJChronology#testTimeOfDayAdd IndexOutOfBoundsException
  org.joda.time.chrono.TestISOChronology#testCutoverAddYears IndexOutOfBoundsException
  org.joda.time.chrono.TestISOChronology#testPartialDayOfYearAdd ArrayIndexOutOfBoundsException
  org.joda.time.chrono.TestISOChronology#testTimeOfDayAdd IndexOutOfBoundsException
  org.joda.time.field.TestBaseDateTimeField#test_addWrapField_RP_int_intarray_int IndexOutOfBoundsException
  org.joda.time.field.TestBaseDateTimeField#test_add_RP_int_intarray_int IndexOutOfBoundsException
  org.joda.time.field.TestBaseDateTimeField#test_set_RP_int_intarray_String_Locale IndexOutOfBoundsException
  org.joda.time.field.TestBaseDateTimeField#test_set_RP_int_intarray_int IndexOutOfBoundsException
  org.joda.time.field.TestOffsetDateTimeField#test_addWrapField_RP_int_intarray_int IndexOutOfBoundsException
  org.joda.time.field.TestOffsetDateTimeField#test_add_RP_int_intarray_int IndexOutOfBoundsException
  org.joda.time.field.TestOffsetDateTimeField#test_set_RP_int_intarray_String_Locale IndexOutOfBoundsException
  org.joda.time.field.TestOffsetDateTimeField#test_set_RP_int_intarray_int IndexOutOfBoundsException
  org.joda.time.field.TestPreciseDateTimeField#test_addWrapField_RP_int_intarray_int IndexOutOfBoundsException
  org.joda.time.field.TestPreciseDateTimeField#test_add_RP_int_intarray_int IndexOutOfBoundsException
  org.joda.time.field.TestPreciseDateTimeField#test_set_RP_int_intarray_String_Locale IndexOutOfBoundsException
  org.joda.time.field.TestPreciseDateTimeField#test_set_RP_int_intarray_int IndexOutOfBoundsException
  org.joda.time.field.TestPreciseDurationDateTimeField#test_addWrapField_RP_int_intarray_int IndexOutOfBoundsException
  org.joda.time.field.TestPreciseDurationDateTimeField#test_add_RP_int_intarray_int IndexOutOfBoundsException
  org.joda.time.field.TestPreciseDurationDateTimeField#test_set_RP_int_intarray_String_Locale IndexOutOfBoundsException
  org.joda.time.field.TestPreciseDurationDateTimeField#test_set_RP_int_intarray_int IndexOutOfBoundsException

Tests run: 4157, Failures: 0, Errors: 136, Skipped: 0

[INFO] ------------------------------------------------------------------------
[INFO] BUILD FAILURE
[INFO] ------------------------------------------------------------------------
[INFO] Total time: 15.278s
[INFO] Finished at: Thu Aug 06 03:59:41 BST 2015
[INFO] Final Memory: 7M/157M
[INFO] ------------------------------------------------------------------------
[ERROR] Failed to execute goal org.apache.maven.plugins:maven-surefire-plugin:2.18.1:test (default-test) on project joda-time: There are test failures.
[ERROR] 
[ERROR] Please refer to /home/perham/Study/LittleDarwin/Cases/joda-time-2.8.1/target/surefire-reports for the individual test results.
[ERROR] -> [Help 1]
[ERROR] 
[ERROR] To see the full stack trace of the errors, re-run Maven with the -e switch.
[ERROR] Re-run Maven using the -X switch to enable full debug logging.
[ERROR] 
[ERROR] For more information about the errors and possible solutions, please read the following articles:
[ERROR] [Help 1] http://cwiki.apache.org/confluence/display/MAVEN/MojoFailureException
