[INFO] Scanning for projects...
[INFO]                                                                         
[INFO] ------------------------------------------------------------------------
[INFO] Building Joda-Time 2.8.1
[INFO] ------------------------------------------------------------------------
[INFO] 
[INFO] --- maven-resources-plugin:2.7:resources (default-resources) @ joda-time ---
[INFO] Using 'UTF-8' encoding to copy filtered resources.
[INFO] Copying 2 resources to META-INF
[INFO] Copying 10 resources
[INFO] 
[INFO] --- maven-compiler-plugin:3.3:compile (default-compile) @ joda-time ---
[INFO] Changes detected - recompiling the module!
[INFO] Compiling 166 source files to /home/perham/Study/LittleDarwin/Cases/joda-time-2.8.1/target/classes
[INFO] 
[INFO] --- exec-maven-plugin:1.4.0:java (compile-tzdb) @ joda-time ---
Writing zoneinfo files
Writing ZoneInfoMap
[INFO] 
[INFO] --- maven-resources-plugin:2.7:testResources (default-testResources) @ joda-time ---
[INFO] Using 'UTF-8' encoding to copy filtered resources.
[INFO] Copying 34 resources
[INFO] 
[INFO] --- maven-compiler-plugin:3.3:testCompile (default-testCompile) @ joda-time ---
[INFO] Nothing to compile - all classes are up to date
[INFO] 
[INFO] --- maven-surefire-plugin:2.18.1:test (default-test) @ joda-time ---
[INFO] Surefire report directory: /home/perham/Study/LittleDarwin/Cases/joda-time-2.8.1/target/surefire-reports

-------------------------------------------------------
 T E S T S
-------------------------------------------------------
Running org.joda.time.TestAllPackages

TestBuddhistChronology.testCalendar

TestCopticChronology.testCalendar

TestEthiopicChronology.testCalendar

TestIslamicChronology.testCalendar

Testing Gregorian chronology over 1000 iterations
100% complete (i=1000)

Testing Julian chronology over 1000 iterations
100% complete (i=1000)
Writing zoneinfo files
Writing ZoneInfoMap
Tests run: 4157, Failures: 0, Errors: 17, Skipped: 0, Time elapsed: 5.379 sec <<< FAILURE! - in org.joda.time.TestAllPackages
testPropertyAddNoWrapMinute(org.joda.time.TestTimeOfDay_Properties)  Time elapsed: 0.005 sec  <<< ERROR!
java.lang.IllegalArgumentException: Fields invalid for add
	at org.joda.time.field.BaseDateTimeField.add(BaseDateTimeField.java:53)
	at org.joda.time.TimeOfDay$Property.addNoWrapToCopy(TimeOfDay.java:1124)
	at org.joda.time.TestTimeOfDay_Properties.testPropertyAddNoWrapMinute(TestTimeOfDay_Properties.java:332)

testPropertyAddNoWrapSecond(org.joda.time.TestTimeOfDay_Properties)  Time elapsed: 0.003 sec  <<< ERROR!
java.lang.IllegalArgumentException: Fields invalid for add
	at org.joda.time.field.BaseDateTimeField.add(BaseDateTimeField.java:53)
	at org.joda.time.TimeOfDay$Property.addNoWrapToCopy(TimeOfDay.java:1124)
	at org.joda.time.TestTimeOfDay_Properties.testPropertyAddNoWrapSecond(TestTimeOfDay_Properties.java:498)

testPropertyAddNoWrapMilli(org.joda.time.TestTimeOfDay_Properties)  Time elapsed: 0.035 sec  <<< ERROR!
java.lang.IndexOutOfBoundsException: Invalid index: 4
	at org.joda.time.TimeOfDay.getField(TimeOfDay.java:452)
	at org.joda.time.base.AbstractPartial.getField(AbstractPartial.java:105)
	at org.joda.time.field.BaseDateTimeField.add(BaseDateTimeField.java:52)
	at org.joda.time.TimeOfDay$Property.addNoWrapToCopy(TimeOfDay.java:1124)
	at org.joda.time.TestTimeOfDay_Properties.testPropertyAddNoWrapMilli(TestTimeOfDay_Properties.java:658)

testPropertyAddDay(org.joda.time.TestYearMonthDay_Properties)  Time elapsed: 0.002 sec  <<< ERROR!
java.lang.IndexOutOfBoundsException: Invalid index: 3
	at org.joda.time.YearMonthDay.getField(YearMonthDay.java:339)
	at org.joda.time.base.AbstractPartial.getField(AbstractPartial.java:105)
	at org.joda.time.field.BaseDateTimeField.add(BaseDateTimeField.java:52)
	at org.joda.time.YearMonthDay$Property.addToCopy(YearMonthDay.java:1011)
	at org.joda.time.TestYearMonthDay_Properties.testPropertyAddDay(TestYearMonthDay_Properties.java:400)

testMinusDays_int_wrapMonth(org.joda.time.TestMonthDay_Basics)  Time elapsed: 0 sec  <<< ERROR!
java.lang.IndexOutOfBoundsException: Invalid index: 2
	at org.joda.time.MonthDay.getField(MonthDay.java:414)
	at org.joda.time.base.AbstractPartial.getField(AbstractPartial.java:105)
	at org.joda.time.field.BaseDateTimeField.add(BaseDateTimeField.java:52)
	at org.joda.time.MonthDay.withFieldAdded(MonthDay.java:519)
	at org.joda.time.MonthDay.minusDays(MonthDay.java:675)
	at org.joda.time.TestMonthDay_Basics.testMinusDays_int_wrapMonth(TestMonthDay_Basics.java:645)

testMinusDays_int_wrapMonthTwice(org.joda.time.TestMonthDay_Basics)  Time elapsed: 0.001 sec  <<< ERROR!
java.lang.IndexOutOfBoundsException: Invalid index: 2
	at org.joda.time.MonthDay.getField(MonthDay.java:414)
	at org.joda.time.base.AbstractPartial.getField(AbstractPartial.java:105)
	at org.joda.time.field.BaseDateTimeField.add(BaseDateTimeField.java:52)
	at org.joda.time.MonthDay.withFieldAdded(MonthDay.java:519)
	at org.joda.time.MonthDay.minusDays(MonthDay.java:675)
	at org.joda.time.TestMonthDay_Basics.testMinusDays_int_wrapMonthTwice(TestMonthDay_Basics.java:652)

testMinusDays_int_wrapMonthIntoLastYear(org.joda.time.TestMonthDay_Basics)  Time elapsed: 0 sec  <<< ERROR!
java.lang.IndexOutOfBoundsException: Invalid index: 2
	at org.joda.time.MonthDay.getField(MonthDay.java:414)
	at org.joda.time.base.AbstractPartial.getField(AbstractPartial.java:105)
	at org.joda.time.field.BaseDateTimeField.add(BaseDateTimeField.java:52)
	at org.joda.time.MonthDay.withFieldAdded(MonthDay.java:519)
	at org.joda.time.MonthDay.minusDays(MonthDay.java:675)
	at org.joda.time.TestMonthDay_Basics.testMinusDays_int_wrapMonthIntoLastYear(TestMonthDay_Basics.java:659)

testMinusDays_int_wrapMonthTwiceIntoLastYear(org.joda.time.TestMonthDay_Basics)  Time elapsed: 0.001 sec  <<< ERROR!
java.lang.IndexOutOfBoundsException: Invalid index: 2
	at org.joda.time.MonthDay.getField(MonthDay.java:414)
	at org.joda.time.base.AbstractPartial.getField(AbstractPartial.java:105)
	at org.joda.time.field.BaseDateTimeField.add(BaseDateTimeField.java:52)
	at org.joda.time.MonthDay.withFieldAdded(MonthDay.java:519)
	at org.joda.time.MonthDay.minusDays(MonthDay.java:675)
	at org.joda.time.TestMonthDay_Basics.testMinusDays_int_wrapMonthTwiceIntoLastYear(TestMonthDay_Basics.java:666)

testMinusDays_int_toLeap(org.joda.time.TestMonthDay_Basics)  Time elapsed: 0 sec  <<< ERROR!
java.lang.IndexOutOfBoundsException: Invalid index: 2
	at org.joda.time.MonthDay.getField(MonthDay.java:414)
	at org.joda.time.base.AbstractPartial.getField(AbstractPartial.java:105)
	at org.joda.time.field.BaseDateTimeField.add(BaseDateTimeField.java:52)
	at org.joda.time.MonthDay.withFieldAdded(MonthDay.java:519)
	at org.joda.time.MonthDay.minusDays(MonthDay.java:675)
	at org.joda.time.TestMonthDay_Basics.testMinusDays_int_toLeap(TestMonthDay_Basics.java:673)

testPropertyAddDayOfMonth(org.joda.time.TestMonthDay_Properties)  Time elapsed: 0.001 sec  <<< ERROR!
java.lang.IndexOutOfBoundsException: Invalid index: 2
	at org.joda.time.MonthDay.getField(MonthDay.java:414)
	at org.joda.time.base.AbstractPartial.getField(AbstractPartial.java:105)
	at org.joda.time.field.BaseDateTimeField.add(BaseDateTimeField.java:52)
	at org.joda.time.MonthDay$Property.addToCopy(MonthDay.java:900)
	at org.joda.time.TestMonthDay_Properties.testPropertyAddDayOfMonth(TestMonthDay_Properties.java:218)

testWithFieldAdded8(org.joda.time.TestPartial_Basics)  Time elapsed: 0 sec  <<< ERROR!
java.lang.ArrayIndexOutOfBoundsException: 2
	at org.joda.time.Partial.getField(Partial.java:358)
	at org.joda.time.base.AbstractPartial.getField(AbstractPartial.java:105)
	at org.joda.time.field.BaseDateTimeField.add(BaseDateTimeField.java:52)
	at org.joda.time.Partial.withFieldAdded(Partial.java:576)
	at org.joda.time.TestPartial_Basics.testWithFieldAdded8(TestPartial_Basics.java:626)

testPropertyAddMinute(org.joda.time.TestPartial_Properties)  Time elapsed: 0.001 sec  <<< ERROR!
java.lang.IllegalArgumentException: Fields invalid for add
	at org.joda.time.field.BaseDateTimeField.add(BaseDateTimeField.java:53)
	at org.joda.time.Partial$Property.addToCopy(Partial.java:925)
	at org.joda.time.TestPartial_Properties.testPropertyAddMinute(TestPartial_Properties.java:338)

testPartialDayOfYearAdd(org.joda.time.chrono.TestISOChronology)  Time elapsed: 0.001 sec  <<< ERROR!
java.lang.ArrayIndexOutOfBoundsException: 2
	at org.joda.time.Partial.getField(Partial.java:358)
	at org.joda.time.base.AbstractPartial.getField(AbstractPartial.java:105)
	at org.joda.time.field.BaseDateTimeField.add(BaseDateTimeField.java:52)
	at org.joda.time.Partial.withFieldAdded(Partial.java:576)
	at org.joda.time.chrono.TestISOChronology.testPartialDayOfYearAdd(TestISOChronology.java:443)

test_add_RP_int_intarray_int(org.joda.time.field.TestBaseDateTimeField)  Time elapsed: 0 sec  <<< ERROR!
java.lang.IllegalArgumentException: Fields invalid for add
	at org.joda.time.field.BaseDateTimeField.add(BaseDateTimeField.java:53)
	at org.joda.time.field.TestBaseDateTimeField.test_add_RP_int_intarray_int(TestBaseDateTimeField.java:200)

test_add_RP_int_intarray_int(org.joda.time.field.TestOffsetDateTimeField)  Time elapsed: 0.001 sec  <<< ERROR!
java.lang.IllegalArgumentException: Fields invalid for add
	at org.joda.time.field.BaseDateTimeField.add(BaseDateTimeField.java:53)
	at org.joda.time.field.TestOffsetDateTimeField.test_add_RP_int_intarray_int(TestOffsetDateTimeField.java:253)

test_add_RP_int_intarray_int(org.joda.time.field.TestPreciseDurationDateTimeField)  Time elapsed: 0.004 sec  <<< ERROR!
java.lang.IllegalArgumentException: Fields invalid for add
	at org.joda.time.field.BaseDateTimeField.add(BaseDateTimeField.java:53)
	at org.joda.time.field.TestPreciseDurationDateTimeField.test_add_RP_int_intarray_int(TestPreciseDurationDateTimeField.java:217)

test_add_RP_int_intarray_int(org.joda.time.field.TestPreciseDateTimeField)  Time elapsed: 0.001 sec  <<< ERROR!
java.lang.IllegalArgumentException: Fields invalid for add
	at org.joda.time.field.BaseDateTimeField.add(BaseDateTimeField.java:53)
	at org.joda.time.field.TestPreciseDateTimeField.test_add_RP_int_intarray_int(TestPreciseDateTimeField.java:246)


Results :

Tests in error: 
  org.joda.time.TestMonthDay_Basics#testMinusDays_int_toLeap IndexOutOfBoundsException
  org.joda.time.TestMonthDay_Basics#testMinusDays_int_wrapMonth IndexOutOfBoundsException
  org.joda.time.TestMonthDay_Basics#testMinusDays_int_wrapMonthIntoLastYear IndexOutOfBoundsException
  org.joda.time.TestMonthDay_Basics#testMinusDays_int_wrapMonthTwice IndexOutOfBoundsException
  org.joda.time.TestMonthDay_Basics#testMinusDays_int_wrapMonthTwiceIntoLastYear IndexOutOfBoundsException
  org.joda.time.TestMonthDay_Properties#testPropertyAddDayOfMonth IndexOutOfBoundsException
  org.joda.time.TestPartial_Basics#testWithFieldAdded8 ArrayIndexOutOfBoundsException
  org.joda.time.TestPartial_Properties#testPropertyAddMinute IllegalArgumentException
  org.joda.time.TestTimeOfDay_Properties#testPropertyAddNoWrapMilli IndexOutOfBoundsException
  org.joda.time.TestTimeOfDay_Properties#testPropertyAddNoWrapMinute IllegalArgumentException
  org.joda.time.TestTimeOfDay_Properties#testPropertyAddNoWrapSecond IllegalArgumentException
  org.joda.time.TestYearMonthDay_Properties#testPropertyAddDay IndexOutOfBoundsException
  org.joda.time.chrono.TestISOChronology#testPartialDayOfYearAdd ArrayIndexOutOfBoundsException
  org.joda.time.field.TestBaseDateTimeField#test_add_RP_int_intarray_int IllegalArgumentException
  org.joda.time.field.TestOffsetDateTimeField#test_add_RP_int_intarray_int IllegalArgumentException
  org.joda.time.field.TestPreciseDateTimeField#test_add_RP_int_intarray_int IllegalArgumentException
  org.joda.time.field.TestPreciseDurationDateTimeField#test_add_RP_int_intarray_int IllegalArgumentException

Tests run: 4157, Failures: 0, Errors: 17, Skipped: 0

[INFO] ------------------------------------------------------------------------
[INFO] BUILD FAILURE
[INFO] ------------------------------------------------------------------------
[INFO] Total time: 15.094s
[INFO] Finished at: Thu Aug 06 03:57:40 BST 2015
[INFO] Final Memory: 8M/217M
[INFO] ------------------------------------------------------------------------
[ERROR] Failed to execute goal org.apache.maven.plugins:maven-surefire-plugin:2.18.1:test (default-test) on project joda-time: There are test failures.
[ERROR] 
[ERROR] Please refer to /home/perham/Study/LittleDarwin/Cases/joda-time-2.8.1/target/surefire-reports for the individual test results.
[ERROR] -> [Help 1]
[ERROR] 
[ERROR] To see the full stack trace of the errors, re-run Maven with the -e switch.
[ERROR] Re-run Maven using the -X switch to enable full debug logging.
[ERROR] 
[ERROR] For more information about the errors and possible solutions, please read the following articles:
[ERROR] [Help 1] http://cwiki.apache.org/confluence/display/MAVEN/MojoFailureException
