[INFO] Scanning for projects...
[INFO]                                                                         
[INFO] ------------------------------------------------------------------------
[INFO] Building Joda-Time 2.8.1
[INFO] ------------------------------------------------------------------------
[INFO] 
[INFO] --- maven-resources-plugin:2.7:resources (default-resources) @ joda-time ---
[INFO] Using 'UTF-8' encoding to copy filtered resources.
[INFO] Copying 2 resources to META-INF
[INFO] Copying 10 resources
[INFO] 
[INFO] --- maven-compiler-plugin:3.3:compile (default-compile) @ joda-time ---
[INFO] Changes detected - recompiling the module!
[INFO] Compiling 166 source files to /home/perham/Study/LittleDarwin/Cases/joda-time-2.8.1/target/classes
[INFO] 
[INFO] --- exec-maven-plugin:1.4.0:java (compile-tzdb) @ joda-time ---
Writing zoneinfo files
Writing ZoneInfoMap
[INFO] 
[INFO] --- maven-resources-plugin:2.7:testResources (default-testResources) @ joda-time ---
[INFO] Using 'UTF-8' encoding to copy filtered resources.
[INFO] Copying 34 resources
[INFO] 
[INFO] --- maven-compiler-plugin:3.3:testCompile (default-testCompile) @ joda-time ---
[INFO] Nothing to compile - all classes are up to date
[INFO] 
[INFO] --- maven-surefire-plugin:2.18.1:test (default-test) @ joda-time ---
[INFO] Surefire report directory: /home/perham/Study/LittleDarwin/Cases/joda-time-2.8.1/target/surefire-reports

-------------------------------------------------------
 T E S T S
-------------------------------------------------------
Running org.joda.time.TestAllPackages

TestBuddhistChronology.testCalendar

TestCopticChronology.testCalendar

TestEthiopicChronology.testCalendar

TestIslamicChronology.testCalendar

Testing Gregorian chronology over 1000 iterations
100% complete (i=1000)

Testing Julian chronology over 1000 iterations
100% complete (i=1000)
Writing zoneinfo files
Writing ZoneInfoMap
Tests run: 4157, Failures: 5, Errors: 5, Skipped: 0, Time elapsed: 5.342 sec <<< FAILURE! - in org.joda.time.TestAllPackages
testPropertyAddNoWrapMinute(org.joda.time.TestTimeOfDay_Properties)  Time elapsed: 0.005 sec  <<< ERROR!
org.joda.time.IllegalFieldValueException: Value 29 for hourOfDay must be in the range [0,23]
	at org.joda.time.field.FieldUtils.verifyValueBounds(FieldUtils.java:234)
	at org.joda.time.field.BaseDateTimeField.set(BaseDateTimeField.java:94)
	at org.joda.time.field.BaseDateTimeField.add(BaseDateTimeField.java:57)
	at org.joda.time.field.BaseDateTimeField.add(BaseDateTimeField.java:55)
	at org.joda.time.TimeOfDay$Property.addNoWrapToCopy(TimeOfDay.java:1124)
	at org.joda.time.TestTimeOfDay_Properties.testPropertyAddNoWrapMinute(TestTimeOfDay_Properties.java:332)

testPropertyAddNoWrapSecond(org.joda.time.TestTimeOfDay_Properties)  Time elapsed: 0.003 sec  <<< FAILURE!
junit.framework.AssertionFailedError: expected:<19> but was:<20>
	at junit.framework.Assert.fail(Assert.java:47)
	at junit.framework.Assert.failNotEquals(Assert.java:280)
	at junit.framework.Assert.assertEquals(Assert.java:64)
	at junit.framework.Assert.assertEquals(Assert.java:198)
	at junit.framework.Assert.assertEquals(Assert.java:204)
	at org.joda.time.TestTimeOfDay_Properties.check(TestTimeOfDay_Properties.java:732)
	at org.joda.time.TestTimeOfDay_Properties.testPropertyAddNoWrapSecond(TestTimeOfDay_Properties.java:499)

testPropertyAddNoWrapMilli(org.joda.time.TestTimeOfDay_Properties)  Time elapsed: 0.041 sec  <<< ERROR!
java.lang.ArrayIndexOutOfBoundsException: 4
	at org.joda.time.field.BaseDateTimeField.add(BaseDateTimeField.java:48)
	at org.joda.time.field.BaseDateTimeField.add(BaseDateTimeField.java:55)
	at org.joda.time.TimeOfDay$Property.addNoWrapToCopy(TimeOfDay.java:1124)
	at org.joda.time.TestTimeOfDay_Properties.testPropertyAddNoWrapMilli(TestTimeOfDay_Properties.java:658)

testWithFieldAdded8(org.joda.time.TestPartial_Basics)  Time elapsed: 0.001 sec  <<< ERROR!
java.lang.ArrayIndexOutOfBoundsException: 2
	at org.joda.time.field.BaseDateTimeField.add(BaseDateTimeField.java:48)
	at org.joda.time.field.BaseDateTimeField.add(BaseDateTimeField.java:55)
	at org.joda.time.Partial.withFieldAdded(Partial.java:576)
	at org.joda.time.TestPartial_Basics.testWithFieldAdded8(TestPartial_Basics.java:626)

testPropertyAddMinute(org.joda.time.TestPartial_Properties)  Time elapsed: 0.001 sec  <<< ERROR!
org.joda.time.IllegalFieldValueException: Value 29 for hourOfDay must be in the range [0,23]
	at org.joda.time.field.FieldUtils.verifyValueBounds(FieldUtils.java:234)
	at org.joda.time.field.BaseDateTimeField.set(BaseDateTimeField.java:94)
	at org.joda.time.field.BaseDateTimeField.add(BaseDateTimeField.java:57)
	at org.joda.time.field.BaseDateTimeField.add(BaseDateTimeField.java:55)
	at org.joda.time.Partial$Property.addToCopy(Partial.java:925)
	at org.joda.time.TestPartial_Properties.testPropertyAddMinute(TestPartial_Properties.java:338)

testPartialDayOfYearAdd(org.joda.time.chrono.TestISOChronology)  Time elapsed: 0.001 sec  <<< ERROR!
java.lang.ArrayIndexOutOfBoundsException

test_add_RP_int_intarray_int(org.joda.time.field.TestBaseDateTimeField)  Time elapsed: 0.001 sec  <<< FAILURE!
junit.framework.AssertionFailedError: expected:<true> but was:<false>
	at junit.framework.Assert.fail(Assert.java:47)
	at junit.framework.Assert.failNotEquals(Assert.java:280)
	at junit.framework.Assert.assertEquals(Assert.java:64)
	at junit.framework.Assert.assertEquals(Assert.java:146)
	at junit.framework.Assert.assertEquals(Assert.java:152)
	at org.joda.time.field.TestBaseDateTimeField.test_add_RP_int_intarray_int(TestBaseDateTimeField.java:201)

test_add_RP_int_intarray_int(org.joda.time.field.TestOffsetDateTimeField)  Time elapsed: 0.001 sec  <<< FAILURE!
junit.framework.AssertionFailedError: expected:<true> but was:<false>
	at junit.framework.Assert.fail(Assert.java:47)
	at junit.framework.Assert.failNotEquals(Assert.java:280)
	at junit.framework.Assert.assertEquals(Assert.java:64)
	at junit.framework.Assert.assertEquals(Assert.java:146)
	at junit.framework.Assert.assertEquals(Assert.java:152)
	at org.joda.time.field.TestOffsetDateTimeField.test_add_RP_int_intarray_int(TestOffsetDateTimeField.java:254)

test_add_RP_int_intarray_int(org.joda.time.field.TestPreciseDurationDateTimeField)  Time elapsed: 0.001 sec  <<< FAILURE!
junit.framework.AssertionFailedError: expected:<true> but was:<false>
	at junit.framework.Assert.fail(Assert.java:47)
	at junit.framework.Assert.failNotEquals(Assert.java:280)
	at junit.framework.Assert.assertEquals(Assert.java:64)
	at junit.framework.Assert.assertEquals(Assert.java:146)
	at junit.framework.Assert.assertEquals(Assert.java:152)
	at org.joda.time.field.TestPreciseDurationDateTimeField.test_add_RP_int_intarray_int(TestPreciseDurationDateTimeField.java:218)

test_add_RP_int_intarray_int(org.joda.time.field.TestPreciseDateTimeField)  Time elapsed: 0.001 sec  <<< FAILURE!
junit.framework.AssertionFailedError: expected:<true> but was:<false>
	at junit.framework.Assert.fail(Assert.java:47)
	at junit.framework.Assert.failNotEquals(Assert.java:280)
	at junit.framework.Assert.assertEquals(Assert.java:64)
	at junit.framework.Assert.assertEquals(Assert.java:146)
	at junit.framework.Assert.assertEquals(Assert.java:152)
	at org.joda.time.field.TestPreciseDateTimeField.test_add_RP_int_intarray_int(TestPreciseDateTimeField.java:247)


Results :

Failed tests: 
  org.joda.time.TestTimeOfDay_Properties#testPropertyAddNoWrapSecond AssertionFailedError
  org.joda.time.field.TestBaseDateTimeField#test_add_RP_int_intarray_int AssertionFailedError
  org.joda.time.field.TestOffsetDateTimeField#test_add_RP_int_intarray_int AssertionFailedError
  org.joda.time.field.TestPreciseDateTimeField#test_add_RP_int_intarray_int AssertionFailedError
  org.joda.time.field.TestPreciseDurationDateTimeField#test_add_RP_int_intarray_int AssertionFailedError
Tests in error: 
  org.joda.time.TestPartial_Basics#testWithFieldAdded8 ArrayIndexOutOfBoundsException
  org.joda.time.TestPartial_Properties#testPropertyAddMinute IllegalFieldValueException
  org.joda.time.TestTimeOfDay_Properties#testPropertyAddNoWrapMilli ArrayIndexOutOfBoundsException
  org.joda.time.TestTimeOfDay_Properties#testPropertyAddNoWrapMinute IllegalFieldValueException
  org.joda.time.chrono.TestISOChronology#testPartialDayOfYearAdd ArrayIndexOutOfBoundsException

Tests run: 4157, Failures: 5, Errors: 5, Skipped: 0

[INFO] ------------------------------------------------------------------------
[INFO] BUILD FAILURE
[INFO] ------------------------------------------------------------------------
[INFO] Total time: 15.571s
[INFO] Finished at: Thu Aug 06 03:56:22 BST 2015
[INFO] Final Memory: 9M/214M
[INFO] ------------------------------------------------------------------------
[ERROR] Failed to execute goal org.apache.maven.plugins:maven-surefire-plugin:2.18.1:test (default-test) on project joda-time: There are test failures.
[ERROR] 
[ERROR] Please refer to /home/perham/Study/LittleDarwin/Cases/joda-time-2.8.1/target/surefire-reports for the individual test results.
[ERROR] -> [Help 1]
[ERROR] 
[ERROR] To see the full stack trace of the errors, re-run Maven with the -e switch.
[ERROR] Re-run Maven using the -X switch to enable full debug logging.
[ERROR] 
[ERROR] For more information about the errors and possible solutions, please read the following articles:
[ERROR] [Help 1] http://cwiki.apache.org/confluence/display/MAVEN/MojoFailureException
