[INFO] Scanning for projects...
[INFO]                                                                         
[INFO] ------------------------------------------------------------------------
[INFO] Building Joda-Time 2.8.1
[INFO] ------------------------------------------------------------------------
[INFO] 
[INFO] --- maven-resources-plugin:2.7:resources (default-resources) @ joda-time ---
[INFO] Using 'UTF-8' encoding to copy filtered resources.
[INFO] Copying 2 resources to META-INF
[INFO] Copying 10 resources
[INFO] 
[INFO] --- maven-compiler-plugin:3.3:compile (default-compile) @ joda-time ---
[INFO] Changes detected - recompiling the module!
[INFO] Compiling 166 source files to /home/perham/Study/LittleDarwin/Cases/joda-time-2.8.1/target/classes
[INFO] 
[INFO] --- exec-maven-plugin:1.4.0:java (compile-tzdb) @ joda-time ---
Writing zoneinfo files
Writing ZoneInfoMap
[INFO] 
[INFO] --- maven-resources-plugin:2.7:testResources (default-testResources) @ joda-time ---
[INFO] Using 'UTF-8' encoding to copy filtered resources.
[INFO] Copying 34 resources
[INFO] 
[INFO] --- maven-compiler-plugin:3.3:testCompile (default-testCompile) @ joda-time ---
[INFO] Nothing to compile - all classes are up to date
[INFO] 
[INFO] --- maven-surefire-plugin:2.18.1:test (default-test) @ joda-time ---
[INFO] Surefire report directory: /home/perham/Study/LittleDarwin/Cases/joda-time-2.8.1/target/surefire-reports

-------------------------------------------------------
 T E S T S
-------------------------------------------------------
Running org.joda.time.TestAllPackages

TestBuddhistChronology.testCalendar

TestCopticChronology.testCalendar

TestEthiopicChronology.testCalendar

TestIslamicChronology.testCalendar

Testing Gregorian chronology over 1000 iterations
100% complete (i=1000)

Testing Julian chronology over 1000 iterations
100% complete (i=1000)
Writing zoneinfo files
Writing ZoneInfoMap
Tests run: 4157, Failures: 0, Errors: 13, Skipped: 0, Time elapsed: 5.258 sec <<< FAILURE! - in org.joda.time.TestAllPackages
testPropertyCompareToHour(org.joda.time.TestTimeOfDay_Properties)  Time elapsed: 0.004 sec  <<< ERROR!
java.lang.IllegalArgumentException: The instant must not be null
	at org.joda.time.field.AbstractPartialFieldProperty.compareTo(AbstractPartialFieldProperty.java:34)
	at org.joda.time.TestTimeOfDay_Properties.testPropertyCompareToHour(TestTimeOfDay_Properties.java:222)

testPropertyCompareToMinute(org.joda.time.TestTimeOfDay_Properties)  Time elapsed: 0 sec  <<< ERROR!
java.lang.IllegalArgumentException: The instant must not be null
	at org.joda.time.field.AbstractPartialFieldProperty.compareTo(AbstractPartialFieldProperty.java:34)
	at org.joda.time.TestTimeOfDay_Properties.testPropertyCompareToMinute(TestTimeOfDay_Properties.java:394)

testPropertyCompareToSecond(org.joda.time.TestTimeOfDay_Properties)  Time elapsed: 0.001 sec  <<< ERROR!
java.lang.IllegalArgumentException: The instant must not be null
	at org.joda.time.field.AbstractPartialFieldProperty.compareTo(AbstractPartialFieldProperty.java:34)
	at org.joda.time.TestTimeOfDay_Properties.testPropertyCompareToSecond(TestTimeOfDay_Properties.java:560)

testPropertyCompareToMilli(org.joda.time.TestTimeOfDay_Properties)  Time elapsed: 0.002 sec  <<< ERROR!
java.lang.IllegalArgumentException: The instant must not be null
	at org.joda.time.field.AbstractPartialFieldProperty.compareTo(AbstractPartialFieldProperty.java:34)
	at org.joda.time.TestTimeOfDay_Properties.testPropertyCompareToMilli(TestTimeOfDay_Properties.java:720)

testPropertyCompareToYear(org.joda.time.TestYearMonthDay_Properties)  Time elapsed: 0.001 sec  <<< ERROR!
java.lang.IllegalArgumentException: The instant must not be null
	at org.joda.time.field.AbstractPartialFieldProperty.compareTo(AbstractPartialFieldProperty.java:34)
	at org.joda.time.TestYearMonthDay_Properties.testPropertyCompareToYear(TestYearMonthDay_Properties.java:185)

testPropertyCompareToMonth(org.joda.time.TestYearMonthDay_Properties)  Time elapsed: 0 sec  <<< ERROR!
java.lang.IllegalArgumentException: The instant must not be null
	at org.joda.time.field.AbstractPartialFieldProperty.compareTo(AbstractPartialFieldProperty.java:34)
	at org.joda.time.TestYearMonthDay_Properties.testPropertyCompareToMonth(TestYearMonthDay_Properties.java:330)

testPropertyCompareToDay(org.joda.time.TestYearMonthDay_Properties)  Time elapsed: 0 sec  <<< ERROR!
java.lang.IllegalArgumentException: The instant must not be null
	at org.joda.time.field.AbstractPartialFieldProperty.compareTo(AbstractPartialFieldProperty.java:34)
	at org.joda.time.TestYearMonthDay_Properties.testPropertyCompareToDay(TestYearMonthDay_Properties.java:486)

testPropertyCompareToYear(org.joda.time.TestYearMonth_Properties)  Time elapsed: 0.001 sec  <<< ERROR!
java.lang.IllegalArgumentException: The instant must not be null
	at org.joda.time.field.AbstractPartialFieldProperty.compareTo(AbstractPartialFieldProperty.java:34)
	at org.joda.time.TestYearMonth_Properties.testPropertyCompareToYear(TestYearMonth_Properties.java:184)

testPropertyCompareToMonth(org.joda.time.TestYearMonth_Properties)  Time elapsed: 0.001 sec  <<< ERROR!
java.lang.IllegalArgumentException: The instant must not be null
	at org.joda.time.field.AbstractPartialFieldProperty.compareTo(AbstractPartialFieldProperty.java:34)
	at org.joda.time.TestYearMonth_Properties.testPropertyCompareToMonth(TestYearMonth_Properties.java:297)

testPropertyCompareToMonthOfYear(org.joda.time.TestMonthDay_Properties)  Time elapsed: 0.001 sec  <<< ERROR!
java.lang.IllegalArgumentException: The instant must not be null
	at org.joda.time.field.AbstractPartialFieldProperty.compareTo(AbstractPartialFieldProperty.java:34)
	at org.joda.time.TestMonthDay_Properties.testPropertyCompareToMonthOfYear(TestMonthDay_Properties.java:166)

testPropertyCompareToDayOfMonth(org.joda.time.TestMonthDay_Properties)  Time elapsed: 0.001 sec  <<< ERROR!
java.lang.IllegalArgumentException: The instant must not be null
	at org.joda.time.field.AbstractPartialFieldProperty.compareTo(AbstractPartialFieldProperty.java:34)
	at org.joda.time.TestMonthDay_Properties.testPropertyCompareToDayOfMonth(TestMonthDay_Properties.java:279)

testPropertyCompareToHour(org.joda.time.TestPartial_Properties)  Time elapsed: 0 sec  <<< ERROR!
java.lang.IllegalArgumentException: The instant must not be null
	at org.joda.time.field.AbstractPartialFieldProperty.compareTo(AbstractPartialFieldProperty.java:34)
	at org.joda.time.TestPartial_Properties.testPropertyCompareToHour(TestPartial_Properties.java:228)

testPropertyCompareToMinute(org.joda.time.TestPartial_Properties)  Time elapsed: 0 sec  <<< ERROR!
java.lang.IllegalArgumentException: The instant must not be null
	at org.joda.time.field.AbstractPartialFieldProperty.compareTo(AbstractPartialFieldProperty.java:34)
	at org.joda.time.TestPartial_Properties.testPropertyCompareToMinute(TestPartial_Properties.java:400)


Results :

Tests in error: 
  org.joda.time.TestMonthDay_Properties#testPropertyCompareToDayOfMonth IllegalArgumentException
  org.joda.time.TestMonthDay_Properties#testPropertyCompareToMonthOfYear IllegalArgumentException
  org.joda.time.TestPartial_Properties#testPropertyCompareToHour IllegalArgumentException
  org.joda.time.TestPartial_Properties#testPropertyCompareToMinute IllegalArgumentException
  org.joda.time.TestTimeOfDay_Properties#testPropertyCompareToHour IllegalArgumentException
  org.joda.time.TestTimeOfDay_Properties#testPropertyCompareToMilli IllegalArgumentException
  org.joda.time.TestTimeOfDay_Properties#testPropertyCompareToMinute IllegalArgumentException
  org.joda.time.TestTimeOfDay_Properties#testPropertyCompareToSecond IllegalArgumentException
  org.joda.time.TestYearMonthDay_Properties#testPropertyCompareToDay IllegalArgumentException
  org.joda.time.TestYearMonthDay_Properties#testPropertyCompareToMonth IllegalArgumentException
  org.joda.time.TestYearMonthDay_Properties#testPropertyCompareToYear IllegalArgumentException
  org.joda.time.TestYearMonth_Properties#testPropertyCompareToMonth IllegalArgumentException
  org.joda.time.TestYearMonth_Properties#testPropertyCompareToYear IllegalArgumentException

Tests run: 4157, Failures: 0, Errors: 13, Skipped: 0

[INFO] ------------------------------------------------------------------------
[INFO] BUILD FAILURE
[INFO] ------------------------------------------------------------------------
[INFO] Total time: 15.503s
[INFO] Finished at: Thu Aug 06 03:42:38 BST 2015
[INFO] Final Memory: 8M/218M
[INFO] ------------------------------------------------------------------------
[ERROR] Failed to execute goal org.apache.maven.plugins:maven-surefire-plugin:2.18.1:test (default-test) on project joda-time: There are test failures.
[ERROR] 
[ERROR] Please refer to /home/perham/Study/LittleDarwin/Cases/joda-time-2.8.1/target/surefire-reports for the individual test results.
[ERROR] -> [Help 1]
[ERROR] 
[ERROR] To see the full stack trace of the errors, re-run Maven with the -e switch.
[ERROR] Re-run Maven using the -X switch to enable full debug logging.
[ERROR] 
[ERROR] For more information about the errors and possible solutions, please read the following articles:
[ERROR] [Help 1] http://cwiki.apache.org/confluence/display/MAVEN/MojoFailureException
