[INFO] Scanning for projects...
[INFO]                                                                         
[INFO] ------------------------------------------------------------------------
[INFO] Building Joda-Time 2.8.1
[INFO] ------------------------------------------------------------------------
[INFO] 
[INFO] --- maven-resources-plugin:2.7:resources (default-resources) @ joda-time ---
[INFO] Using 'UTF-8' encoding to copy filtered resources.
[INFO] Copying 2 resources to META-INF
[INFO] Copying 10 resources
[INFO] 
[INFO] --- maven-compiler-plugin:3.3:compile (default-compile) @ joda-time ---
[INFO] Changes detected - recompiling the module!
[INFO] Compiling 166 source files to /home/perham/Study/LittleDarwin/Cases/joda-time-2.8.1/target/classes
[INFO] 
[INFO] --- exec-maven-plugin:1.4.0:java (compile-tzdb) @ joda-time ---
Writing zoneinfo files
Writing ZoneInfoMap
[INFO] 
[INFO] --- maven-resources-plugin:2.7:testResources (default-testResources) @ joda-time ---
[INFO] Using 'UTF-8' encoding to copy filtered resources.
[INFO] Copying 34 resources
[INFO] 
[INFO] --- maven-compiler-plugin:3.3:testCompile (default-testCompile) @ joda-time ---
[INFO] Nothing to compile - all classes are up to date
[INFO] 
[INFO] --- maven-surefire-plugin:2.18.1:test (default-test) @ joda-time ---
[INFO] Surefire report directory: /home/perham/Study/LittleDarwin/Cases/joda-time-2.8.1/target/surefire-reports

-------------------------------------------------------
 T E S T S
-------------------------------------------------------
Running org.joda.time.TestAllPackages

TestBuddhistChronology.testCalendar

TestCopticChronology.testCalendar

TestEthiopicChronology.testCalendar

TestIslamicChronology.testCalendar

Testing Gregorian chronology over 1000 iterations
100% complete (i=1000)

Testing Julian chronology over 1000 iterations
100% complete (i=1000)
Writing zoneinfo files
Writing ZoneInfoMap
Tests run: 4157, Failures: 0, Errors: 6, Skipped: 0, Time elapsed: 5.323 sec <<< FAILURE! - in org.joda.time.TestAllPackages
testToPeriod_PeriodType(org.joda.time.TestDuration_Basics)  Time elapsed: 0.004 sec  <<< ERROR!
java.lang.ArrayIndexOutOfBoundsException: -1
	at org.joda.time.convert.ReadableDurationConverter.setInto(ReadableDurationConverter.java:22)
	at org.joda.time.base.BasePeriod.<init>(BasePeriod.java:279)
	at org.joda.time.MutablePeriod.<init>(MutablePeriod.java:426)
	at org.joda.time.base.BasePeriod.<init>(BasePeriod.java:281)
	at org.joda.time.Period.<init>(Period.java:691)
	at org.joda.time.TestDuration_Basics.testToPeriod_PeriodType(TestDuration_Basics.java:503)

testToPeriod_Chronology(org.joda.time.TestDuration_Basics)  Time elapsed: 0 sec  <<< ERROR!
java.lang.ArrayIndexOutOfBoundsException: -1
	at org.joda.time.convert.ReadableDurationConverter.setInto(ReadableDurationConverter.java:22)
	at org.joda.time.base.BasePeriod.<init>(BasePeriod.java:279)
	at org.joda.time.MutablePeriod.<init>(MutablePeriod.java:426)
	at org.joda.time.base.BasePeriod.<init>(BasePeriod.java:281)
	at org.joda.time.Period.<init>(Period.java:708)
	at org.joda.time.TestDuration_Basics.testToPeriod_Chronology(TestDuration_Basics.java:516)

testToPeriod_PeriodType_Chronology(org.joda.time.TestDuration_Basics)  Time elapsed: 0.001 sec  <<< ERROR!
java.lang.ArrayIndexOutOfBoundsException: -1
	at org.joda.time.convert.ReadableDurationConverter.setInto(ReadableDurationConverter.java:22)
	at org.joda.time.base.BasePeriod.<init>(BasePeriod.java:279)
	at org.joda.time.MutablePeriod.<init>(MutablePeriod.java:426)
	at org.joda.time.base.BasePeriod.<init>(BasePeriod.java:281)
	at org.joda.time.Period.<init>(Period.java:726)
	at org.joda.time.TestDuration_Basics.testToPeriod_PeriodType_Chronology(TestDuration_Basics.java:529)

testConstructor_Object_Chronology1(org.joda.time.TestMutablePeriod_Constructors)  Time elapsed: 0 sec  <<< ERROR!
java.lang.ArrayIndexOutOfBoundsException: -1
	at org.joda.time.convert.ReadableDurationConverter.setInto(ReadableDurationConverter.java:22)
	at org.joda.time.base.BasePeriod.<init>(BasePeriod.java:279)
	at org.joda.time.MutablePeriod.<init>(MutablePeriod.java:408)
	at org.joda.time.TestMutablePeriod_Constructors.testConstructor_Object_Chronology1(TestMutablePeriod_Constructors.java:942)

testConstructor_Object_Chronology2(org.joda.time.TestMutablePeriod_Constructors)  Time elapsed: 0 sec  <<< ERROR!
java.lang.ArrayIndexOutOfBoundsException: -1
	at org.joda.time.convert.ReadableDurationConverter.setInto(ReadableDurationConverter.java:22)
	at org.joda.time.base.BasePeriod.<init>(BasePeriod.java:279)
	at org.joda.time.MutablePeriod.<init>(MutablePeriod.java:408)
	at org.joda.time.TestMutablePeriod_Constructors.testConstructor_Object_Chronology2(TestMutablePeriod_Constructors.java:960)

testSetInto_Object(org.joda.time.convert.TestReadableDurationConverter)  Time elapsed: 0.001 sec  <<< ERROR!
java.lang.ArrayIndexOutOfBoundsException: -1
	at org.joda.time.convert.ReadableDurationConverter.setInto(ReadableDurationConverter.java:22)
	at org.joda.time.convert.TestReadableDurationConverter.testSetInto_Object(TestReadableDurationConverter.java:112)


Results :

Tests in error: 
  org.joda.time.TestDuration_Basics#testToPeriod_Chronology ArrayIndexOutOfBoundsException
  org.joda.time.TestDuration_Basics#testToPeriod_PeriodType ArrayIndexOutOfBoundsException
  org.joda.time.TestDuration_Basics#testToPeriod_PeriodType_Chronology ArrayIndexOutOfBoundsException
  org.joda.time.TestMutablePeriod_Constructors#testConstructor_Object_Chronology1 ArrayIndexOutOfBoundsException
  org.joda.time.TestMutablePeriod_Constructors#testConstructor_Object_Chronology2 ArrayIndexOutOfBoundsException
  org.joda.time.convert.TestReadableDurationConverter#testSetInto_Object ArrayIndexOutOfBoundsException

Tests run: 4157, Failures: 0, Errors: 6, Skipped: 0

[INFO] ------------------------------------------------------------------------
[INFO] BUILD FAILURE
[INFO] ------------------------------------------------------------------------
[INFO] Total time: 15.049s
[INFO] Finished at: Thu Aug 06 03:18:06 BST 2015
[INFO] Final Memory: 9M/213M
[INFO] ------------------------------------------------------------------------
[ERROR] Failed to execute goal org.apache.maven.plugins:maven-surefire-plugin:2.18.1:test (default-test) on project joda-time: There are test failures.
[ERROR] 
[ERROR] Please refer to /home/perham/Study/LittleDarwin/Cases/joda-time-2.8.1/target/surefire-reports for the individual test results.
[ERROR] -> [Help 1]
[ERROR] 
[ERROR] To see the full stack trace of the errors, re-run Maven with the -e switch.
[ERROR] Re-run Maven using the -X switch to enable full debug logging.
[ERROR] 
[ERROR] For more information about the errors and possible solutions, please read the following articles:
[ERROR] [Help 1] http://cwiki.apache.org/confluence/display/MAVEN/MojoFailureException
