[INFO] Scanning for projects...
[INFO]                                                                         
[INFO] ------------------------------------------------------------------------
[INFO] Building Joda-Time 2.8.1
[INFO] ------------------------------------------------------------------------
[INFO] 
[INFO] --- maven-resources-plugin:2.7:resources (default-resources) @ joda-time ---
[INFO] Using 'UTF-8' encoding to copy filtered resources.
[INFO] Copying 2 resources to META-INF
[INFO] Copying 10 resources
[INFO] 
[INFO] --- maven-compiler-plugin:3.3:compile (default-compile) @ joda-time ---
[INFO] Changes detected - recompiling the module!
[INFO] Compiling 166 source files to /home/perham/Study/LittleDarwin/Cases/joda-time-2.8.1/target/classes
[INFO] 
[INFO] --- exec-maven-plugin:1.4.0:java (compile-tzdb) @ joda-time ---
Writing zoneinfo files
Writing ZoneInfoMap
[INFO] 
[INFO] --- maven-resources-plugin:2.7:testResources (default-testResources) @ joda-time ---
[INFO] Using 'UTF-8' encoding to copy filtered resources.
[INFO] Copying 34 resources
[INFO] 
[INFO] --- maven-compiler-plugin:3.3:testCompile (default-testCompile) @ joda-time ---
[INFO] Nothing to compile - all classes are up to date
[INFO] 
[INFO] --- maven-surefire-plugin:2.18.1:test (default-test) @ joda-time ---
[INFO] Surefire report directory: /home/perham/Study/LittleDarwin/Cases/joda-time-2.8.1/target/surefire-reports

-------------------------------------------------------
 T E S T S
-------------------------------------------------------
Running org.joda.time.TestAllPackages

TestBuddhistChronology.testCalendar

TestCopticChronology.testCalendar

TestEthiopicChronology.testCalendar

TestIslamicChronology.testCalendar

Testing Gregorian chronology over 1000 iterations
100% complete (i=1000)

Testing Julian chronology over 1000 iterations
100% complete (i=1000)
Writing zoneinfo files
Writing ZoneInfoMap
Tests run: 4157, Failures: 0, Errors: 21, Skipped: 0, Time elapsed: 5.241 sec <<< FAILURE! - in org.joda.time.TestAllPackages
testConstructor_invalidObject(org.joda.time.TestInstant_Constructors)  Time elapsed: 0.004 sec  <<< ERROR!
java.lang.IllegalStateException: Unable to find best converter for type "java.lang.Object" from remaining set: 
	at org.joda.time.convert.ConverterSet.selectSlow(ConverterSet.java:112)
	at org.joda.time.convert.ConverterSet.select(ConverterSet.java:19)
	at org.joda.time.convert.ConverterManager.getInstantConverter(ConverterManager.java:160)
	at org.joda.time.Instant.<init>(Instant.java:133)
	at org.joda.time.TestInstant_Constructors.testConstructor_invalidObject(TestInstant_Constructors.java:154)

testConstructor_invalidObject_DateTimeZone(org.joda.time.TestDateTime_Constructors)  Time elapsed: 0.001 sec  <<< ERROR!
java.lang.IllegalStateException: Unable to find best converter for type "java.lang.Object" from remaining set: 
	at org.joda.time.convert.ConverterSet.selectSlow(ConverterSet.java:112)
	at org.joda.time.convert.ConverterSet.select(ConverterSet.java:19)
	at org.joda.time.convert.ConverterManager.getInstantConverter(ConverterManager.java:160)
	at org.joda.time.base.BaseDateTime.<init>(BaseDateTime.java:151)
	at org.joda.time.DateTime.<init>(DateTime.java:281)
	at org.joda.time.TestDateTime_Constructors.testConstructor_invalidObject_DateTimeZone(TestDateTime_Constructors.java:492)

testConstructor_invalidObject(org.joda.time.TestDateTime_Constructors)  Time elapsed: 0 sec  <<< ERROR!
java.lang.IllegalStateException: Unable to find best converter for type "java.lang.Object" from remaining set: 
	at org.joda.time.convert.ConverterSet.selectSlow(ConverterSet.java:112)
	at org.joda.time.convert.ConverterSet.select(ConverterSet.java:19)
	at org.joda.time.convert.ConverterManager.getInstantConverter(ConverterManager.java:160)
	at org.joda.time.base.BaseDateTime.<init>(BaseDateTime.java:173)
	at org.joda.time.DateTime.<init>(DateTime.java:257)
	at org.joda.time.TestDateTime_Constructors.testConstructor_invalidObject(TestDateTime_Constructors.java:346)

testConstructor_invalidObject_Chronology(org.joda.time.TestDateTime_Constructors)  Time elapsed: 0 sec  <<< ERROR!
java.lang.IllegalStateException: Unable to find best converter for type "java.lang.Object" from remaining set: 
	at org.joda.time.convert.ConverterSet.selectSlow(ConverterSet.java:112)
	at org.joda.time.convert.ConverterSet.select(ConverterSet.java:19)
	at org.joda.time.convert.ConverterManager.getInstantConverter(ConverterManager.java:160)
	at org.joda.time.base.BaseDateTime.<init>(BaseDateTime.java:173)
	at org.joda.time.DateTime.<init>(DateTime.java:302)
	at org.joda.time.TestDateTime_Constructors.testConstructor_invalidObject_Chronology(TestDateTime_Constructors.java:554)

testConstructor_invalidObject_DateTimeZone(org.joda.time.TestMutableDateTime_Constructors)  Time elapsed: 0 sec  <<< ERROR!
java.lang.IllegalStateException: Unable to find best converter for type "java.lang.Object" from remaining set: 
	at org.joda.time.convert.ConverterSet.selectSlow(ConverterSet.java:112)
	at org.joda.time.convert.ConverterSet.select(ConverterSet.java:19)
	at org.joda.time.convert.ConverterManager.getInstantConverter(ConverterManager.java:160)
	at org.joda.time.base.BaseDateTime.<init>(BaseDateTime.java:151)
	at org.joda.time.MutableDateTime.<init>(MutableDateTime.java:279)
	at org.joda.time.TestMutableDateTime_Constructors.testConstructor_invalidObject_DateTimeZone(TestMutableDateTime_Constructors.java:344)

testConstructor_invalidObject(org.joda.time.TestMutableDateTime_Constructors)  Time elapsed: 0.001 sec  <<< ERROR!
java.lang.IllegalStateException: Unable to find best converter for type "java.lang.Object" from remaining set: 
	at org.joda.time.convert.ConverterSet.selectSlow(ConverterSet.java:112)
	at org.joda.time.convert.ConverterSet.select(ConverterSet.java:19)
	at org.joda.time.convert.ConverterManager.getInstantConverter(ConverterManager.java:160)
	at org.joda.time.base.BaseDateTime.<init>(BaseDateTime.java:173)
	at org.joda.time.MutableDateTime.<init>(MutableDateTime.java:256)
	at org.joda.time.TestMutableDateTime_Constructors.testConstructor_invalidObject(TestMutableDateTime_Constructors.java:301)

testConstructor_invalidObject_Chronology(org.joda.time.TestMutableDateTime_Constructors)  Time elapsed: 0.001 sec  <<< ERROR!
java.lang.IllegalStateException: Unable to find best converter for type "java.lang.Object" from remaining set: 
	at org.joda.time.convert.ConverterSet.selectSlow(ConverterSet.java:112)
	at org.joda.time.convert.ConverterSet.select(ConverterSet.java:19)
	at org.joda.time.convert.ConverterManager.getInstantConverter(ConverterManager.java:160)
	at org.joda.time.base.BaseDateTime.<init>(BaseDateTime.java:173)
	at org.joda.time.MutableDateTime.<init>(MutableDateTime.java:299)
	at org.joda.time.TestMutableDateTime_Constructors.testConstructor_invalidObject_Chronology(TestMutableDateTime_Constructors.java:406)

testConstructor_invalidObject_DateTimeZone(org.joda.time.TestDateMidnight_Constructors)  Time elapsed: 0 sec  <<< ERROR!
java.lang.IllegalStateException: Unable to find best converter for type "java.lang.Object" from remaining set: 
	at org.joda.time.convert.ConverterSet.selectSlow(ConverterSet.java:112)
	at org.joda.time.convert.ConverterSet.select(ConverterSet.java:19)
	at org.joda.time.convert.ConverterManager.getInstantConverter(ConverterManager.java:160)
	at org.joda.time.base.BaseDateTime.<init>(BaseDateTime.java:151)
	at org.joda.time.DateMidnight.<init>(DateMidnight.java:281)
	at org.joda.time.TestDateMidnight_Constructors.testConstructor_invalidObject_DateTimeZone(TestDateMidnight_Constructors.java:363)

testConstructor_invalidObject(org.joda.time.TestDateMidnight_Constructors)  Time elapsed: 0 sec  <<< ERROR!
java.lang.IllegalStateException: Unable to find best converter for type "java.lang.Object" from remaining set: 
	at org.joda.time.convert.ConverterSet.selectSlow(ConverterSet.java:112)
	at org.joda.time.convert.ConverterSet.select(ConverterSet.java:19)
	at org.joda.time.convert.ConverterManager.getInstantConverter(ConverterManager.java:160)
	at org.joda.time.base.BaseDateTime.<init>(BaseDateTime.java:173)
	at org.joda.time.DateMidnight.<init>(DateMidnight.java:256)
	at org.joda.time.TestDateMidnight_Constructors.testConstructor_invalidObject(TestDateMidnight_Constructors.java:320)

testConstructor_invalidObject_Chronology(org.joda.time.TestDateMidnight_Constructors)  Time elapsed: 0 sec  <<< ERROR!
java.lang.IllegalStateException: Unable to find best converter for type "java.lang.Object" from remaining set: 
	at org.joda.time.convert.ConverterSet.selectSlow(ConverterSet.java:112)
	at org.joda.time.convert.ConverterSet.select(ConverterSet.java:19)
	at org.joda.time.convert.ConverterManager.getInstantConverter(ConverterManager.java:160)
	at org.joda.time.base.BaseDateTime.<init>(BaseDateTime.java:173)
	at org.joda.time.DateMidnight.<init>(DateMidnight.java:303)
	at org.joda.time.TestDateMidnight_Constructors.testConstructor_invalidObject_Chronology(TestDateMidnight_Constructors.java:425)

testGetPeriodConverter(org.joda.time.convert.TestConverterManager)  Time elapsed: 0 sec  <<< ERROR!
java.lang.IllegalStateException: Unable to find best converter for type "java.lang.Boolean" from remaining set: 
	at org.joda.time.convert.ConverterSet.selectSlow(ConverterSet.java:112)
	at org.joda.time.convert.ConverterSet.select(ConverterSet.java:19)
	at org.joda.time.convert.ConverterManager.getPeriodConverter(ConverterManager.java:421)
	at org.joda.time.convert.TestConverterManager.testGetPeriodConverter(TestConverterManager.java:708)

testGetPeriodConverterRemovedNull(org.joda.time.convert.TestConverterManager)  Time elapsed: 0 sec  <<< ERROR!
java.lang.NullPointerException
	at org.joda.time.convert.ConverterSet.selectSlow(ConverterSet.java:102)
	at org.joda.time.convert.ConverterSet.select(ConverterSet.java:19)
	at org.joda.time.convert.ConverterManager.getPeriodConverter(ConverterManager.java:421)
	at org.joda.time.convert.TestConverterManager.testGetPeriodConverterRemovedNull(TestConverterManager.java:717)

testGetIntervalConverter(org.joda.time.convert.TestConverterManager)  Time elapsed: 0 sec  <<< ERROR!
java.lang.IllegalStateException: Unable to find best converter for type "java.lang.Boolean" from remaining set: 
	at org.joda.time.convert.ConverterSet.selectSlow(ConverterSet.java:112)
	at org.joda.time.convert.ConverterSet.select(ConverterSet.java:19)
	at org.joda.time.convert.ConverterManager.getIntervalConverter(ConverterManager.java:508)
	at org.joda.time.convert.TestConverterManager.testGetIntervalConverter(TestConverterManager.java:853)

testGetIntervalConverterRemovedNull(org.joda.time.convert.TestConverterManager)  Time elapsed: 0.001 sec  <<< ERROR!
java.lang.NullPointerException
	at org.joda.time.convert.ConverterSet.selectSlow(ConverterSet.java:102)
	at org.joda.time.convert.ConverterSet.select(ConverterSet.java:19)
	at org.joda.time.convert.ConverterManager.getIntervalConverter(ConverterManager.java:508)
	at org.joda.time.convert.TestConverterManager.testGetIntervalConverterRemovedNull(TestConverterManager.java:866)

testGetInstantConverterRemovedNull(org.joda.time.convert.TestConverterManager)  Time elapsed: 0 sec  <<< ERROR!
java.lang.NullPointerException
	at org.joda.time.convert.ConverterSet.selectSlow(ConverterSet.java:102)
	at org.joda.time.convert.ConverterSet.select(ConverterSet.java:19)
	at org.joda.time.convert.ConverterManager.getInstantConverter(ConverterManager.java:160)
	at org.joda.time.convert.TestConverterManager.testGetInstantConverterRemovedNull(TestConverterManager.java:160)

testGetDurationConverter(org.joda.time.convert.TestConverterManager)  Time elapsed: 0.001 sec  <<< ERROR!
java.lang.IllegalStateException: Unable to find best converter for type "java.lang.Boolean" from remaining set: 
	at org.joda.time.convert.ConverterSet.selectSlow(ConverterSet.java:112)
	at org.joda.time.convert.ConverterSet.select(ConverterSet.java:19)
	at org.joda.time.convert.ConverterManager.getDurationConverter(ConverterManager.java:334)
	at org.joda.time.convert.TestConverterManager.testGetDurationConverter(TestConverterManager.java:560)

testGetDurationConverterRemovedNull(org.joda.time.convert.TestConverterManager)  Time elapsed: 0 sec  <<< ERROR!
java.lang.NullPointerException
	at org.joda.time.convert.ConverterSet.selectSlow(ConverterSet.java:102)
	at org.joda.time.convert.ConverterSet.select(ConverterSet.java:19)
	at org.joda.time.convert.ConverterManager.getDurationConverter(ConverterManager.java:334)
	at org.joda.time.convert.TestConverterManager.testGetDurationConverterRemovedNull(TestConverterManager.java:569)

testGetPartialConverter(org.joda.time.convert.TestConverterManager)  Time elapsed: 0 sec  <<< ERROR!
java.lang.IllegalStateException: Unable to find best converter for type "java.lang.Boolean" from remaining set: 
	at org.joda.time.convert.ConverterSet.selectSlow(ConverterSet.java:112)
	at org.joda.time.convert.ConverterSet.select(ConverterSet.java:19)
	at org.joda.time.convert.ConverterManager.getPartialConverter(ConverterManager.java:247)
	at org.joda.time.convert.TestConverterManager.testGetPartialConverter(TestConverterManager.java:356)

testGetPartialConverterRemovedNull(org.joda.time.convert.TestConverterManager)  Time elapsed: 0 sec  <<< ERROR!
java.lang.NullPointerException
	at org.joda.time.convert.ConverterSet.selectSlow(ConverterSet.java:102)
	at org.joda.time.convert.ConverterSet.select(ConverterSet.java:19)
	at org.joda.time.convert.ConverterManager.getPartialConverter(ConverterManager.java:247)
	at org.joda.time.convert.TestConverterManager.testGetPartialConverterRemovedNull(TestConverterManager.java:365)

testGetInstantConverter(org.joda.time.convert.TestConverterManager)  Time elapsed: 0.001 sec  <<< ERROR!
java.lang.IllegalStateException: Unable to find best converter for type "java.lang.Boolean" from remaining set: 
	at org.joda.time.convert.ConverterSet.selectSlow(ConverterSet.java:112)
	at org.joda.time.convert.ConverterSet.select(ConverterSet.java:19)
	at org.joda.time.convert.ConverterManager.getInstantConverter(ConverterManager.java:160)
	at org.joda.time.convert.TestConverterManager.testGetInstantConverter(TestConverterManager.java:151)

testBigHashtable(org.joda.time.convert.TestConverterSet)  Time elapsed: 0 sec  <<< ERROR!
java.lang.IllegalStateException: Unable to find best converter for type "java.lang.Integer" from remaining set: 
	at org.joda.time.convert.ConverterSet.selectSlow(ConverterSet.java:112)
	at org.joda.time.convert.ConverterSet.select(ConverterSet.java:19)
	at org.joda.time.convert.TestConverterSet.testBigHashtable(TestConverterSet.java:96)


Results :

Tests in error: 
  org.joda.time.TestDateMidnight_Constructors#testConstructor_invalidObject IllegalStateException
  org.joda.time.TestDateMidnight_Constructors#testConstructor_invalidObject_Chronology IllegalStateException
  org.joda.time.TestDateMidnight_Constructors#testConstructor_invalidObject_DateTimeZone IllegalStateException
  org.joda.time.TestDateTime_Constructors#testConstructor_invalidObject IllegalStateException
  org.joda.time.TestDateTime_Constructors#testConstructor_invalidObject_Chronology IllegalStateException
  org.joda.time.TestDateTime_Constructors#testConstructor_invalidObject_DateTimeZone IllegalStateException
  org.joda.time.TestInstant_Constructors#testConstructor_invalidObject IllegalStateException
  org.joda.time.TestMutableDateTime_Constructors#testConstructor_invalidObject IllegalStateException
  org.joda.time.TestMutableDateTime_Constructors#testConstructor_invalidObject_Chronology IllegalStateException
  org.joda.time.TestMutableDateTime_Constructors#testConstructor_invalidObject_DateTimeZone IllegalStateException
  org.joda.time.convert.TestConverterManager#testGetDurationConverter IllegalStateException
  org.joda.time.convert.TestConverterManager#testGetDurationConverterRemovedNull NullPointerException
  org.joda.time.convert.TestConverterManager#testGetInstantConverter IllegalStateException
  org.joda.time.convert.TestConverterManager#testGetInstantConverterRemovedNull NullPointerException
  org.joda.time.convert.TestConverterManager#testGetIntervalConverter IllegalStateException
  org.joda.time.convert.TestConverterManager#testGetIntervalConverterRemovedNull NullPointerException
  org.joda.time.convert.TestConverterManager#testGetPartialConverter IllegalStateException
  org.joda.time.convert.TestConverterManager#testGetPartialConverterRemovedNull NullPointerException
  org.joda.time.convert.TestConverterManager#testGetPeriodConverter IllegalStateException
  org.joda.time.convert.TestConverterManager#testGetPeriodConverterRemovedNull NullPointerException
  org.joda.time.convert.TestConverterSet#testBigHashtable IllegalStateException ...

Tests run: 4157, Failures: 0, Errors: 21, Skipped: 0

[INFO] ------------------------------------------------------------------------
[INFO] BUILD FAILURE
[INFO] ------------------------------------------------------------------------
[INFO] Total time: 15.663s
[INFO] Finished at: Thu Aug 06 03:16:57 BST 2015
[INFO] Final Memory: 8M/217M
[INFO] ------------------------------------------------------------------------
[ERROR] Failed to execute goal org.apache.maven.plugins:maven-surefire-plugin:2.18.1:test (default-test) on project joda-time: There are test failures.
[ERROR] 
[ERROR] Please refer to /home/perham/Study/LittleDarwin/Cases/joda-time-2.8.1/target/surefire-reports for the individual test results.
[ERROR] -> [Help 1]
[ERROR] 
[ERROR] To see the full stack trace of the errors, re-run Maven with the -e switch.
[ERROR] Re-run Maven using the -X switch to enable full debug logging.
[ERROR] 
[ERROR] For more information about the errors and possible solutions, please read the following articles:
[ERROR] [Help 1] http://cwiki.apache.org/confluence/display/MAVEN/MojoFailureException
