[INFO] Scanning for projects...
[INFO]                                                                         
[INFO] ------------------------------------------------------------------------
[INFO] Building Joda-Time 2.8.1
[INFO] ------------------------------------------------------------------------
[INFO] 
[INFO] --- maven-resources-plugin:2.7:resources (default-resources) @ joda-time ---
[INFO] Using 'UTF-8' encoding to copy filtered resources.
[INFO] Copying 2 resources to META-INF
[INFO] Copying 10 resources
[INFO] 
[INFO] --- maven-compiler-plugin:3.3:compile (default-compile) @ joda-time ---
[INFO] Changes detected - recompiling the module!
[INFO] Compiling 166 source files to /home/perham/Study/LittleDarwin/Cases/joda-time-2.8.1/target/classes
[INFO] 
[INFO] --- exec-maven-plugin:1.4.0:java (compile-tzdb) @ joda-time ---
Writing zoneinfo files
Writing ZoneInfoMap
[INFO] 
[INFO] --- maven-resources-plugin:2.7:testResources (default-testResources) @ joda-time ---
[INFO] Using 'UTF-8' encoding to copy filtered resources.
[INFO] Copying 34 resources
[INFO] 
[INFO] --- maven-compiler-plugin:3.3:testCompile (default-testCompile) @ joda-time ---
[INFO] Nothing to compile - all classes are up to date
[INFO] 
[INFO] --- maven-surefire-plugin:2.18.1:test (default-test) @ joda-time ---
[INFO] Surefire report directory: /home/perham/Study/LittleDarwin/Cases/joda-time-2.8.1/target/surefire-reports

-------------------------------------------------------
 T E S T S
-------------------------------------------------------
Running org.joda.time.TestAllPackages

TestBuddhistChronology.testCalendar

TestCopticChronology.testCalendar

TestEthiopicChronology.testCalendar

TestIslamicChronology.testCalendar

Testing Gregorian chronology over 1000 iterations
100% complete (i=1000)

Testing Julian chronology over 1000 iterations
100% complete (i=1000)
Writing zoneinfo files
Writing ZoneInfoMap
Tests run: 4157, Failures: 0, Errors: 60, Skipped: 0, Time elapsed: 5.204 sec <<< FAILURE! - in org.joda.time.TestAllPackages
testConstructor_nullObject(org.joda.time.TestInstant_Constructors)  Time elapsed: 0.004 sec  <<< ERROR!
java.lang.NullPointerException
	at org.joda.time.convert.ConverterSet.select(ConverterSet.java:15)
	at org.joda.time.convert.ConverterManager.getInstantConverter(ConverterManager.java:160)
	at org.joda.time.Instant.<init>(Instant.java:133)
	at org.joda.time.TestInstant_Constructors.testConstructor_nullObject(TestInstant_Constructors.java:163)

testConstructor_nullObject_DateTimeZone(org.joda.time.TestDateTime_Constructors)  Time elapsed: 0.001 sec  <<< ERROR!
java.lang.NullPointerException
	at org.joda.time.convert.ConverterSet.select(ConverterSet.java:15)
	at org.joda.time.convert.ConverterManager.getInstantConverter(ConverterManager.java:160)
	at org.joda.time.base.BaseDateTime.<init>(BaseDateTime.java:151)
	at org.joda.time.DateTime.<init>(DateTime.java:281)
	at org.joda.time.TestDateTime_Constructors.testConstructor_nullObject_DateTimeZone(TestDateTime_Constructors.java:501)

testConstructor_nullObject_nullDateTimeZone(org.joda.time.TestDateTime_Constructors)  Time elapsed: 0.002 sec  <<< ERROR!
java.lang.NullPointerException
	at org.joda.time.convert.ConverterSet.select(ConverterSet.java:15)
	at org.joda.time.convert.ConverterManager.getInstantConverter(ConverterManager.java:160)
	at org.joda.time.base.BaseDateTime.<init>(BaseDateTime.java:151)
	at org.joda.time.DateTime.<init>(DateTime.java:281)
	at org.joda.time.TestDateTime_Constructors.testConstructor_nullObject_nullDateTimeZone(TestDateTime_Constructors.java:520)

testConstructor_nullObject(org.joda.time.TestDateTime_Constructors)  Time elapsed: 0 sec  <<< ERROR!
java.lang.NullPointerException
	at org.joda.time.convert.ConverterSet.select(ConverterSet.java:15)
	at org.joda.time.convert.ConverterManager.getInstantConverter(ConverterManager.java:160)
	at org.joda.time.base.BaseDateTime.<init>(BaseDateTime.java:173)
	at org.joda.time.DateTime.<init>(DateTime.java:257)
	at org.joda.time.TestDateTime_Constructors.testConstructor_nullObject(TestDateTime_Constructors.java:355)

testConstructor_nullObject_Chronology(org.joda.time.TestDateTime_Constructors)  Time elapsed: 0 sec  <<< ERROR!
java.lang.NullPointerException
	at org.joda.time.convert.ConverterSet.select(ConverterSet.java:15)
	at org.joda.time.convert.ConverterManager.getInstantConverter(ConverterManager.java:160)
	at org.joda.time.base.BaseDateTime.<init>(BaseDateTime.java:173)
	at org.joda.time.DateTime.<init>(DateTime.java:302)
	at org.joda.time.TestDateTime_Constructors.testConstructor_nullObject_Chronology(TestDateTime_Constructors.java:563)

testConstructor_nullObject_nullChronology(org.joda.time.TestDateTime_Constructors)  Time elapsed: 0 sec  <<< ERROR!
java.lang.NullPointerException
	at org.joda.time.convert.ConverterSet.select(ConverterSet.java:15)
	at org.joda.time.convert.ConverterManager.getInstantConverter(ConverterManager.java:160)
	at org.joda.time.base.BaseDateTime.<init>(BaseDateTime.java:173)
	at org.joda.time.DateTime.<init>(DateTime.java:302)
	at org.joda.time.TestDateTime_Constructors.testConstructor_nullObject_nullChronology(TestDateTime_Constructors.java:582)

testConstructor_nullObject_DateTimeZone(org.joda.time.TestMutableDateTime_Constructors)  Time elapsed: 0.001 sec  <<< ERROR!
java.lang.NullPointerException
	at org.joda.time.convert.ConverterSet.select(ConverterSet.java:15)
	at org.joda.time.convert.ConverterManager.getInstantConverter(ConverterManager.java:160)
	at org.joda.time.base.BaseDateTime.<init>(BaseDateTime.java:151)
	at org.joda.time.MutableDateTime.<init>(MutableDateTime.java:279)
	at org.joda.time.TestMutableDateTime_Constructors.testConstructor_nullObject_DateTimeZone(TestMutableDateTime_Constructors.java:353)

testConstructor_nullObject_nullDateTimeZone(org.joda.time.TestMutableDateTime_Constructors)  Time elapsed: 0 sec  <<< ERROR!
java.lang.NullPointerException
	at org.joda.time.convert.ConverterSet.select(ConverterSet.java:15)
	at org.joda.time.convert.ConverterManager.getInstantConverter(ConverterManager.java:160)
	at org.joda.time.base.BaseDateTime.<init>(BaseDateTime.java:151)
	at org.joda.time.MutableDateTime.<init>(MutableDateTime.java:279)
	at org.joda.time.TestMutableDateTime_Constructors.testConstructor_nullObject_nullDateTimeZone(TestMutableDateTime_Constructors.java:372)

testConstructor_nullObject(org.joda.time.TestMutableDateTime_Constructors)  Time elapsed: 0.001 sec  <<< ERROR!
java.lang.NullPointerException
	at org.joda.time.convert.ConverterSet.select(ConverterSet.java:15)
	at org.joda.time.convert.ConverterManager.getInstantConverter(ConverterManager.java:160)
	at org.joda.time.base.BaseDateTime.<init>(BaseDateTime.java:173)
	at org.joda.time.MutableDateTime.<init>(MutableDateTime.java:256)
	at org.joda.time.TestMutableDateTime_Constructors.testConstructor_nullObject(TestMutableDateTime_Constructors.java:310)

testConstructor_nullObject_Chronology(org.joda.time.TestMutableDateTime_Constructors)  Time elapsed: 0.001 sec  <<< ERROR!
java.lang.NullPointerException
	at org.joda.time.convert.ConverterSet.select(ConverterSet.java:15)
	at org.joda.time.convert.ConverterManager.getInstantConverter(ConverterManager.java:160)
	at org.joda.time.base.BaseDateTime.<init>(BaseDateTime.java:173)
	at org.joda.time.MutableDateTime.<init>(MutableDateTime.java:299)
	at org.joda.time.TestMutableDateTime_Constructors.testConstructor_nullObject_Chronology(TestMutableDateTime_Constructors.java:415)

testConstructor_nullObject_nullChronology(org.joda.time.TestMutableDateTime_Constructors)  Time elapsed: 0 sec  <<< ERROR!
java.lang.NullPointerException
	at org.joda.time.convert.ConverterSet.select(ConverterSet.java:15)
	at org.joda.time.convert.ConverterManager.getInstantConverter(ConverterManager.java:160)
	at org.joda.time.base.BaseDateTime.<init>(BaseDateTime.java:173)
	at org.joda.time.MutableDateTime.<init>(MutableDateTime.java:299)
	at org.joda.time.TestMutableDateTime_Constructors.testConstructor_nullObject_nullChronology(TestMutableDateTime_Constructors.java:434)

testConstructor_nullObject_DateTimeZone(org.joda.time.TestDateMidnight_Constructors)  Time elapsed: 0 sec  <<< ERROR!
java.lang.NullPointerException
	at org.joda.time.convert.ConverterSet.select(ConverterSet.java:15)
	at org.joda.time.convert.ConverterManager.getInstantConverter(ConverterManager.java:160)
	at org.joda.time.base.BaseDateTime.<init>(BaseDateTime.java:151)
	at org.joda.time.DateMidnight.<init>(DateMidnight.java:281)
	at org.joda.time.TestDateMidnight_Constructors.testConstructor_nullObject_DateTimeZone(TestDateMidnight_Constructors.java:372)

testConstructor_nullObject_nullDateTimeZone(org.joda.time.TestDateMidnight_Constructors)  Time elapsed: 0 sec  <<< ERROR!
java.lang.NullPointerException
	at org.joda.time.convert.ConverterSet.select(ConverterSet.java:15)
	at org.joda.time.convert.ConverterManager.getInstantConverter(ConverterManager.java:160)
	at org.joda.time.base.BaseDateTime.<init>(BaseDateTime.java:151)
	at org.joda.time.DateMidnight.<init>(DateMidnight.java:281)
	at org.joda.time.TestDateMidnight_Constructors.testConstructor_nullObject_nullDateTimeZone(TestDateMidnight_Constructors.java:391)

testConstructor_nullObject(org.joda.time.TestDateMidnight_Constructors)  Time elapsed: 0 sec  <<< ERROR!
java.lang.NullPointerException
	at org.joda.time.convert.ConverterSet.select(ConverterSet.java:15)
	at org.joda.time.convert.ConverterManager.getInstantConverter(ConverterManager.java:160)
	at org.joda.time.base.BaseDateTime.<init>(BaseDateTime.java:173)
	at org.joda.time.DateMidnight.<init>(DateMidnight.java:256)
	at org.joda.time.TestDateMidnight_Constructors.testConstructor_nullObject(TestDateMidnight_Constructors.java:329)

testConstructor_nullObject_Chronology(org.joda.time.TestDateMidnight_Constructors)  Time elapsed: 0 sec  <<< ERROR!
java.lang.NullPointerException
	at org.joda.time.convert.ConverterSet.select(ConverterSet.java:15)
	at org.joda.time.convert.ConverterManager.getInstantConverter(ConverterManager.java:160)
	at org.joda.time.base.BaseDateTime.<init>(BaseDateTime.java:173)
	at org.joda.time.DateMidnight.<init>(DateMidnight.java:303)
	at org.joda.time.TestDateMidnight_Constructors.testConstructor_nullObject_Chronology(TestDateMidnight_Constructors.java:434)

testConstructor_nullObject_nullChronology(org.joda.time.TestDateMidnight_Constructors)  Time elapsed: 0.001 sec  <<< ERROR!
java.lang.NullPointerException
	at org.joda.time.convert.ConverterSet.select(ConverterSet.java:15)
	at org.joda.time.convert.ConverterManager.getInstantConverter(ConverterManager.java:160)
	at org.joda.time.base.BaseDateTime.<init>(BaseDateTime.java:173)
	at org.joda.time.DateMidnight.<init>(DateMidnight.java:303)
	at org.joda.time.TestDateMidnight_Constructors.testConstructor_nullObject_nullChronology(TestDateMidnight_Constructors.java:453)

testConstructor_Object2(org.joda.time.TestDuration_Constructors)  Time elapsed: 0.001 sec  <<< ERROR!
java.lang.NullPointerException
	at org.joda.time.convert.ConverterSet.select(ConverterSet.java:15)
	at org.joda.time.convert.ConverterManager.getDurationConverter(ConverterManager.java:334)
	at org.joda.time.base.BaseDuration.<init>(BaseDuration.java:104)
	at org.joda.time.Duration.<init>(Duration.java:210)
	at org.joda.time.TestDuration_Constructors.testConstructor_Object2(TestDuration_Constructors.java:229)

testConstructor_nullObject_DateTimeZone(org.joda.time.TestLocalDateTime_Constructors)  Time elapsed: 0 sec  <<< ERROR!
java.lang.NullPointerException
	at org.joda.time.convert.ConverterSet.select(ConverterSet.java:15)
	at org.joda.time.convert.ConverterManager.getPartialConverter(ConverterManager.java:247)
	at org.joda.time.LocalDateTime.<init>(LocalDateTime.java:380)
	at org.joda.time.TestLocalDateTime_Constructors.testConstructor_nullObject_DateTimeZone(TestLocalDateTime_Constructors.java:541)

testConstructor_nullObject_nullDateTimeZone(org.joda.time.TestLocalDateTime_Constructors)  Time elapsed: 0.001 sec  <<< ERROR!
java.lang.NullPointerException
	at org.joda.time.convert.ConverterSet.select(ConverterSet.java:15)
	at org.joda.time.convert.ConverterManager.getPartialConverter(ConverterManager.java:247)
	at org.joda.time.LocalDateTime.<init>(LocalDateTime.java:380)
	at org.joda.time.TestLocalDateTime_Constructors.testConstructor_nullObject_nullDateTimeZone(TestLocalDateTime_Constructors.java:566)

testConstructor_nullObject(org.joda.time.TestLocalDateTime_Constructors)  Time elapsed: 0 sec  <<< ERROR!
java.lang.NullPointerException
	at org.joda.time.convert.ConverterSet.select(ConverterSet.java:15)
	at org.joda.time.convert.ConverterManager.getPartialConverter(ConverterManager.java:247)
	at org.joda.time.LocalDateTime.<init>(LocalDateTime.java:410)
	at org.joda.time.LocalDateTime.<init>(LocalDateTime.java:358)
	at org.joda.time.TestLocalDateTime_Constructors.testConstructor_nullObject(TestLocalDateTime_Constructors.java:368)

testConstructor_nullObject_Chronology(org.joda.time.TestLocalDateTime_Constructors)  Time elapsed: 0.001 sec  <<< ERROR!
java.lang.NullPointerException
	at org.joda.time.convert.ConverterSet.select(ConverterSet.java:15)
	at org.joda.time.convert.ConverterManager.getPartialConverter(ConverterManager.java:247)
	at org.joda.time.LocalDateTime.<init>(LocalDateTime.java:410)
	at org.joda.time.TestLocalDateTime_Constructors.testConstructor_nullObject_Chronology(TestLocalDateTime_Constructors.java:633)

testConstructor_nullObject_nullChronology(org.joda.time.TestLocalDateTime_Constructors)  Time elapsed: 0 sec  <<< ERROR!
java.lang.NullPointerException
	at org.joda.time.convert.ConverterSet.select(ConverterSet.java:15)
	at org.joda.time.convert.ConverterManager.getPartialConverter(ConverterManager.java:247)
	at org.joda.time.LocalDateTime.<init>(LocalDateTime.java:410)
	at org.joda.time.TestLocalDateTime_Constructors.testConstructor_nullObject_nullChronology(TestLocalDateTime_Constructors.java:658)

testConstructor_nullObject_DateTimeZone(org.joda.time.TestLocalDate_Constructors)  Time elapsed: 0 sec  <<< ERROR!
java.lang.NullPointerException
	at org.joda.time.convert.ConverterSet.select(ConverterSet.java:15)
	at org.joda.time.convert.ConverterManager.getPartialConverter(ConverterManager.java:247)
	at org.joda.time.LocalDate.<init>(LocalDate.java:385)
	at org.joda.time.TestLocalDate_Constructors.testConstructor_nullObject_DateTimeZone(TestLocalDate_Constructors.java:452)

testConstructor_nullObject_nullDateTimeZone(org.joda.time.TestLocalDate_Constructors)  Time elapsed: 0.001 sec  <<< ERROR!
java.lang.NullPointerException
	at org.joda.time.convert.ConverterSet.select(ConverterSet.java:15)
	at org.joda.time.convert.ConverterManager.getPartialConverter(ConverterManager.java:247)
	at org.joda.time.LocalDate.<init>(LocalDate.java:385)
	at org.joda.time.TestLocalDate_Constructors.testConstructor_nullObject_nullDateTimeZone(TestLocalDate_Constructors.java:469)

testConstructor_nullObject(org.joda.time.TestLocalDate_Constructors)  Time elapsed: 0 sec  <<< ERROR!
java.lang.NullPointerException
	at org.joda.time.convert.ConverterSet.select(ConverterSet.java:15)
	at org.joda.time.convert.ConverterManager.getPartialConverter(ConverterManager.java:247)
	at org.joda.time.LocalDate.<init>(LocalDate.java:415)
	at org.joda.time.LocalDate.<init>(LocalDate.java:363)
	at org.joda.time.TestLocalDate_Constructors.testConstructor_nullObject(TestLocalDate_Constructors.java:325)

testConstructor_nullObject_Chronology(org.joda.time.TestLocalDate_Constructors)  Time elapsed: 0.001 sec  <<< ERROR!
java.lang.NullPointerException
	at org.joda.time.convert.ConverterSet.select(ConverterSet.java:15)
	at org.joda.time.convert.ConverterManager.getPartialConverter(ConverterManager.java:247)
	at org.joda.time.LocalDate.<init>(LocalDate.java:415)
	at org.joda.time.TestLocalDate_Constructors.testConstructor_nullObject_Chronology(TestLocalDate_Constructors.java:495)

testConstructor_nullObject_nullChronology(org.joda.time.TestLocalDate_Constructors)  Time elapsed: 0 sec  <<< ERROR!
java.lang.NullPointerException
	at org.joda.time.convert.ConverterSet.select(ConverterSet.java:15)
	at org.joda.time.convert.ConverterManager.getPartialConverter(ConverterManager.java:247)
	at org.joda.time.LocalDate.<init>(LocalDate.java:415)
	at org.joda.time.TestLocalDate_Constructors.testConstructor_nullObject_nullChronology(TestLocalDate_Constructors.java:512)

testConstructor_nullObject_DateTimeZone(org.joda.time.TestLocalTime_Constructors)  Time elapsed: 0 sec  <<< ERROR!
java.lang.NullPointerException
	at org.joda.time.convert.ConverterSet.select(ConverterSet.java:15)
	at org.joda.time.convert.ConverterManager.getPartialConverter(ConverterManager.java:247)
	at org.joda.time.LocalTime.<init>(LocalTime.java:405)
	at org.joda.time.TestLocalTime_Constructors.testConstructor_nullObject_DateTimeZone(TestLocalTime_Constructors.java:531)

testConstructor_nullObject_nullDateTimeZone(org.joda.time.TestLocalTime_Constructors)  Time elapsed: 0 sec  <<< ERROR!
java.lang.NullPointerException
	at org.joda.time.convert.ConverterSet.select(ConverterSet.java:15)
	at org.joda.time.convert.ConverterManager.getPartialConverter(ConverterManager.java:247)
	at org.joda.time.LocalTime.<init>(LocalTime.java:405)
	at org.joda.time.TestLocalTime_Constructors.testConstructor_nullObject_nullDateTimeZone(TestLocalTime_Constructors.java:550)

testConstructor_nullObject(org.joda.time.TestLocalTime_Constructors)  Time elapsed: 0 sec  <<< ERROR!
java.lang.NullPointerException
	at org.joda.time.convert.ConverterSet.select(ConverterSet.java:15)
	at org.joda.time.convert.ConverterManager.getPartialConverter(ConverterManager.java:247)
	at org.joda.time.LocalTime.<init>(LocalTime.java:431)
	at org.joda.time.LocalTime.<init>(LocalTime.java:383)
	at org.joda.time.TestLocalTime_Constructors.testConstructor_nullObject(TestLocalTime_Constructors.java:354)

testConstructor_nullObject_Chronology(org.joda.time.TestLocalTime_Constructors)  Time elapsed: 0.001 sec  <<< ERROR!
java.lang.NullPointerException
	at org.joda.time.convert.ConverterSet.select(ConverterSet.java:15)
	at org.joda.time.convert.ConverterManager.getPartialConverter(ConverterManager.java:247)
	at org.joda.time.LocalTime.<init>(LocalTime.java:431)
	at org.joda.time.TestLocalTime_Constructors.testConstructor_nullObject_Chronology(TestLocalTime_Constructors.java:583)

testConstructor_nullObject_nullChronology(org.joda.time.TestLocalTime_Constructors)  Time elapsed: 0.001 sec  <<< ERROR!
java.lang.NullPointerException
	at org.joda.time.convert.ConverterSet.select(ConverterSet.java:15)
	at org.joda.time.convert.ConverterManager.getPartialConverter(ConverterManager.java:247)
	at org.joda.time.LocalTime.<init>(LocalTime.java:431)
	at org.joda.time.TestLocalTime_Constructors.testConstructor_nullObject_nullChronology(TestLocalTime_Constructors.java:602)

testConstructor_Object2(org.joda.time.TestPeriod_Constructors)  Time elapsed: 0 sec  <<< ERROR!
java.lang.NullPointerException
	at org.joda.time.convert.ConverterSet.select(ConverterSet.java:15)
	at org.joda.time.convert.ConverterManager.getPeriodConverter(ConverterManager.java:421)
	at org.joda.time.base.BasePeriod.<init>(BasePeriod.java:272)
	at org.joda.time.Period.<init>(Period.java:674)
	at org.joda.time.TestPeriod_Constructors.testConstructor_Object2(TestPeriod_Constructors.java:1158)

testConstructor_Object_PeriodType2(org.joda.time.TestPeriod_Constructors)  Time elapsed: 0 sec  <<< ERROR!
java.lang.NullPointerException
	at org.joda.time.convert.ConverterSet.select(ConverterSet.java:15)
	at org.joda.time.convert.ConverterManager.getPeriodConverter(ConverterManager.java:421)
	at org.joda.time.base.BasePeriod.<init>(BasePeriod.java:272)
	at org.joda.time.Period.<init>(Period.java:691)
	at org.joda.time.TestPeriod_Constructors.testConstructor_Object_PeriodType2(TestPeriod_Constructors.java:1215)

testConstructor_Object2(org.joda.time.TestMutablePeriod_Constructors)  Time elapsed: 0 sec  <<< ERROR!
java.lang.NullPointerException
	at org.joda.time.convert.ConverterSet.select(ConverterSet.java:15)
	at org.joda.time.convert.ConverterManager.getPeriodConverter(ConverterManager.java:421)
	at org.joda.time.base.BasePeriod.<init>(BasePeriod.java:272)
	at org.joda.time.MutablePeriod.<init>(MutablePeriod.java:374)
	at org.joda.time.TestMutablePeriod_Constructors.testConstructor_Object2(TestMutablePeriod_Constructors.java:840)

testConstructor_Object_PeriodType2(org.joda.time.TestMutablePeriod_Constructors)  Time elapsed: 0 sec  <<< ERROR!
java.lang.NullPointerException
	at org.joda.time.convert.ConverterSet.select(ConverterSet.java:15)
	at org.joda.time.convert.ConverterManager.getPeriodConverter(ConverterManager.java:421)
	at org.joda.time.base.BasePeriod.<init>(BasePeriod.java:272)
	at org.joda.time.MutablePeriod.<init>(MutablePeriod.java:391)
	at org.joda.time.TestMutablePeriod_Constructors.testConstructor_Object_PeriodType2(TestMutablePeriod_Constructors.java:897)

testConstructor_nullObject(org.joda.time.TestTimeOfDay_Constructors)  Time elapsed: 0.001 sec  <<< ERROR!
java.lang.NullPointerException
	at org.joda.time.convert.ConverterSet.select(ConverterSet.java:15)
	at org.joda.time.convert.ConverterManager.getPartialConverter(ConverterManager.java:247)
	at org.joda.time.base.BasePartial.<init>(BasePartial.java:159)
	at org.joda.time.TimeOfDay.<init>(TimeOfDay.java:277)
	at org.joda.time.TestTimeOfDay_Constructors.testConstructor_nullObject(TestTimeOfDay_Constructors.java:343)

testConstructor_nullObject_Chronology(org.joda.time.TestTimeOfDay_Constructors)  Time elapsed: 0 sec  <<< ERROR!
java.lang.NullPointerException
	at org.joda.time.convert.ConverterSet.select(ConverterSet.java:15)
	at org.joda.time.convert.ConverterManager.getPartialConverter(ConverterManager.java:247)
	at org.joda.time.base.BasePartial.<init>(BasePartial.java:159)
	at org.joda.time.TimeOfDay.<init>(TimeOfDay.java:302)
	at org.joda.time.TestTimeOfDay_Constructors.testConstructor_nullObject_Chronology(TestTimeOfDay_Constructors.java:480)

testConstructor_nullObject_nullChronology(org.joda.time.TestTimeOfDay_Constructors)  Time elapsed: 0 sec  <<< ERROR!
java.lang.NullPointerException
	at org.joda.time.convert.ConverterSet.select(ConverterSet.java:15)
	at org.joda.time.convert.ConverterManager.getPartialConverter(ConverterManager.java:247)
	at org.joda.time.base.BasePartial.<init>(BasePartial.java:159)
	at org.joda.time.TimeOfDay.<init>(TimeOfDay.java:302)
	at org.joda.time.TestTimeOfDay_Constructors.testConstructor_nullObject_nullChronology(TestTimeOfDay_Constructors.java:505)

testConstructor_nullObject(org.joda.time.TestYearMonthDay_Constructors)  Time elapsed: 0.001 sec  <<< ERROR!
java.lang.NullPointerException
	at org.joda.time.convert.ConverterSet.select(ConverterSet.java:15)
	at org.joda.time.convert.ConverterManager.getPartialConverter(ConverterManager.java:247)
	at org.joda.time.base.BasePartial.<init>(BasePartial.java:159)
	at org.joda.time.YearMonthDay.<init>(YearMonthDay.java:231)
	at org.joda.time.TestYearMonthDay_Constructors.testConstructor_nullObject(TestYearMonthDay_Constructors.java:242)

testConstructor_nullObject_Chronology(org.joda.time.TestYearMonthDay_Constructors)  Time elapsed: 0.001 sec  <<< ERROR!
java.lang.NullPointerException
	at org.joda.time.convert.ConverterSet.select(ConverterSet.java:15)
	at org.joda.time.convert.ConverterManager.getPartialConverter(ConverterManager.java:247)
	at org.joda.time.base.BasePartial.<init>(BasePartial.java:159)
	at org.joda.time.YearMonthDay.<init>(YearMonthDay.java:256)
	at org.joda.time.TestYearMonthDay_Constructors.testConstructor_nullObject_Chronology(TestYearMonthDay_Constructors.java:342)

testConstructor_nullObject_nullChronology(org.joda.time.TestYearMonthDay_Constructors)  Time elapsed: 0.001 sec  <<< ERROR!
java.lang.NullPointerException
	at org.joda.time.convert.ConverterSet.select(ConverterSet.java:15)
	at org.joda.time.convert.ConverterManager.getPartialConverter(ConverterManager.java:247)
	at org.joda.time.base.BasePartial.<init>(BasePartial.java:159)
	at org.joda.time.YearMonthDay.<init>(YearMonthDay.java:256)
	at org.joda.time.TestYearMonthDay_Constructors.testConstructor_nullObject_nullChronology(TestYearMonthDay_Constructors.java:365)

testConstructor_nullObject(org.joda.time.TestYearMonth_Constructors)  Time elapsed: 0.001 sec  <<< ERROR!
java.lang.NullPointerException
	at org.joda.time.convert.ConverterSet.select(ConverterSet.java:15)
	at org.joda.time.convert.ConverterManager.getPartialConverter(ConverterManager.java:247)
	at org.joda.time.base.BasePartial.<init>(BasePartial.java:159)
	at org.joda.time.YearMonth.<init>(YearMonth.java:289)
	at org.joda.time.TestYearMonth_Constructors.testConstructor_nullObject(TestYearMonth_Constructors.java:246)

testConstructor_nullObject_Chronology(org.joda.time.TestYearMonth_Constructors)  Time elapsed: 0.001 sec  <<< ERROR!
java.lang.NullPointerException
	at org.joda.time.convert.ConverterSet.select(ConverterSet.java:15)
	at org.joda.time.convert.ConverterManager.getPartialConverter(ConverterManager.java:247)
	at org.joda.time.base.BasePartial.<init>(BasePartial.java:159)
	at org.joda.time.YearMonth.<init>(YearMonth.java:311)
	at org.joda.time.TestYearMonth_Constructors.testConstructor_nullObject_Chronology(TestYearMonth_Constructors.java:318)

testConstructor_nullObject_nullChronology(org.joda.time.TestYearMonth_Constructors)  Time elapsed: 0.001 sec  <<< ERROR!
java.lang.NullPointerException
	at org.joda.time.convert.ConverterSet.select(ConverterSet.java:15)
	at org.joda.time.convert.ConverterManager.getPartialConverter(ConverterManager.java:247)
	at org.joda.time.base.BasePartial.<init>(BasePartial.java:159)
	at org.joda.time.YearMonth.<init>(YearMonth.java:311)
	at org.joda.time.TestYearMonth_Constructors.testConstructor_nullObject_nullChronology(TestYearMonth_Constructors.java:339)

testConstructor_nullObject(org.joda.time.TestMonthDay_Constructors)  Time elapsed: 0.001 sec  <<< ERROR!
java.lang.NullPointerException
	at org.joda.time.convert.ConverterSet.select(ConverterSet.java:15)
	at org.joda.time.convert.ConverterManager.getPartialConverter(ConverterManager.java:247)
	at org.joda.time.base.BasePartial.<init>(BasePartial.java:159)
	at org.joda.time.MonthDay.<init>(MonthDay.java:297)
	at org.joda.time.TestMonthDay_Constructors.testConstructor_nullObject(TestMonthDay_Constructors.java:246)

testConstructor_nullObject_Chronology(org.joda.time.TestMonthDay_Constructors)  Time elapsed: 0.001 sec  <<< ERROR!
java.lang.NullPointerException
	at org.joda.time.convert.ConverterSet.select(ConverterSet.java:15)
	at org.joda.time.convert.ConverterManager.getPartialConverter(ConverterManager.java:247)
	at org.joda.time.base.BasePartial.<init>(BasePartial.java:159)
	at org.joda.time.MonthDay.<init>(MonthDay.java:319)
	at org.joda.time.TestMonthDay_Constructors.testConstructor_nullObject_Chronology(TestMonthDay_Constructors.java:318)

testConstructor_nullObject_nullChronology(org.joda.time.TestMonthDay_Constructors)  Time elapsed: 0 sec  <<< ERROR!
java.lang.NullPointerException
	at org.joda.time.convert.ConverterSet.select(ConverterSet.java:15)
	at org.joda.time.convert.ConverterManager.getPartialConverter(ConverterManager.java:247)
	at org.joda.time.base.BasePartial.<init>(BasePartial.java:159)
	at org.joda.time.MonthDay.<init>(MonthDay.java:319)
	at org.joda.time.TestMonthDay_Constructors.testConstructor_nullObject_nullChronology(TestMonthDay_Constructors.java:339)

testNullDT(org.joda.time.TestDateTimeComparator)  Time elapsed: 0.001 sec  <<< ERROR!
java.lang.NullPointerException
	at org.joda.time.convert.ConverterSet.select(ConverterSet.java:15)
	at org.joda.time.convert.ConverterManager.getInstantConverter(ConverterManager.java:160)
	at org.joda.time.DateTimeComparator.compare(DateTimeComparator.java:192)
	at org.joda.time.TestDateTimeComparator.testNullDT(TestDateTimeComparator.java:883)

testGetInstantConverter(org.joda.time.convert.TestConverterManager)  Time elapsed: 0 sec  <<< ERROR!
java.lang.NullPointerException
	at org.joda.time.convert.ConverterSet.select(ConverterSet.java:15)
	at org.joda.time.convert.ConverterManager.getInstantConverter(ConverterManager.java:160)
	at org.joda.time.convert.TestConverterManager.testGetInstantConverter(TestConverterManager.java:147)

testGetInstantConverterRemovedNull(org.joda.time.convert.TestConverterManager)  Time elapsed: 0.001 sec  <<< ERROR!
java.lang.NullPointerException
	at org.joda.time.convert.ConverterSet.select(ConverterSet.java:15)
	at org.joda.time.convert.ConverterManager.getInstantConverter(ConverterManager.java:160)
	at org.joda.time.convert.TestConverterManager.testGetInstantConverterRemovedNull(TestConverterManager.java:160)

testGetDurationConverter(org.joda.time.convert.TestConverterManager)  Time elapsed: 0 sec  <<< ERROR!
java.lang.NullPointerException
	at org.joda.time.convert.ConverterSet.select(ConverterSet.java:15)
	at org.joda.time.convert.ConverterManager.getDurationConverter(ConverterManager.java:334)
	at org.joda.time.convert.TestConverterManager.testGetDurationConverter(TestConverterManager.java:556)

testGetDurationConverterRemovedNull(org.joda.time.convert.TestConverterManager)  Time elapsed: 0 sec  <<< ERROR!
java.lang.NullPointerException
	at org.joda.time.convert.ConverterSet.select(ConverterSet.java:15)
	at org.joda.time.convert.ConverterManager.getDurationConverter(ConverterManager.java:334)
	at org.joda.time.convert.TestConverterManager.testGetDurationConverterRemovedNull(TestConverterManager.java:569)

testGetPeriodConverter(org.joda.time.convert.TestConverterManager)  Time elapsed: 0.001 sec  <<< ERROR!
java.lang.NullPointerException
	at org.joda.time.convert.ConverterSet.select(ConverterSet.java:15)
	at org.joda.time.convert.ConverterManager.getPeriodConverter(ConverterManager.java:421)
	at org.joda.time.convert.TestConverterManager.testGetPeriodConverter(TestConverterManager.java:704)

testGetPeriodConverterRemovedNull(org.joda.time.convert.TestConverterManager)  Time elapsed: 0 sec  <<< ERROR!
java.lang.NullPointerException
	at org.joda.time.convert.ConverterSet.select(ConverterSet.java:15)
	at org.joda.time.convert.ConverterManager.getPeriodConverter(ConverterManager.java:421)
	at org.joda.time.convert.TestConverterManager.testGetPeriodConverterRemovedNull(TestConverterManager.java:717)

testGetIntervalConverter(org.joda.time.convert.TestConverterManager)  Time elapsed: 0 sec  <<< ERROR!
java.lang.NullPointerException
	at org.joda.time.convert.ConverterSet.select(ConverterSet.java:15)
	at org.joda.time.convert.ConverterManager.getIntervalConverter(ConverterManager.java:508)
	at org.joda.time.convert.TestConverterManager.testGetIntervalConverter(TestConverterManager.java:849)

testGetIntervalConverterRemovedNull(org.joda.time.convert.TestConverterManager)  Time elapsed: 0.001 sec  <<< ERROR!
java.lang.NullPointerException
	at org.joda.time.convert.ConverterSet.select(ConverterSet.java:15)
	at org.joda.time.convert.ConverterManager.getIntervalConverter(ConverterManager.java:508)
	at org.joda.time.convert.TestConverterManager.testGetIntervalConverterRemovedNull(TestConverterManager.java:866)

testGetPartialConverter(org.joda.time.convert.TestConverterManager)  Time elapsed: 0.001 sec  <<< ERROR!
java.lang.NullPointerException
	at org.joda.time.convert.ConverterSet.select(ConverterSet.java:15)
	at org.joda.time.convert.ConverterManager.getPartialConverter(ConverterManager.java:247)
	at org.joda.time.convert.TestConverterManager.testGetPartialConverter(TestConverterManager.java:352)

testGetPartialConverterRemovedNull(org.joda.time.convert.TestConverterManager)  Time elapsed: 0 sec  <<< ERROR!
java.lang.NullPointerException
	at org.joda.time.convert.ConverterSet.select(ConverterSet.java:15)
	at org.joda.time.convert.ConverterManager.getPartialConverter(ConverterManager.java:247)
	at org.joda.time.convert.TestConverterManager.testGetPartialConverterRemovedNull(TestConverterManager.java:365)

testBigHashtable(org.joda.time.convert.TestConverterSet)  Time elapsed: 0.001 sec  <<< ERROR!
java.lang.NullPointerException
	at org.joda.time.convert.ConverterSet.select(ConverterSet.java:15)
	at org.joda.time.convert.TestConverterSet.testBigHashtable(TestConverterSet.java:100)


Results :

Tests in error: 
  org.joda.time.TestDateMidnight_Constructors#testConstructor_nullObject NullPointerException
  org.joda.time.TestDateMidnight_Constructors#testConstructor_nullObject_Chronology NullPointerException
  org.joda.time.TestDateMidnight_Constructors#testConstructor_nullObject_DateTimeZone NullPointerException
  org.joda.time.TestDateMidnight_Constructors#testConstructor_nullObject_nullChronology NullPointerException
  org.joda.time.TestDateMidnight_Constructors#testConstructor_nullObject_nullDateTimeZone NullPointerException
  org.joda.time.TestDateTimeComparator#testNullDT NullPointerException
  org.joda.time.TestDateTime_Constructors#testConstructor_nullObject NullPointerException
  org.joda.time.TestDateTime_Constructors#testConstructor_nullObject_Chronology NullPointerException
  org.joda.time.TestDateTime_Constructors#testConstructor_nullObject_DateTimeZone NullPointerException
  org.joda.time.TestDateTime_Constructors#testConstructor_nullObject_nullChronology NullPointerException
  org.joda.time.TestDateTime_Constructors#testConstructor_nullObject_nullDateTimeZone NullPointerException
  org.joda.time.TestDuration_Constructors#testConstructor_Object2 NullPointerException
  org.joda.time.TestInstant_Constructors#testConstructor_nullObject NullPointerException
  org.joda.time.TestLocalDateTime_Constructors#testConstructor_nullObject NullPointerException
  org.joda.time.TestLocalDateTime_Constructors#testConstructor_nullObject_Chronology NullPointerException
  org.joda.time.TestLocalDateTime_Constructors#testConstructor_nullObject_DateTimeZone NullPointerException
  org.joda.time.TestLocalDateTime_Constructors#testConstructor_nullObject_nullChronology NullPointerException
  org.joda.time.TestLocalDateTime_Constructors#testConstructor_nullObject_nullDateTimeZone NullPointerException
  org.joda.time.TestLocalDate_Constructors#testConstructor_nullObject NullPointerException
  org.joda.time.TestLocalDate_Constructors#testConstructor_nullObject_Chronology NullPointerException
  org.joda.time.TestLocalDate_Constructors#testConstructor_nullObject_DateTimeZone NullPointerException
  org.joda.time.TestLocalDate_Constructors#testConstructor_nullObject_nullChronology NullPointerException
  org.joda.time.TestLocalDate_Constructors#testConstructor_nullObject_nullDateTimeZone NullPointerException
  org.joda.time.TestLocalTime_Constructors#testConstructor_nullObject NullPointerException
  org.joda.time.TestLocalTime_Constructors#testConstructor_nullObject_Chronology NullPointerException
  org.joda.time.TestLocalTime_Constructors#testConstructor_nullObject_DateTimeZone NullPointerException
  org.joda.time.TestLocalTime_Constructors#testConstructor_nullObject_nullChronology NullPointerException
  org.joda.time.TestLocalTime_Constructors#testConstructor_nullObject_nullDateTimeZone NullPointerException
  org.joda.time.TestMonthDay_Constructors#testConstructor_nullObject NullPointerException
  org.joda.time.TestMonthDay_Constructors#testConstructor_nullObject_Chronology NullPointerException
  org.joda.time.TestMonthDay_Constructors#testConstructor_nullObject_nullChronology NullPointerException
  org.joda.time.TestMutableDateTime_Constructors#testConstructor_nullObject NullPointerException
  org.joda.time.TestMutableDateTime_Constructors#testConstructor_nullObject_Chronology NullPointerException
  org.joda.time.TestMutableDateTime_Constructors#testConstructor_nullObject_DateTimeZone NullPointerException
  org.joda.time.TestMutableDateTime_Constructors#testConstructor_nullObject_nullChronology NullPointerException
  org.joda.time.TestMutableDateTime_Constructors#testConstructor_nullObject_nullDateTimeZone NullPointerException
  org.joda.time.TestMutablePeriod_Constructors#testConstructor_Object2 NullPointerException
  org.joda.time.TestMutablePeriod_Constructors#testConstructor_Object_PeriodType2 NullPointerException
  org.joda.time.TestPeriod_Constructors#testConstructor_Object2 NullPointerException
  org.joda.time.TestPeriod_Constructors#testConstructor_Object_PeriodType2 NullPointerException
  org.joda.time.TestTimeOfDay_Constructors#testConstructor_nullObject NullPointerException
  org.joda.time.TestTimeOfDay_Constructors#testConstructor_nullObject_Chronology NullPointerException
  org.joda.time.TestTimeOfDay_Constructors#testConstructor_nullObject_nullChronology NullPointerException
  org.joda.time.TestYearMonthDay_Constructors#testConstructor_nullObject NullPointerException
  org.joda.time.TestYearMonthDay_Constructors#testConstructor_nullObject_Chronology NullPointerException
  org.joda.time.TestYearMonthDay_Constructors#testConstructor_nullObject_nullChronology NullPointerException
  org.joda.time.TestYearMonth_Constructors#testConstructor_nullObject NullPointerException
  org.joda.time.TestYearMonth_Constructors#testConstructor_nullObject_Chronology NullPointerException
  org.joda.time.TestYearMonth_Constructors#testConstructor_nullObject_nullChronology NullPointerException
  org.joda.time.convert.TestConverterManager#testGetDurationConverter NullPointerException
  org.joda.time.convert.TestConverterManager#testGetDurationConverterRemovedNull NullPointerException
  org.joda.time.convert.TestConverterManager#testGetInstantConverter NullPointerException
  org.joda.time.convert.TestConverterManager#testGetInstantConverterRemovedNull NullPointerException
  org.joda.time.convert.TestConverterManager#testGetIntervalConverter NullPointerException
  org.joda.time.convert.TestConverterManager#testGetIntervalConverterRemovedNull NullPointerException
  org.joda.time.convert.TestConverterManager#testGetPartialConverter NullPointerException
  org.joda.time.convert.TestConverterManager#testGetPartialConverterRemovedNull NullPointerException
  org.joda.time.convert.TestConverterManager#testGetPeriodConverter NullPointerException
  org.joda.time.convert.TestConverterManager#testGetPeriodConverterRemovedNull NullPointerException
  org.joda.time.convert.TestConverterSet#testBigHashtable NullPointerException

Tests run: 4157, Failures: 0, Errors: 60, Skipped: 0

[INFO] ------------------------------------------------------------------------
[INFO] BUILD FAILURE
[INFO] ------------------------------------------------------------------------
[INFO] Total time: 15.069s
[INFO] Finished at: Thu Aug 06 03:16:22 BST 2015
[INFO] Final Memory: 8M/207M
[INFO] ------------------------------------------------------------------------
[ERROR] Failed to execute goal org.apache.maven.plugins:maven-surefire-plugin:2.18.1:test (default-test) on project joda-time: There are test failures.
[ERROR] 
[ERROR] Please refer to /home/perham/Study/LittleDarwin/Cases/joda-time-2.8.1/target/surefire-reports for the individual test results.
[ERROR] -> [Help 1]
[ERROR] 
[ERROR] To see the full stack trace of the errors, re-run Maven with the -e switch.
[ERROR] Re-run Maven using the -X switch to enable full debug logging.
[ERROR] 
[ERROR] For more information about the errors and possible solutions, please read the following articles:
[ERROR] [Help 1] http://cwiki.apache.org/confluence/display/MAVEN/MojoFailureException
